maven-notifications mailing list archives

Site index · List index
Message view « Date » · « Thread »
Top « Date » · « Thread »
From Apache Jenkins Server <jenk...@builds.apache.org>
Subject Build failed in Jenkins: maven-plugins-windows #1731
Date Tue, 23 Aug 2016 04:56:59 GMT
See <https://builds.apache.org/job/maven-plugins-windows/1731/>

------------------------------------------
Started by user hboutemy
[EnvInject] - Loading node environment variables.
Building remotely on windows2 (Windows) in workspace <https://builds.apache.org/job/maven-plugins-windows/ws/>
Updating http://svn.apache.org/repos/asf/maven/plugins/trunk at revision '2016-08-22T21:55:26.459
-0700'
At revision 1757305

No changes for http://svn.apache.org/repos/asf/maven/plugins/trunk since the previous build
Parsing POMs
Modules changed, recalculating dependency graph
Established TCP socket on 50074
maven3-agent.jar already up to date
maven3-interceptor.jar already up to date
maven3-interceptor-commons.jar already up to date
[maven-plugins-windows] $ f:\jenkins\tools\java\latest-1.7-64/bin/java -Xmx1500m -Xms256m
-XX:MaxPermSize=512m -cp f:\jenkins\jenkins-slave\maven3-agent.jar;F:\jenkins\tools\maven\apache-maven-3.0.5\boot\plexus-classworlds-2.4.jar
org.jvnet.hudson.maven3.agent.Maven3Main F:\\jenkins\\tools\\maven\\apache-maven-3.0.5 F:\jenkins\jenkins-slave\slave.jar
f:\jenkins\jenkins-slave\maven3-interceptor.jar f:\jenkins\jenkins-slave\maven3-interceptor-commons.jar
50074
ERROR: Failed to parse POMs
java.io.IOException: Cannot run program "f:\jenkins\tools\java\latest-1.7-64/bin/java" (in
directory "<https://builds.apache.org/job/maven-plugins-windows/ws/")>: CreateProcess
error=2, The system cannot find the file specified
	at java.lang.ProcessBuilder.start(Unknown Source)
	at hudson.Proc$LocalProc.<init>(Proc.java:240)
	at hudson.Proc$LocalProc.<init>(Proc.java:212)
	at hudson.Launcher$LocalLauncher.launch(Launcher.java:815)
	at hudson.Launcher$ProcStarter.start(Launcher.java:381)
	at hudson.Launcher$RemoteLaunchCallable.call(Launcher.java:1148)
	at hudson.Launcher$RemoteLaunchCallable.call(Launcher.java:1113)
	at hudson.remoting.UserRequest.perform(UserRequest.java:118)
	at hudson.remoting.UserRequest.perform(UserRequest.java:48)
	at hudson.remoting.Request$2.run(Request.java:328)
	at hudson.remoting.InterceptingExecutorService$1.call(InterceptingExecutorService.java:72)
	at java.util.concurrent.FutureTask.run(Unknown Source)
	at java.util.concurrent.ThreadPoolExecutor.runWorker(Unknown Source)
	at java.util.concurrent.ThreadPoolExecutor$Worker.run(Unknown Source)
	at hudson.remoting.Engine$1$1.run(Engine.java:63)
	at java.lang.Thread.run(Unknown Source)
	at ......remote call to windows2(Native Method)
	at hudson.remoting.Channel.attachCallSiteStackTrace(Channel.java:1416)
	at hudson.remoting.UserResponse.retrieve(UserRequest.java:253)
	at hudson.remoting.Channel.call(Channel.java:781)
	at hudson.Launcher$RemoteLauncher.launch(Launcher.java:928)
	at hudson.Launcher$ProcStarter.start(Launcher.java:381)
	at hudson.maven.AbstractMavenProcessFactory.newProcess(AbstractMavenProcessFactory.java:281)
	at hudson.maven.ProcessCache.get(ProcessCache.java:236)
	at hudson.maven.MavenModuleSetBuild$MavenModuleSetBuildExecution.doRun(MavenModuleSetBuild.java:778)
	at hudson.model.AbstractBuild$AbstractBuildExecution.run(AbstractBuild.java:534)
	at hudson.model.Run.execute(Run.java:1741)
	at hudson.maven.MavenModuleSetBuild.run(MavenModuleSetBuild.java:531)
	at hudson.model.ResourceController.execute(ResourceController.java:98)
	at hudson.model.Executor.run(Executor.java:410)
Caused by: java.io.IOException: CreateProcess error=2, The system cannot find the file specified
	at java.lang.ProcessImpl.create(Native Method)
	at java.lang.ProcessImpl.<init>(Unknown Source)
	at java.lang.ProcessImpl.start(Unknown Source)
	at java.lang.ProcessBuilder.start(Unknown Source)
	at hudson.Proc$LocalProc.<init>(Proc.java:240)
	at hudson.Proc$LocalProc.<init>(Proc.java:212)
	at hudson.Launcher$LocalLauncher.launch(Launcher.java:815)
	at hudson.Launcher$ProcStarter.start(Launcher.java:381)
	at hudson.Launcher$RemoteLaunchCallable.call(Launcher.java:1148)
	at hudson.Launcher$RemoteLaunchCallable.call(Launcher.java:1113)
	at hudson.remoting.UserRequest.perform(UserRequest.java:118)
	at hudson.remoting.UserRequest.perform(UserRequest.java:48)
	at hudson.remoting.Request$2.run(Request.java:328)
	at hudson.remoting.InterceptingExecutorService$1.call(InterceptingExecutorService.java:72)
	at java.util.concurrent.FutureTask.run(Unknown Source)
	at java.util.concurrent.ThreadPoolExecutor.runWorker(Unknown Source)
	at java.util.concurrent.ThreadPoolExecutor$Worker.run(Unknown Source)
	at hudson.remoting.Engine$1$1.run(Engine.java:63)
	at java.lang.Thread.run(Unknown Source)
[WARNINGS] Skipping publisher since build result is FAILURE

Mime
View raw message