maven-notifications mailing list archives

Site index · List index
Message view « Date » · « Thread »
Top « Date » · « Thread »
From Apache Jenkins Server <jenk...@builds.apache.org>
Subject Build failed in Jenkins: maven-archetype-m2 #179
Date Sun, 14 Aug 2016 07:42:16 GMT
See <https://builds.apache.org/job/maven-archetype-m2/179/changes>

Changes:

[paranoiabla] Update parent pom to version 27.

[paranoiabla] Archetype-common depends on archetype-packaging.

[paranoiabla] Add a null-pointer check for invoker result.

------------------------------------------
[...truncated 194 lines...]
Downloading: http://repo1.maven.org/maven2/org/apache/maven/maven-parent/4/maven-parent-4.pom
9K downloaded  (maven-parent-4.pom)
Downloading: http://repo1.maven.org/maven2/org/apache/maven/maven-plugin-registry/2.0.9/maven-plugin-registry-2.0.9.pom
1K downloaded  (maven-plugin-registry-2.0.9.pom)
Downloading: http://repo1.maven.org/maven2/org/apache/maven/maven-core/2.0.9/maven-core-2.0.9.pom
7K downloaded  (maven-core-2.0.9.pom)
Downloading: http://repo1.maven.org/maven2/org/apache/maven/wagon/wagon-file/1.0-beta-2/wagon-file-1.0-beta-2.pom
637b downloaded  (wagon-file-1.0-beta-2.pom)
Downloading: http://repo1.maven.org/maven2/org/apache/maven/wagon/wagon-providers/1.0-beta-2/wagon-providers-1.0-beta-2.pom
1K downloaded  (wagon-providers-1.0-beta-2.pom)
Downloading: http://repo1.maven.org/maven2/org/apache/maven/maven-plugin-parameter-documenter/2.0.9/maven-plugin-parameter-documenter-2.0.9.pom
1K downloaded  (maven-plugin-parameter-documenter-2.0.9.pom)
Downloading: http://repo1.maven.org/maven2/org/apache/maven/wagon/wagon-webdav/1.0-beta-2/wagon-webdav-1.0-beta-2.pom
1K downloaded  (wagon-webdav-1.0-beta-2.pom)
Downloading: http://repo1.maven.org/maven2/slide/slide-webdavlib/2.1/slide-webdavlib-2.1.pom
648b downloaded  (slide-webdavlib-2.1.pom)
Downloading: http://repo1.maven.org/maven2/commons-httpclient/commons-httpclient/2.0.2/commons-httpclient-2.0.2.pom
6K downloaded  (commons-httpclient-2.0.2.pom)
Downloading: http://repo1.maven.org/maven2/commons-logging/commons-logging/1.0.3/commons-logging-1.0.3.pom
866b downloaded  (commons-logging-1.0.3.pom)
Downloading: http://repo1.maven.org/maven2/jdom/jdom/1.0/jdom-1.0.pom
1K downloaded  (jdom-1.0.pom)
Downloading: http://repo1.maven.org/maven2/de/zeigermann/xml/xml-im-exporter/1.1/xml-im-exporter-1.1.pom
248b downloaded  (xml-im-exporter-1.1.pom)
Downloading: http://repo1.maven.org/maven2/commons-logging/commons-logging/1.0.4/commons-logging-1.0.4.pom
5K downloaded  (commons-logging-1.0.4.pom)
Downloading: http://repo1.maven.org/maven2/org/apache/maven/wagon/wagon-http-lightweight/1.0-beta-2/wagon-http-lightweight-1.0-beta-2.pom
1K downloaded  (wagon-http-lightweight-1.0-beta-2.pom)
Downloading: http://repo1.maven.org/maven2/org/apache/maven/wagon/wagon-http-shared/1.0-beta-2/wagon-http-shared-1.0-beta-2.pom
845b downloaded  (wagon-http-shared-1.0-beta-2.pom)
Downloading: http://repo1.maven.org/maven2/jtidy/jtidy/4aug2000r7-dev/jtidy-4aug2000r7-dev.pom
1K downloaded  (jtidy-4aug2000r7-dev.pom)
Downloading: http://repo1.maven.org/maven2/xml-apis/xml-apis/1.0.b2/xml-apis-1.0.b2.pom
2K downloaded  (xml-apis-1.0.b2.pom)
Downloading: http://repo1.maven.org/maven2/org/apache/maven/reporting/maven-reporting-api/2.0.9/maven-reporting-api-2.0.9.pom
1K downloaded  (maven-reporting-api-2.0.9.pom)
Downloading: http://repo1.maven.org/maven2/org/apache/maven/reporting/maven-reporting/2.0.9/maven-reporting-2.0.9.pom
1K downloaded  (maven-reporting-2.0.9.pom)
Downloading: http://repo1.maven.org/maven2/org/apache/maven/doxia/doxia-sink-api/1.0-alpha-10/doxia-sink-api-1.0-alpha-10.pom
1K downloaded  (doxia-sink-api-1.0-alpha-10.pom)
Downloading: http://repo1.maven.org/maven2/org/apache/maven/doxia/doxia/1.0-alpha-10/doxia-1.0-alpha-10.pom
8K downloaded  (doxia-1.0-alpha-10.pom)
Downloading: http://repo1.maven.org/maven2/org/apache/maven/maven-parent/6/maven-parent-6.pom
19K downloaded  (maven-parent-6.pom)
Downloading: http://repo1.maven.org/maven2/org/apache/maven/maven-error-diagnostics/2.0.9/maven-error-diagnostics-2.0.9.pom
1K downloaded  (maven-error-diagnostics-2.0.9.pom)
Downloading: http://repo1.maven.org/maven2/commons-cli/commons-cli/1.0/commons-cli-1.0.pom
2K downloaded  (commons-cli-1.0.pom)
Downloading: http://repo1.maven.org/maven2/org/apache/maven/wagon/wagon-ssh-external/1.0-beta-2/wagon-ssh-external-1.0-beta-2.pom
1K downloaded  (wagon-ssh-external-1.0-beta-2.pom)
Downloading: http://repo1.maven.org/maven2/org/apache/maven/wagon/wagon-ssh-common/1.0-beta-2/wagon-ssh-common-1.0-beta-2.pom
851b downloaded  (wagon-ssh-common-1.0-beta-2.pom)
Downloading: http://repo1.maven.org/maven2/org/codehaus/plexus/plexus-interactivity-api/1.0-alpha-4/plexus-interactivity-api-1.0-alpha-4.pom
6K downloaded  (plexus-interactivity-api-1.0-alpha-4.pom)
Downloading: http://repo1.maven.org/maven2/org/codehaus/plexus/plexus-container-default/1.0-alpha-7/plexus-container-default-1.0-alpha-7.pom
1K downloaded  (plexus-container-default-1.0-alpha-7.pom)
Downloading: http://repo1.maven.org/maven2/plexus/plexus-containers/1.0.2/plexus-containers-1.0.2.pom
471b downloaded  (plexus-containers-1.0.2.pom)
Downloading: http://repo1.maven.org/maven2/plexus/plexus-root/1.0.3/plexus-root-1.0.3.pom
5K downloaded  (plexus-root-1.0.3.pom)
Downloading: http://repo1.maven.org/maven2/plexus/plexus-utils/1.0.2/plexus-utils-1.0.2.pom
740b downloaded  (plexus-utils-1.0.2.pom)
Downloading: http://repo1.maven.org/maven2/org/apache/maven/maven-plugin-descriptor/2.0.9/maven-plugin-descriptor-2.0.9.pom
2K downloaded  (maven-plugin-descriptor-2.0.9.pom)
Downloading: http://repo1.maven.org/maven2/org/apache/maven/maven-monitor/2.0.9/maven-monitor-2.0.9.pom
1K downloaded  (maven-monitor-2.0.9.pom)
Downloading: http://repo1.maven.org/maven2/org/apache/maven/wagon/wagon-ssh/1.0-beta-2/wagon-ssh-1.0-beta-2.pom
1K downloaded  (wagon-ssh-1.0-beta-2.pom)
Downloading: http://repo1.maven.org/maven2/com/jcraft/jsch/0.1.27/jsch-0.1.27.pom
965b downloaded  (jsch-0.1.27.pom)
Downloading: http://repo1.maven.org/maven2/classworlds/classworlds/1.1/classworlds-1.1.pom
3K downloaded  (classworlds-1.1.pom)
Downloading: http://repo1.maven.org/maven2/org/apache/maven/shared/maven-dependency-tree/2.1/maven-dependency-tree-2.1.pom
6K downloaded  (maven-dependency-tree-2.1.pom)
Downloading: http://repo1.maven.org/maven2/org/apache/maven/shared/maven-shared-components/19/maven-shared-components-19.pom
6K downloaded  (maven-shared-components-19.pom)
Downloading: http://repo1.maven.org/maven2/org/codehaus/plexus/plexus-component-annotations/1.5.5/plexus-component-annotations-1.5.5.pom
815b downloaded  (plexus-component-annotations-1.5.5.pom)
Downloading: http://repo1.maven.org/maven2/org/eclipse/aether/aether-util/0.9.0.M2/aether-util-0.9.0.M2.pom
1K downloaded  (aether-util-0.9.0.M2.pom)
Downloading: http://repo1.maven.org/maven2/org/eclipse/aether/aether/0.9.0.M2/aether-0.9.0.M2.pom
27K downloaded  (aether-0.9.0.M2.pom)
Downloading: http://repo1.maven.org/maven2/org/apache/maven/shared/maven-common-artifact-filters/1.4/maven-common-artifact-filters-1.4.pom
3K downloaded  (maven-common-artifact-filters-1.4.pom)
Downloading: http://repo1.maven.org/maven2/org/apache/maven/shared/maven-shared-components/17/maven-shared-components-17.pom
8K downloaded  (maven-shared-components-17.pom)
Downloading: http://repo1.maven.org/maven2/org/apache/maven/maven-model/2.0.8/maven-model-2.0.8.pom
3K downloaded  (maven-model-2.0.8.pom)
Downloading: http://repo1.maven.org/maven2/org/apache/maven/maven/2.0.8/maven-2.0.8.pom
11K downloaded  (maven-2.0.8.pom)
Downloading: http://repo1.maven.org/maven2/org/codehaus/plexus/plexus-container-default/1.5.5/plexus-container-default-1.5.5.pom
2K downloaded  (plexus-container-default-1.5.5.pom)
Downloading: http://repo1.maven.org/maven2/commons-lang/commons-lang/2.3/commons-lang-2.3.pom
10K downloaded  (commons-lang-2.3.pom)
Downloading: http://repo1.maven.org/maven2/org/apache/maven/enforcer/enforcer-rules/1.3.1/enforcer-rules-1.3.1.pom
3K downloaded  (enforcer-rules-1.3.1.pom)
Downloading: http://repo1.maven.org/maven2/org/beanshell/bsh/2.0b4/bsh-2.0b4.pom
1K downloaded  (bsh-2.0b4.pom)
Downloading: http://repo1.maven.org/maven2/org/beanshell/beanshell/2.0b4/beanshell-2.0b4.pom
1K downloaded  (beanshell-2.0b4.pom)
Downloading: http://repo1.maven.org/maven2/org/codehaus/plexus/plexus-i18n/1.0-beta-6/plexus-i18n-1.0-beta-6.pom
771b downloaded  (plexus-i18n-1.0-beta-6.pom)
Downloading: http://repo1.maven.org/maven2/org/codehaus/plexus/plexus-components/1.1.4/plexus-components-1.1.4.pom
2K downloaded  (plexus-components-1.1.4.pom)
Downloading: http://repo1.maven.org/maven2/org/codehaus/plexus/plexus-container-default/1.0-alpha-8/plexus-container-default-1.0-alpha-8.pom
7K downloaded  (plexus-container-default-1.0-alpha-8.pom)
Downloading: http://repo1.maven.org/maven2/org/codehaus/mojo/extra-enforcer-rules/1.0-beta-3/extra-enforcer-rules-1.0-beta-3.jar
Downloading: http://repo1.maven.org/maven2/org/codehaus/plexus/plexus-utils/1.5.8/plexus-utils-1.5.8.jar
Downloading: http://repo1.maven.org/maven2/org/eclipse/aether/aether-util/0.9.0.M2/aether-util-0.9.0.M2.jar
Downloading: http://repo1.maven.org/maven2/org/beanshell/bsh/2.0b4/bsh-2.0b4.jar
Downloading: http://repo1.maven.org/maven2/org/apache/maven/shared/maven-dependency-tree/2.1/maven-dependency-tree-2.1.jar
30K downloaded  (extra-enforcer-rules-1.0-beta-3.jar)
58K downloaded  (maven-dependency-tree-2.1.jar)
130K downloaded  (aether-util-0.9.0.M2.jar)
261K downloaded  (plexus-utils-1.5.8.jar)
275K downloaded  (bsh-2.0b4.jar)
Downloading: http://repo1.maven.org/maven2/commons-lang/commons-lang/2.3/commons-lang-2.3.jar
Downloading: http://repo1.maven.org/maven2/org/apache/maven/enforcer/enforcer-api/1.3.1/enforcer-api-1.3.1.jar
Downloading: http://repo1.maven.org/maven2/org/apache/maven/shared/maven-common-artifact-filters/1.4/maven-common-artifact-filters-1.4.jar
Downloading: http://repo1.maven.org/maven2/org/codehaus/plexus/plexus-component-annotations/1.5.5/plexus-component-annotations-1.5.5.jar
30K downloaded  (maven-common-artifact-filters-1.4.jar)
9K downloaded  (enforcer-api-1.3.1.jar)
239K downloaded  (commons-lang-2.3.jar)
4K downloaded  (plexus-component-annotations-1.5.5.jar)
Downloading: http://repo1.maven.org/maven2/org/apache/maven/enforcer/enforcer-rules/1.3.1/enforcer-rules-1.3.1.jar
Downloading: http://repo1.maven.org/maven2/org/codehaus/plexus/plexus-i18n/1.0-beta-6/plexus-i18n-1.0-beta-6.jar
85K downloaded  (enforcer-rules-1.3.1.jar)
11K downloaded  (plexus-i18n-1.0-beta-6.jar)
[INFO] [enforcer:enforce {execution: enforce-bytecode-version}]
[INFO] [enforcer:enforce {execution: ban-known-bad-maven-versions}]
[WARNING] Rule 0: org.apache.maven.plugins.enforcer.RequireMavenVersion failed with message:
Maven 3.0 through 3.0.3 inclusive do not pass correct settings.xml to Maven Release Plugin.
[INFO] ------------------------------------------------------------------------
[INFO] SKIPPING Maven Archetype Testing
[INFO]    task-segment: [clean, install]
[INFO] This project has been banned from further executions due to previous failures.
[INFO] ------------------------------------------------------------------------
[INFO] ------------------------------------------------------------------------
[INFO] SKIPPING Maven Archetype Webapp Proxy
[INFO]    task-segment: [clean, install]
[INFO] This project has been banned from further executions due to previous failures.
[INFO] ------------------------------------------------------------------------
[INFO] ------------------------------------------------------------------------
[INFO] SKIPPING Maven Archetype Webapp Repository
[INFO]    task-segment: [clean, install]
[INFO] This project has been banned from further executions due to previous failures.
[INFO] ------------------------------------------------------------------------
[INFO] ------------------------------------------------------------------------
[INFO] SKIPPING Maven Archetype Models
[INFO]    task-segment: [clean, install]
[INFO] This project has been banned from further executions due to previous failures.
[INFO] ------------------------------------------------------------------------
[INFO] ------------------------------------------------------------------------
[INFO] SKIPPING Maven Archetype Catalog Model
[INFO]    task-segment: [clean, install]
[INFO] This project has been banned from further executions due to previous failures.
[INFO] ------------------------------------------------------------------------
[INFO] ------------------------------------------------------------------------
[INFO] SKIPPING Maven Archetype Descriptor Model
[INFO]    task-segment: [clean, install]
[INFO] This project has been banned from further executions due to previous failures.
[INFO] ------------------------------------------------------------------------
[INFO] ------------------------------------------------------------------------
[INFO] SKIPPING Maven Archetype Registry Model
[INFO]    task-segment: [clean, install]
[INFO] This project has been banned from further executions due to previous failures.
[INFO] ------------------------------------------------------------------------
[INFO] ------------------------------------------------------------------------
[INFO] SKIPPING Maven Archetype Packaging
[INFO]    task-segment: [clean, install]
[INFO] This project has been banned from further executions due to previous failures.
[INFO] ------------------------------------------------------------------------
[INFO] ------------------------------------------------------------------------
[INFO] SKIPPING Maven Archetype Common
[INFO]    task-segment: [clean, install]
[INFO] This project has been banned from further executions due to previous failures.
[INFO] ------------------------------------------------------------------------
[INFO] ------------------------------------------------------------------------
[INFO] SKIPPING Maven Archetype Plugin
[INFO]    task-segment: [clean, install]
[INFO] This project has been banned from further executions due to previous failures.
[INFO] ------------------------------------------------------------------------
[INFO] 
[INFO] 
[INFO] ------------------------------------------------------------------------
[INFO] Reactor Summary:
[INFO] ------------------------------------------------------------------------
[INFO] Maven Archetype ....................................... FAILED [5.882s]
[INFO] Maven Archetype Testing ............................... SKIPPED (dependency build failed
or was skipped)
[INFO] Maven Archetype Webapp Proxy .......................... SKIPPED (dependency build failed
or was skipped)
[INFO] Maven Archetype Webapp Repository ..................... SKIPPED (dependency build failed
or was skipped)
[INFO] Maven Archetype Models ................................ SKIPPED (dependency build failed
or was skipped)
[INFO] Maven Archetype Catalog Model ......................... SKIPPED (dependency build failed
or was skipped)
[INFO] Maven Archetype Descriptor Model ...................... SKIPPED (dependency build failed
or was skipped)
[INFO] Maven Archetype Registry Model ........................ SKIPPED (dependency build failed
or was skipped)
[INFO] Maven Archetype Packaging ............................. SKIPPED (dependency build failed
or was skipped)
[INFO] Maven Archetype Common ................................ SKIPPED (dependency build failed
or was skipped)
[INFO] Maven Archetype Plugin ................................ SKIPPED (dependency build failed
or was skipped)
[INFO] ------------------------------------------------------------------------
[INFO] Error for project: Maven Archetype (during install)
[INFO] ------------------------------------------------------------------------
[INFO] Some Enforcer rules have failed. Look above for specific messages explaining why the
rule failed.
[INFO] ------------------------------------------------------------------------
[INFO] Trace
org.apache.maven.lifecycle.LifecycleExecutionException: Some Enforcer rules have failed. Look
above for specific messages explaining why the rule failed.
	at org.apache.maven.lifecycle.DefaultLifecycleExecutor.executeGoals(DefaultLifecycleExecutor.java:719)
	at org.apache.maven.lifecycle.DefaultLifecycleExecutor.executeGoalWithLifecycle(DefaultLifecycleExecutor.java:556)
	at org.apache.maven.lifecycle.DefaultLifecycleExecutor.executeGoal(DefaultLifecycleExecutor.java:535)
	at org.apache.maven.lifecycle.DefaultLifecycleExecutor.executeGoalAndHandleFailures(DefaultLifecycleExecutor.java:387)
	at org.apache.maven.lifecycle.DefaultLifecycleExecutor.executeTaskSegments(DefaultLifecycleExecutor.java:348)
	at org.apache.maven.lifecycle.DefaultLifecycleExecutor.execute(DefaultLifecycleExecutor.java:180)
	at org.apache.maven.lifecycle.LifecycleExecutorInterceptor.execute(LifecycleExecutorInterceptor.java:65)
	at org.apache.maven.DefaultMaven.doExecute(DefaultMaven.java:328)
	at org.apache.maven.DefaultMaven.execute(DefaultMaven.java:138)
	at org.apache.maven.cli.MavenCli.main(MavenCli.java:362)
	at sun.reflect.NativeMethodAccessorImpl.invoke0(Native Method)
	at sun.reflect.NativeMethodAccessorImpl.invoke(NativeMethodAccessorImpl.java:57)
	at sun.reflect.DelegatingMethodAccessorImpl.invoke(DelegatingMethodAccessorImpl.java:43)
	at java.lang.reflect.Method.invoke(Method.java:606)
	at org.codehaus.classworlds.Launcher.launchEnhanced(Launcher.java:315)
	at org.codehaus.classworlds.Launcher.launch(Launcher.java:255)
	at hudson.maven.agent.Main.launch(Main.java:205)
	at hudson.maven.MavenBuilder.call(MavenBuilder.java:154)
	at hudson.maven.Maven2Builder.call(Maven2Builder.java:79)
	at hudson.maven.Maven2Builder.call(Maven2Builder.java:55)
	at hudson.remoting.UserRequest.perform(UserRequest.java:153)
	at hudson.remoting.UserRequest.perform(UserRequest.java:50)
	at hudson.remoting.Request$2.run(Request.java:332)
	at hudson.remoting.InterceptingExecutorService$1.call(InterceptingExecutorService.java:68)
	at java.util.concurrent.FutureTask.run(FutureTask.java:262)
	at java.util.concurrent.ThreadPoolExecutor.runWorker(ThreadPoolExecutor.java:1145)
	at java.util.concurrent.ThreadPoolExecutor$Worker.run(ThreadPoolExecutor.java:615)
	at java.lang.Thread.run(Thread.java:745)
Caused by: org.apache.maven.plugin.MojoExecutionException: Some Enforcer rules have failed.
Look above for specific messages explaining why the rule failed.
	at org.apache.maven.plugins.enforcer.EnforceMojo.execute(EnforceMojo.java:209)
	at org.apache.maven.plugin.DefaultPluginManager.executeMojo(DefaultPluginManager.java:490)
	at hudson.maven.agent.PluginManagerInterceptor.executeMojo(PluginManagerInterceptor.java:182)
	at org.apache.maven.lifecycle.DefaultLifecycleExecutor.executeGoals(DefaultLifecycleExecutor.java:694)
	... 27 more
[INFO] ------------------------------------------------------------------------
[INFO] BUILD ERRORS
[INFO] ------------------------------------------------------------------------
[INFO] Total time: 7 seconds
[INFO] Finished at: Sun Aug 14 07:42:01 UTC 2016
[INFO] Final Memory: 20M/317M
[INFO] ------------------------------------------------------------------------
[JENKINS] Archiving <https://builds.apache.org/job/maven-archetype-m2/ws/pom.xml> to
org.apache.maven.archetype/maven-archetype/2.5-SNAPSHOT/maven-archetype-2.5-SNAPSHOT.pom
Sending e-mails to: notifications@maven.apache.org paranoiabla@gmail.com
channel stopped

Mime
View raw message