maven-notifications mailing list archives

Site index · List index
Message view « Date » · « Thread »
Top « Date » · « Thread »
From Apache Jenkins Server <jenk...@builds.apache.org>
Subject Build failed in Jenkins: maven-plugins #7143
Date Mon, 08 Aug 2016 02:30:04 GMT
See <https://builds.apache.org/job/maven-plugins/7143/>

------------------------------------------
Started by upstream project "maven-shared" build number 2808
originally caused by:
 Started by upstream project "maven-plugins" build number 7142
 originally caused by:
  Started by upstream project "maven-shared" build number 2807
  originally caused by:
   Started by upstream project "maven-plugins" build number 7141
   originally caused by:
    Started by upstream project "maven-shared" build number 2806
    originally caused by:
     Started by upstream project "maven-plugins" build number 7140
     originally caused by:
      Started by upstream project "maven-shared" build number 2805
      originally caused by:
       Started by upstream project "maven-plugins" build number 7139
       originally caused by:
        Started by upstream project "maven-shared" build number 2804
        originally caused by:
         Started by upstream project "maven-plugins" build number 7138
         originally caused by:
          Started by upstream project "maven-shared" build number 2803
          originally caused by:
           Started by upstream project "maven-plugins" build number 7137
           originally caused by:
            (deeply nested causes)
[EnvInject] - Loading node environment variables.
Building remotely on H10 (docker Ubuntu ubuntu yahoo-not-h2) in workspace <https://builds.apache.org/job/maven-plugins/ws/>
Updating http://svn.apache.org/repos/asf/maven/plugins/trunk at revision '2016-08-08T02:28:55.233
+0000'
U         maven-deploy-plugin/src/main/java/org/apache/maven/plugins/deploy/DeployFileMojo.java
D         maven-deploy-plugin/src/it/MDEPLOY-181
A         maven-deploy-plugin/src/it/MDEPLOY-212
AU        maven-deploy-plugin/src/it/MDEPLOY-212/test-1.0.tar.gz
AU        maven-deploy-plugin/src/it/MDEPLOY-212/verify.bsh
A         maven-deploy-plugin/src/it/MDEPLOY-212/src
A         maven-deploy-plugin/src/it/MDEPLOY-212/src/main
A         maven-deploy-plugin/src/it/MDEPLOY-212/src/main/java
A         maven-deploy-plugin/src/it/MDEPLOY-212/src/main/java/org
A         maven-deploy-plugin/src/it/MDEPLOY-212/src/main/java/org/apache
A         maven-deploy-plugin/src/it/MDEPLOY-212/src/main/java/org/apache/maven
A         maven-deploy-plugin/src/it/MDEPLOY-212/src/main/java/org/apache/maven/test
AU        maven-deploy-plugin/src/it/MDEPLOY-212/src/main/java/org/apache/maven/test/HelloWorld.java
AU        maven-deploy-plugin/src/it/MDEPLOY-212/invoker.properties
AU        maven-deploy-plugin/src/it/MDEPLOY-212/pom.xml
AU        maven-deploy-plugin/src/it/MDEPLOY-212/test-1.0.zip
A         maven-deploy-plugin/src/it/MDEPLOY-213
A         maven-deploy-plugin/src/it/MDEPLOY-213/src
A         maven-deploy-plugin/src/it/MDEPLOY-213/src/main
A         maven-deploy-plugin/src/it/MDEPLOY-213/src/main/java
A         maven-deploy-plugin/src/it/MDEPLOY-213/src/main/java/org
A         maven-deploy-plugin/src/it/MDEPLOY-213/src/main/java/org/apache
A         maven-deploy-plugin/src/it/MDEPLOY-213/src/main/java/org/apache/maven
A         maven-deploy-plugin/src/it/MDEPLOY-213/src/main/java/org/apache/maven/test
AU        maven-deploy-plugin/src/it/MDEPLOY-213/src/main/java/org/apache/maven/test/HelloWorld.java
AU        maven-deploy-plugin/src/it/MDEPLOY-213/invoker.properties
AU        maven-deploy-plugin/src/it/MDEPLOY-213/pom.xml
AU        maven-deploy-plugin/src/it/MDEPLOY-213/test-1.0.zip
AU        maven-deploy-plugin/src/it/MDEPLOY-213/test-1.0.tar.gz
AU        maven-deploy-plugin/src/it/MDEPLOY-213/verify.bsh
A         maven-deploy-plugin/src/it/3rd-party-pom-with-extras
AU        maven-deploy-plugin/src/it/3rd-party-pom-with-extras/test-0.1.tar.gz
AU        maven-deploy-plugin/src/it/3rd-party-pom-with-extras/verify.bsh
AU        maven-deploy-plugin/src/it/3rd-party-pom-with-extras/test-0.1-src.tar.gz
AU        maven-deploy-plugin/src/it/3rd-party-pom-with-extras/test-0.1.pom
AU        maven-deploy-plugin/src/it/3rd-party-pom-with-extras/invoker.properties
AU        maven-deploy-plugin/src/it/3rd-party-pom-with-extras/pom.xml
AU        maven-deploy-plugin/src/it/3rd-party-pom-with-extras/test.properties
AU        maven-deploy-plugin/src/it/3rd-party-pom-with-extras/test-0.1.zip
U         maven-deploy-plugin/src/test/java/org/apache/maven/plugins/deploy/DeployFileMojoTest.java
U         maven-pmd-plugin/src/test/resources/unit/default-configuration/cpd-javascript-plugin-config.xml
U         maven-pmd-plugin/src/test/java/org/apache/maven/plugin/pmd/PmdReportTest.java
U         maven-pmd-plugin/src/test/java/org/apache/maven/plugin/pmd/stubs/InvalidFormatMavenProjectStub.java
U         maven-pmd-plugin/src/test/java/org/apache/maven/plugin/pmd/stubs/CustomConfigurationMavenProjectStub.java
U         maven-pmd-plugin/src/test/java/org/apache/maven/plugin/pmd/stubs/DefaultConfigurationMavenProjectStub.java
U         maven-pmd-plugin/src/test/java/org/apache/maven/plugin/pmd/CpdReportTest.java
U         maven-pmd-plugin/src/main/java/org/apache/maven/plugin/pmd/ViolationDetails.java
D         maven-pmd-plugin/src/main/java/org/apache/maven/plugin/pmd/rules/DummyRule.java
U         maven-pmd-plugin/src/main/java/org/apache/maven/plugin/pmd/PmdCollectingRenderer.java
U         maven-pmd-plugin/src/main/java/org/apache/maven/plugin/pmd/AbstractPmdViolationCheckMojo.java
U         maven-pmd-plugin/src/main/java/org/apache/maven/plugin/pmd/PmdReport.java
U         maven-pmd-plugin/src/main/java/org/apache/maven/plugin/pmd/CpdViolationCheckMojo.java
U         maven-pmd-plugin/src/main/java/org/apache/maven/plugin/pmd/AbstractPmdReport.java
U         maven-pmd-plugin/src/main/java/org/apache/maven/plugin/pmd/CpdReport.java
U         maven-pmd-plugin/src/main/java/org/apache/maven/plugin/pmd/PmdReportGenerator.java
U         maven-pmd-plugin/src/main/java/org/apache/maven/plugin/pmd/PmdViolationCheckMojo.java
D         maven-pmd-plugin/src/main/resources/rulesets/dummy.xml
U         maven-pmd-plugin/src/main/resources/rulesets/maven.xml
U         maven-pmd-plugin/src/site/fml/faq.fml
U         maven-pmd-plugin/src/site/apt/index.apt.vm
U         maven-pmd-plugin/src/site/apt/examples/usingRuleSets.apt.vm
U         maven-pmd-plugin/pom.xml
U         pom.xml
At revision 1755464

No changes for http://svn.apache.org/repos/asf/maven/plugins/trunk since the previous build
Parsing POMs
Modules changed, recalculating dependency graph
Established TCP socket on 34449
maven31-agent.jar already up to date
maven31-interceptor.jar already up to date
maven3-interceptor-commons.jar already up to date
[maven-plugins] $ /home/jenkins/tools/java/latest1.7/bin/java -Xmx2g -Xms256m -XX:MaxPermSize=512m
-cp /home/jenkins/jenkins-slave/maven31-agent.jar:/home/jenkins/jenkins-slave/tools/hudson.tasks.Maven_MavenInstallation/maven-3.1.1/boot/plexus-classworlds-2.5.1.jar:/home/jenkins/jenkins-slave/tools/hudson.tasks.Maven_MavenInstallation/maven-3.1.1/conf/logging
jenkins.maven3.agent.Maven31Main /home/jenkins/jenkins-slave/tools/hudson.tasks.Maven_MavenInstallation/maven-3.1.1
/home/jenkins/jenkins-slave/slave.jar /home/jenkins/jenkins-slave/maven31-interceptor.jar
/home/jenkins/jenkins-slave/maven3-interceptor-commons.jar 34449
Exception in thread "main" java.lang.ClassNotFoundException: hudson.remoting.Launcher
	at org.codehaus.plexus.classworlds.strategy.SelfFirstStrategy.loadClass(SelfFirstStrategy.java:50)
	at org.codehaus.plexus.classworlds.realm.ClassRealm.unsynchronizedLoadClass(ClassRealm.java:259)
	at org.codehaus.plexus.classworlds.realm.ClassRealm.loadClass(ClassRealm.java:235)
	at org.codehaus.plexus.classworlds.realm.ClassRealm.loadClass(ClassRealm.java:227)
	at jenkins.maven3.agent.Maven31Main.main(Maven31Main.java:142)
	at jenkins.maven3.agent.Maven31Main.main(Maven31Main.java:73)
ERROR: Failed to parse POMs
java.io.EOFException: unexpected stream termination
	at hudson.remoting.ChannelBuilder.negotiate(ChannelBuilder.java:365)
	at hudson.remoting.ChannelBuilder.build(ChannelBuilder.java:310)
	at hudson.slaves.Channels.forProcess(Channels.java:115)
	at hudson.maven.AbstractMavenProcessFactory.newProcess(AbstractMavenProcessFactory.java:297)
	at hudson.maven.ProcessCache.get(ProcessCache.java:236)
	at hudson.maven.MavenModuleSetBuild$MavenModuleSetBuildExecution.doRun(MavenModuleSetBuild.java:778)
	at hudson.model.AbstractBuild$AbstractBuildExecution.run(AbstractBuild.java:534)
	at hudson.model.Run.execute(Run.java:1738)
	at hudson.maven.MavenModuleSetBuild.run(MavenModuleSetBuild.java:531)
	at hudson.model.ResourceController.execute(ResourceController.java:98)
	at hudson.model.Executor.run(Executor.java:410)
[WARNINGS] Skipping publisher since build result is FAILURE

Mime
View raw message