maven-notifications mailing list archives

Site index · List index
Message view « Date » · « Thread »
Top « Date » · « Thread »
From Apache Jenkins Server <jenk...@builds.apache.org>
Subject Build failed in Jenkins: maven-archetype-m2 #178
Date Sat, 13 Aug 2016 22:43:11 GMT
See <https://builds.apache.org/job/maven-archetype-m2/178/changes>

Changes:

[paranoiabla] Fail main build if invoker fails.

------------------------------------------
[...truncated 1532 lines...]
[INFO] [compiler:testCompile {execution: default-testCompile}]
[INFO] No sources to compile
[INFO] [surefire:test {execution: default-test}]
[JENKINS] Recording test results
[INFO] [jar:jar {execution: default-jar}]
[INFO] Building jar: <https://builds.apache.org/job/maven-archetype-m2/ws/archetype-packaging/target/archetype-packaging-2.5-SNAPSHOT.jar>
[WARNING] DEPRECATED [sourceDirectory]: instead use {@link #sourceDirectories}
[WARNING] DEPRECATED [testSourceDirectory]: instead use {@link #testSourceDirectories}
[INFO] [checkstyle:check {execution: checkstyle-check}]
[INFO] [apache-rat:check {execution: rat-check}]
[INFO] 51 implicit excludes (use -debug for more details).
[INFO] Exclude: README.txt
[INFO] Exclude: *.sh
[INFO] Exclude: archetype-samples/**
[INFO] Exclude: **/*.sha1
[INFO] Exclude: src/main/resources/org/apache/maven/archetype/creator/*
[INFO] Exclude: **/Format.java
[INFO] Exclude: **/NamespaceStack.java
[INFO] Exclude: **/XMLOutputter.java
[INFO] Exclude: src/test/**
[INFO] Exclude: src/it/**
[INFO] Exclude: .repository/**
[INFO] Exclude: .java-version
[INFO] Exclude: DEPENDENCIES
[INFO] 4 resources included (use -debug for more details)
[INFO] Rat check: Summary of files. Unapproved: 0 unknown: 0 generated: 0 approved: 3 licence.
[INFO] [install:install {execution: default-install}]
[INFO] Installing <https://builds.apache.org/job/maven-archetype-m2/ws/archetype-packaging/target/archetype-packaging-2.5-SNAPSHOT.jar>
to <https://builds.apache.org/job/maven-archetype-m2/ws/.repository/org/apache/maven/archetype/archetype-packaging/2.5-SNAPSHOT/archetype-packaging-2.5-SNAPSHOT.jar>
[INFO] ------------------------------------------------------------------------
[INFO] Building Maven Archetype Plugin
[INFO]    task-segment: [clean, install]
[INFO] ------------------------------------------------------------------------
[INFO] [clean:clean {execution: default-clean}]
[INFO] Deleting <https://builds.apache.org/job/maven-archetype-m2/ws/maven-archetype-plugin/target>
[INFO] [enforcer:enforce {execution: enforce-bytecode-version}]
[INFO] [enforcer:enforce {execution: ban-known-bad-maven-versions}]
[INFO] [plugin:helpmojo {execution: generate-helpmojo}]
[INFO] Using 'UTF-8' encoding to read mojo metadata.
[INFO] Mojo extractor with id: java-annotations found 0 mojo descriptors.
[INFO] Mojo extractor with id: java-javadoc found 1 mojo descriptors.
[INFO] [plugin:descriptor {execution: default-descriptor}]
[INFO] Using 'UTF-8' encoding to read mojo metadata.
[INFO] Mojo extractor with id: java-annotations found 0 mojo descriptors.
[INFO] Mojo extractor with id: java-javadoc found 1 mojo descriptors.
[INFO] [remote-resources:process {execution: default}]
[INFO] [resources:resources {execution: default-resources}]
[INFO] Using 'UTF-8' encoding to copy filtered resources.
[INFO] skip non existing resourceDirectory <https://builds.apache.org/job/maven-archetype-m2/ws/maven-archetype-plugin/src/main/resources>
[INFO] Copying 3 resources
[INFO] [compiler:compile {execution: default-compile}]
[INFO] Changes detected - recompiling the module!
[INFO] Compiling 27 source files to <https://builds.apache.org/job/maven-archetype-m2/ws/maven-archetype-plugin/target/classes>
[INFO] [plexus-component-metadata:generate-metadata {execution: default}]
[INFO] Discovered 8 component descriptors(s)
[INFO] [plugin:descriptor {execution: mojo-descriptor}]
[INFO] Using 'UTF-8' encoding to read mojo metadata.
[INFO] Mojo extractor with id: java-annotations found 7 mojo descriptors.
[INFO] Mojo extractor with id: java-javadoc found 1 mojo descriptors.
[INFO] [resources:testResources {execution: default-testResources}]
[INFO] Using 'UTF-8' encoding to copy filtered resources.
[INFO] skip non existing resourceDirectory <https://builds.apache.org/job/maven-archetype-m2/ws/maven-archetype-plugin/src/test/resources>
[INFO] Copying 3 resources
[INFO] [compiler:testCompile {execution: default-testCompile}]
[INFO] Changes detected - recompiling the module!
[INFO] Compiling 5 source files to <https://builds.apache.org/job/maven-archetype-m2/ws/maven-archetype-plugin/target/test-classes>
[INFO] [surefire:test {execution: default-test}]
[INFO] Surefire report directory: <https://builds.apache.org/job/maven-archetype-m2/ws/maven-archetype-plugin/target/surefire-reports>

-------------------------------------------------------
 T E S T S
-------------------------------------------------------
Running org.apache.maven.archetype.ui.generation.DefaultArchetypeGenerationQueryerTest
Tests run: 1, Failures: 0, Errors: 0, Skipped: 0, Time elapsed: 0.381 sec - in org.apache.maven.archetype.ui.generation.DefaultArchetypeGenerationQueryerTest
Running org.apache.maven.archetype.ui.generation.DefaultArchetypeSelectorTest
[INFO] No catalog defined. Using internal catalog
[INFO] No archetype defined. Using maven-archetype-quickstart (org.apache.maven.archetypes:maven-archetype-quickstart:1.0)
[INFO] No catalog defined. Using internal catalog
[INFO] No archetype defined. Using maven-archetype-quickstart (org.apache.maven.archetypes:maven-archetype-quickstart:1.0)
[INFO] No catalog defined. Using internal catalog
[INFO] No catalog defined. Using internal catalog
[WARNING] Archetype not found in any catalog. Falling back to central repository (http://repo.maven.apache.org/maven2).
[WARNING] Use -DarchetypeRepository=<your repository> if archetype's repository is elsewhere.
[INFO] No catalog defined. Using internal catalog
[INFO] No archetype defined. Using maven-archetype-quickstart (org.apache.maven.archetypes:maven-archetype-quickstart:1.0)
Tests run: 5, Failures: 0, Errors: 0, Skipped: 0, Time elapsed: 0.539 sec - in org.apache.maven.archetype.ui.generation.DefaultArchetypeSelectorTest
Running org.apache.maven.archetype.ui.generation.DefaultArchetypeGenerationConfiguratorTest
[WARNING] Property groupId is missing. Add -DgroupId=someValue
[WARNING] Property package is missing. Add -Dpackage=someValue
Tests run: 3, Failures: 0, Errors: 0, Skipped: 0, Time elapsed: 0.114 sec - in org.apache.maven.archetype.ui.generation.DefaultArchetypeGenerationConfiguratorTest
Running org.apache.maven.archetype.ui.generation.RequiredPropertyComparatorTest
Tests run: 2, Failures: 0, Errors: 0, Skipped: 0, Time elapsed: 0.002 sec - in org.apache.maven.archetype.ui.generation.RequiredPropertyComparatorTest
Running org.apache.maven.archetype.ui.generation.DefaultArchetypeSelectionQueryerTest
Tests run: 5, Failures: 0, Errors: 0, Skipped: 0, Time elapsed: 0.179 sec - in org.apache.maven.archetype.ui.generation.DefaultArchetypeSelectionQueryerTest

Results :

Tests run: 16, Failures: 0, Errors: 0, Skipped: 0

[JENKINS] Recording test results
[INFO] [jar:jar {execution: default-jar}]
[INFO] Building jar: <https://builds.apache.org/job/maven-archetype-m2/ws/maven-archetype-plugin/target/maven-archetype-plugin-2.5-SNAPSHOT.jar>
[INFO] [plugin:addPluginArtifactMetadata {execution: default-addPluginArtifactMetadata}]
[INFO] [invoker:install {execution: integration-test}]
[INFO] Installing <https://builds.apache.org/job/maven-archetype-m2/ws/pom.xml> to <https://builds.apache.org/job/maven-archetype-m2/ws/maven-archetype-plugin/target/local-repo/org/apache/maven/archetype/maven-archetype/2.5-SNAPSHOT/maven-archetype-2.5-SNAPSHOT.pom>
[INFO] Installing <https://builds.apache.org/job/maven-archetype-m2/ws/target/maven-archetype-2.5-SNAPSHOT-site.xml>
to <https://builds.apache.org/job/maven-archetype-m2/ws/maven-archetype-plugin/target/local-repo/org/apache/maven/archetype/maven-archetype/2.5-SNAPSHOT/maven-archetype-2.5-SNAPSHOT-site.xml>
[INFO] Installing <https://builds.apache.org/job/maven-archetype-m2/ws/archetype-testing/pom.xml>
to <https://builds.apache.org/job/maven-archetype-m2/ws/maven-archetype-plugin/target/local-repo/org/apache/maven/archetype/archetype-testing/2.5-SNAPSHOT/archetype-testing-2.5-SNAPSHOT.pom>
[INFO] Installing <https://builds.apache.org/job/maven-archetype-m2/ws/archetype-testing/target/archetype-testing-2.5-SNAPSHOT-site.xml>
to <https://builds.apache.org/job/maven-archetype-m2/ws/maven-archetype-plugin/target/local-repo/org/apache/maven/archetype/archetype-testing/2.5-SNAPSHOT/archetype-testing-2.5-SNAPSHOT-site.xml>
[INFO] Installing <https://builds.apache.org/job/maven-archetype-m2/ws/archetype-testing/archetype-proxy/pom.xml>
to <https://builds.apache.org/job/maven-archetype-m2/ws/maven-archetype-plugin/target/local-repo/org/apache/maven/archetype/archetype-proxy/2.5-SNAPSHOT/archetype-proxy-2.5-SNAPSHOT.pom>
[INFO] Installing <https://builds.apache.org/job/maven-archetype-m2/ws/archetype-testing/archetype-proxy/target/archetype-proxy-2.5-SNAPSHOT.war>
to <https://builds.apache.org/job/maven-archetype-m2/ws/maven-archetype-plugin/target/local-repo/org/apache/maven/archetype/archetype-proxy/2.5-SNAPSHOT/archetype-proxy-2.5-SNAPSHOT.war>
[INFO] Installing <https://builds.apache.org/job/maven-archetype-m2/ws/archetype-testing/archetype-repository/pom.xml>
to <https://builds.apache.org/job/maven-archetype-m2/ws/maven-archetype-plugin/target/local-repo/org/apache/maven/archetype/archetype-repository/2.5-SNAPSHOT/archetype-repository-2.5-SNAPSHOT.pom>
[INFO] Installing <https://builds.apache.org/job/maven-archetype-m2/ws/archetype-testing/archetype-repository/target/archetype-repository-2.5-SNAPSHOT.war>
to <https://builds.apache.org/job/maven-archetype-m2/ws/maven-archetype-plugin/target/local-repo/org/apache/maven/archetype/archetype-repository/2.5-SNAPSHOT/archetype-repository-2.5-SNAPSHOT.war>
[INFO] Installing <https://builds.apache.org/job/maven-archetype-m2/ws/archetype-models/pom.xml>
to <https://builds.apache.org/job/maven-archetype-m2/ws/maven-archetype-plugin/target/local-repo/org/apache/maven/archetype/archetype-models/2.5-SNAPSHOT/archetype-models-2.5-SNAPSHOT.pom>
[INFO] Installing <https://builds.apache.org/job/maven-archetype-m2/ws/archetype-models/target/archetype-models-2.5-SNAPSHOT-site.xml>
to <https://builds.apache.org/job/maven-archetype-m2/ws/maven-archetype-plugin/target/local-repo/org/apache/maven/archetype/archetype-models/2.5-SNAPSHOT/archetype-models-2.5-SNAPSHOT-site.xml>
[INFO] Installing <https://builds.apache.org/job/maven-archetype-m2/ws/archetype-models/archetype-catalog/pom.xml>
to <https://builds.apache.org/job/maven-archetype-m2/ws/maven-archetype-plugin/target/local-repo/org/apache/maven/archetype/archetype-catalog/2.5-SNAPSHOT/archetype-catalog-2.5-SNAPSHOT.pom>
[INFO] Installing <https://builds.apache.org/job/maven-archetype-m2/ws/archetype-models/archetype-catalog/target/archetype-catalog-2.5-SNAPSHOT.jar>
to <https://builds.apache.org/job/maven-archetype-m2/ws/maven-archetype-plugin/target/local-repo/org/apache/maven/archetype/archetype-catalog/2.5-SNAPSHOT/archetype-catalog-2.5-SNAPSHOT.jar>
[INFO] Installing <https://builds.apache.org/job/maven-archetype-m2/ws/archetype-models/archetype-descriptor/pom.xml>
to <https://builds.apache.org/job/maven-archetype-m2/ws/maven-archetype-plugin/target/local-repo/org/apache/maven/archetype/archetype-descriptor/2.5-SNAPSHOT/archetype-descriptor-2.5-SNAPSHOT.pom>
[INFO] Installing <https://builds.apache.org/job/maven-archetype-m2/ws/archetype-models/archetype-descriptor/target/archetype-descriptor-2.5-SNAPSHOT.jar>
to <https://builds.apache.org/job/maven-archetype-m2/ws/maven-archetype-plugin/target/local-repo/org/apache/maven/archetype/archetype-descriptor/2.5-SNAPSHOT/archetype-descriptor-2.5-SNAPSHOT.jar>
[INFO] Installing <https://builds.apache.org/job/maven-archetype-m2/ws/archetype-models/archetype-registry/pom.xml>
to <https://builds.apache.org/job/maven-archetype-m2/ws/maven-archetype-plugin/target/local-repo/org/apache/maven/archetype/archetype-registry/2.5-SNAPSHOT/archetype-registry-2.5-SNAPSHOT.pom>
[INFO] Installing <https://builds.apache.org/job/maven-archetype-m2/ws/archetype-models/archetype-registry/target/archetype-registry-2.5-SNAPSHOT.jar>
to <https://builds.apache.org/job/maven-archetype-m2/ws/maven-archetype-plugin/target/local-repo/org/apache/maven/archetype/archetype-registry/2.5-SNAPSHOT/archetype-registry-2.5-SNAPSHOT.jar>
[INFO] Installing <https://builds.apache.org/job/maven-archetype-m2/ws/archetype-common/pom.xml>
to <https://builds.apache.org/job/maven-archetype-m2/ws/maven-archetype-plugin/target/local-repo/org/apache/maven/archetype/archetype-common/2.5-SNAPSHOT/archetype-common-2.5-SNAPSHOT.pom>
[INFO] Installing <https://builds.apache.org/job/maven-archetype-m2/ws/archetype-common/target/archetype-common-2.5-SNAPSHOT.jar>
to <https://builds.apache.org/job/maven-archetype-m2/ws/maven-archetype-plugin/target/local-repo/org/apache/maven/archetype/archetype-common/2.5-SNAPSHOT/archetype-common-2.5-SNAPSHOT.jar>
[INFO] Installing <https://builds.apache.org/job/maven-archetype-m2/ws/archetype-packaging/pom.xml>
to <https://builds.apache.org/job/maven-archetype-m2/ws/maven-archetype-plugin/target/local-repo/org/apache/maven/archetype/archetype-packaging/2.5-SNAPSHOT/archetype-packaging-2.5-SNAPSHOT.pom>
[INFO] Installing <https://builds.apache.org/job/maven-archetype-m2/ws/archetype-packaging/target/archetype-packaging-2.5-SNAPSHOT.jar>
to <https://builds.apache.org/job/maven-archetype-m2/ws/maven-archetype-plugin/target/local-repo/org/apache/maven/archetype/archetype-packaging/2.5-SNAPSHOT/archetype-packaging-2.5-SNAPSHOT.jar>
[INFO] Installing <https://builds.apache.org/job/maven-archetype-m2/ws/maven-archetype-plugin/pom.xml>
to <https://builds.apache.org/job/maven-archetype-m2/ws/maven-archetype-plugin/target/local-repo/org/apache/maven/plugins/maven-archetype-plugin/2.5-SNAPSHOT/maven-archetype-plugin-2.5-SNAPSHOT.pom>
[INFO] Installing <https://builds.apache.org/job/maven-archetype-m2/ws/maven-archetype-plugin/target/maven-archetype-plugin-2.5-SNAPSHOT.jar>
to <https://builds.apache.org/job/maven-archetype-m2/ws/maven-archetype-plugin/target/local-repo/org/apache/maven/plugins/maven-archetype-plugin/2.5-SNAPSHOT/maven-archetype-plugin-2.5-SNAPSHOT.jar>
[INFO] [invoker:run {execution: integration-test}]
[INFO] Building: build-archetype-ignore-eol-encoding/pom.xml
[INFO] run script setup.bsh
[INFO] run script verify.bsh
[INFO] ..SUCCESS (14.7 s)
[INFO] Building: property-setting-cli/pom.xml
[INFO] ..SUCCESS (3.1 s)
[INFO] Building: create-from-project/pom.xml
[INFO] ..FAILED (3.8 s)
[INFO]   The build exited with code 1. See <https://builds.apache.org/job/maven-archetype-m2/ws/maven-archetype-plugin/target/it/create-from-project/build.log>
for details.
[INFO] Building: generate-basic
[INFO] run script setup.groovy
[INFO] run script verify.bsh
[INFO] ..SUCCESS (4.1 s)
[INFO] Building: build-archetype-and-run-its-with-existing-parent/pom.xml
[INFO] run script verify.bsh
[INFO] ..SUCCESS (6.4 s)
[INFO] Building: build-archetype/pom.xml
[INFO] run script setup.bsh
[INFO] run script verify.bsh
[INFO] ..SUCCESS (7.3 s)
[INFO] -------------------------------------------------
[INFO] Build Summary:
[INFO]   Passed: 5, Failed: 1, Errors: 0, Skipped: 0
[INFO] -------------------------------------------------
[ERROR] The following builds failed:
[ERROR] *  create-from-project/pom.xml
[INFO] -------------------------------------------------
[INFO] 
[INFO] 
[INFO] ------------------------------------------------------------------------
[INFO] Reactor Summary:
[INFO] ------------------------------------------------------------------------
[INFO] Maven Archetype ....................................... SUCCESS [13.538s]
[INFO] Maven Archetype Testing ............................... SUCCESS [0.565s]
[INFO] Maven Archetype Webapp Proxy .......................... SUCCESS [3.814s]
[INFO] Maven Archetype Webapp Repository ..................... SUCCESS [1.180s]
[INFO] Maven Archetype Models ................................ SUCCESS [0.540s]
[INFO] Maven Archetype Catalog Model ......................... SUCCESS [2.600s]
[INFO] Maven Archetype Descriptor Model ...................... SUCCESS [1.242s]
[INFO] Maven Archetype Registry Model ........................ SUCCESS [1.525s]
[INFO] Maven Archetype Common ................................ SUCCESS [27.485s]
[INFO] Maven Archetype Packaging ............................. SUCCESS [0.599s]
[INFO] Maven Archetype Plugin ................................ FAILED [51.520s]
[INFO] ------------------------------------------------------------------------
[INFO] Error for project: Maven Archetype Plugin (during install)
[INFO] ------------------------------------------------------------------------
[INFO] 1 build failed. See console output above for details.
[INFO] ------------------------------------------------------------------------
[INFO] Trace
org.apache.maven.BuildFailureException: 1 build failed. See console output above for details.
	at org.apache.maven.lifecycle.DefaultLifecycleExecutor.executeGoals(DefaultLifecycleExecutor.java:715)
	at org.apache.maven.lifecycle.DefaultLifecycleExecutor.executeGoalWithLifecycle(DefaultLifecycleExecutor.java:556)
	at org.apache.maven.lifecycle.DefaultLifecycleExecutor.executeGoal(DefaultLifecycleExecutor.java:535)
	at org.apache.maven.lifecycle.DefaultLifecycleExecutor.executeGoalAndHandleFailures(DefaultLifecycleExecutor.java:387)
	at org.apache.maven.lifecycle.DefaultLifecycleExecutor.executeTaskSegments(DefaultLifecycleExecutor.java:348)
	at org.apache.maven.lifecycle.DefaultLifecycleExecutor.execute(DefaultLifecycleExecutor.java:180)
	at org.apache.maven.lifecycle.LifecycleExecutorInterceptor.execute(LifecycleExecutorInterceptor.java:65)
	at org.apache.maven.DefaultMaven.doExecute(DefaultMaven.java:328)
	at org.apache.maven.DefaultMaven.execute(DefaultMaven.java:138)
	at org.apache.maven.cli.MavenCli.main(MavenCli.java:362)
	at sun.reflect.NativeMethodAccessorImpl.invoke0(Native Method)
	at sun.reflect.NativeMethodAccessorImpl.invoke(NativeMethodAccessorImpl.java:57)
	at sun.reflect.DelegatingMethodAccessorImpl.invoke(DelegatingMethodAccessorImpl.java:43)
	at java.lang.reflect.Method.invoke(Method.java:606)
	at org.codehaus.classworlds.Launcher.launchEnhanced(Launcher.java:315)
	at org.codehaus.classworlds.Launcher.launch(Launcher.java:255)
	at hudson.maven.agent.Main.launch(Main.java:205)
	at hudson.maven.MavenBuilder.call(MavenBuilder.java:154)
	at hudson.maven.Maven2Builder.call(Maven2Builder.java:79)
	at hudson.maven.Maven2Builder.call(Maven2Builder.java:55)
	at hudson.remoting.UserRequest.perform(UserRequest.java:120)
	at hudson.remoting.UserRequest.perform(UserRequest.java:48)
	at hudson.remoting.Request$2.run(Request.java:326)
	at hudson.remoting.InterceptingExecutorService$1.call(InterceptingExecutorService.java:68)
	at java.util.concurrent.FutureTask.run(FutureTask.java:262)
	at java.util.concurrent.ThreadPoolExecutor.runWorker(ThreadPoolExecutor.java:1145)
	at java.util.concurrent.ThreadPoolExecutor$Worker.run(ThreadPoolExecutor.java:615)
	at java.lang.Thread.run(Thread.java:745)
Caused by: org.apache.maven.plugin.MojoFailureException: 1 build failed. See console output
above for details.
	at org.apache.maven.plugin.invoker.InvokerSession.handleFailures(InvokerSession.java:258)
	at org.apache.maven.plugin.invoker.InvokerMojo.processResults(InvokerMojo.java:67)
	at org.apache.maven.plugin.invoker.AbstractInvokerMojo.execute(AbstractInvokerMojo.java:742)
	at org.apache.maven.plugin.DefaultPluginManager.executeMojo(DefaultPluginManager.java:490)
	at hudson.maven.agent.PluginManagerInterceptor.executeMojo(PluginManagerInterceptor.java:182)
	at org.apache.maven.lifecycle.DefaultLifecycleExecutor.executeGoals(DefaultLifecycleExecutor.java:694)
	... 27 more
[INFO] ------------------------------------------------------------------------
[INFO] BUILD ERRORS
[INFO] ------------------------------------------------------------------------
[INFO] Total time: 1 minute 47 seconds
[INFO] Finished at: Sat Aug 13 22:43:16 UTC 2016
[INFO] Final Memory: 95M/734M
[INFO] ------------------------------------------------------------------------
Waiting for Jenkins to finish collecting data
[JENKINS] Archiving <https://builds.apache.org/job/maven-archetype-m2/ws/archetype-models/archetype-catalog/pom.xml>
to org.apache.maven.archetype/archetype-catalog/2.5-SNAPSHOT/archetype-catalog-2.5-SNAPSHOT.pom
[JENKINS] Archiving <https://builds.apache.org/job/maven-archetype-m2/ws/archetype-models/archetype-catalog/target/archetype-catalog-2.5-SNAPSHOT.jar>
to org.apache.maven.archetype/archetype-catalog/2.5-SNAPSHOT/archetype-catalog-2.5-SNAPSHOT.jar
[JENKINS] Archiving <https://builds.apache.org/job/maven-archetype-m2/ws/archetype-testing/archetype-repository/pom.xml>
to org.apache.maven.archetype/archetype-repository/2.5-SNAPSHOT/archetype-repository-2.5-SNAPSHOT.pom
[JENKINS] Archiving <https://builds.apache.org/job/maven-archetype-m2/ws/archetype-testing/archetype-repository/target/archetype-repository-2.5-SNAPSHOT.war>
to org.apache.maven.archetype/archetype-repository/2.5-SNAPSHOT/archetype-repository-2.5-SNAPSHOT.war
Compressed 169.36 KB of artifacts by 56.7% relative to #177
[JENKINS] Archiving <https://builds.apache.org/job/maven-archetype-m2/ws/.repository/org/apache/maven/archetype/archetype-testing/2.5-SNAPSHOT/archetype-testing-2.5-SNAPSHOT.pom>
to org.apache.maven.archetype/archetype-testing/2.5-SNAPSHOT/archetype-testing-2.5-SNAPSHOT.pom
[JENKINS] Archiving <https://builds.apache.org/job/maven-archetype-m2/ws/archetype-testing/target/archetype-testing-2.5-SNAPSHOT-site.xml>
to org.apache.maven.archetype/archetype-testing/2.5-SNAPSHOT/archetype-testing-2.5-SNAPSHOT-site.xml
/x1/jenkins/jenkins-slave/workspace/maven-archetype-m2/.repository/org/apache/maven/archetype/archetype-testing/2.5-SNAPSHOT/archetype-testing-2.5-SNAPSHOT.pom
is not inside /x1/jenkins/jenkins-slave/workspace/maven-archetype-m2/archetype-testing/; will
archive in a separate pass
[JENKINS] Archiving <https://builds.apache.org/job/maven-archetype-m2/ws/.repository/org/apache/maven/archetype/maven-archetype/2.5-SNAPSHOT/maven-archetype-2.5-SNAPSHOT.pom>
to org.apache.maven.archetype/maven-archetype/2.5-SNAPSHOT/maven-archetype-2.5-SNAPSHOT.pom
[JENKINS] Archiving <https://builds.apache.org/job/maven-archetype-m2/ws/target/maven-archetype-2.5-SNAPSHOT-site.xml>
to org.apache.maven.archetype/maven-archetype/2.5-SNAPSHOT/maven-archetype-2.5-SNAPSHOT-site.xml
[JENKINS] Archiving <https://builds.apache.org/job/maven-archetype-m2/ws/archetype-models/archetype-descriptor/pom.xml>
to org.apache.maven.archetype/archetype-descriptor/2.5-SNAPSHOT/archetype-descriptor-2.5-SNAPSHOT.pom
[JENKINS] Archiving <https://builds.apache.org/job/maven-archetype-m2/ws/archetype-models/archetype-descriptor/target/archetype-descriptor-2.5-SNAPSHOT.jar>
to org.apache.maven.archetype/archetype-descriptor/2.5-SNAPSHOT/archetype-descriptor-2.5-SNAPSHOT.jar
[JENKINS] Archiving <https://builds.apache.org/job/maven-archetype-m2/ws/archetype-testing/archetype-proxy/pom.xml>
to org.apache.maven.archetype/archetype-proxy/2.5-SNAPSHOT/archetype-proxy-2.5-SNAPSHOT.pom
[JENKINS] Archiving <https://builds.apache.org/job/maven-archetype-m2/ws/archetype-testing/archetype-proxy/target/archetype-proxy-2.5-SNAPSHOT.war>
to org.apache.maven.archetype/archetype-proxy/2.5-SNAPSHOT/archetype-proxy-2.5-SNAPSHOT.war
Compressed 165.65 KB of artifacts by 58.0% relative to #177
[JENKINS] Archiving <https://builds.apache.org/job/maven-archetype-m2/ws/archetype-models/archetype-registry/pom.xml>
to org.apache.maven.archetype/archetype-registry/2.5-SNAPSHOT/archetype-registry-2.5-SNAPSHOT.pom
[JENKINS] Archiving <https://builds.apache.org/job/maven-archetype-m2/ws/archetype-models/archetype-registry/target/archetype-registry-2.5-SNAPSHOT.jar>
to org.apache.maven.archetype/archetype-registry/2.5-SNAPSHOT/archetype-registry-2.5-SNAPSHOT.jar
[JENKINS] Archiving <https://builds.apache.org/job/maven-archetype-m2/ws/.repository/org/apache/maven/archetype/archetype-models/2.5-SNAPSHOT/archetype-models-2.5-SNAPSHOT.pom>
to org.apache.maven.archetype/archetype-models/2.5-SNAPSHOT/archetype-models-2.5-SNAPSHOT.pom
[JENKINS] Archiving <https://builds.apache.org/job/maven-archetype-m2/ws/archetype-models/target/archetype-models-2.5-SNAPSHOT-site.xml>
to org.apache.maven.archetype/archetype-models/2.5-SNAPSHOT/archetype-models-2.5-SNAPSHOT-site.xml
/x1/jenkins/jenkins-slave/workspace/maven-archetype-m2/.repository/org/apache/maven/archetype/archetype-models/2.5-SNAPSHOT/archetype-models-2.5-SNAPSHOT.pom
is not inside /x1/jenkins/jenkins-slave/workspace/maven-archetype-m2/archetype-models/; will
archive in a separate pass
[JENKINS] Archiving <https://builds.apache.org/job/maven-archetype-m2/ws/archetype-packaging/pom.xml>
to org.apache.maven.archetype/archetype-packaging/2.5-SNAPSHOT/archetype-packaging-2.5-SNAPSHOT.pom
[JENKINS] Archiving <https://builds.apache.org/job/maven-archetype-m2/ws/archetype-packaging/target/archetype-packaging-2.5-SNAPSHOT.jar>
to org.apache.maven.archetype/archetype-packaging/2.5-SNAPSHOT/archetype-packaging-2.5-SNAPSHOT.jar
[JENKINS] Archiving <https://builds.apache.org/job/maven-archetype-m2/ws/maven-archetype-plugin/pom.xml>
to org.apache.maven.plugins/maven-archetype-plugin/2.5-SNAPSHOT/maven-archetype-plugin-2.5-SNAPSHOT.pom
[JENKINS] Archiving <https://builds.apache.org/job/maven-archetype-m2/ws/maven-archetype-plugin/target/maven-archetype-plugin-2.5-SNAPSHOT.jar>
to org.apache.maven.plugins/maven-archetype-plugin/2.5-SNAPSHOT/maven-archetype-plugin-2.5-SNAPSHOT.jar
[JENKINS] Archiving <https://builds.apache.org/job/maven-archetype-m2/ws/archetype-common/pom.xml>
to org.apache.maven.archetype/archetype-common/2.5-SNAPSHOT/archetype-common-2.5-SNAPSHOT.pom
[JENKINS] Archiving <https://builds.apache.org/job/maven-archetype-m2/ws/archetype-common/target/archetype-common-2.5-SNAPSHOT.jar>
to org.apache.maven.archetype/archetype-common/2.5-SNAPSHOT/archetype-common-2.5-SNAPSHOT.jar
Sending e-mails to: notifications@maven.apache.org paranoiabla@gmail.com
Sending e-mails to: notifications@maven.apache.org
channel stopped

Mime
View raw message