maven-notifications mailing list archives

Site index · List index
Message view « Date » · « Thread »
Top « Date » · « Thread »
From Apache Jenkins Server <jenk...@builds.apache.org>
Subject Build failed in Jenkins: maven-plugin-tools-jdk-1.7 #128
Date Thu, 11 Aug 2016 19:15:09 GMT
See <https://builds.apache.org/job/maven-plugin-tools-jdk-1.7/128/changes>

Changes:

[Robert Scholte] [MPLUGIN-305] MojoAnnotationsScanner should have better control over dependency
scanning
Improve documentation

------------------------------------------
[...truncated 2013 lines...]
[INFO] 
[INFO] --- maven-surefire-plugin:2.17:test (default-test) @ maven-plugin-plugin ---
[JENKINS] Recording test results
[INFO] 
[INFO] --- maven-jar-plugin:2.5:jar (default-jar) @ maven-plugin-plugin ---
[INFO] Building jar: <https://builds.apache.org/job/maven-plugin-tools-jdk-1.7/ws/maven-plugin-plugin/target/maven-plugin-plugin-3.5-SNAPSHOT.jar>
[INFO] 
[INFO] --- maven-plugin-plugin:3.3:addPluginArtifactMetadata (default-addPluginArtifactMetadata)
@ maven-plugin-plugin ---
[INFO] 
[INFO] --- maven-site-plugin:3.4:attach-descriptor (attach-descriptor) @ maven-plugin-plugin
---
[INFO] 
[INFO] --- maven-invoker-plugin:1.10:install (integration-test) @ maven-plugin-plugin ---
[INFO] Installing <https://builds.apache.org/job/maven-plugin-tools-jdk-1.7/ws/pom.xml>
to <https://builds.apache.org/job/maven-plugin-tools-jdk-1.7/ws/maven-plugin-plugin/target/local-repo/org/apache/maven/plugin-tools/maven-plugin-tools/3.5-SNAPSHOT/maven-plugin-tools-3.5-SNAPSHOT.pom>
[INFO] Installing <https://builds.apache.org/job/maven-plugin-tools-jdk-1.7/ws/target/maven-plugin-tools-3.5-SNAPSHOT-site.xml>
to <https://builds.apache.org/job/maven-plugin-tools-jdk-1.7/ws/maven-plugin-plugin/target/local-repo/org/apache/maven/plugin-tools/maven-plugin-tools/3.5-SNAPSHOT/maven-plugin-tools-3.5-SNAPSHOT-site.xml>
[INFO] Installing <https://builds.apache.org/job/maven-plugin-tools-jdk-1.7/ws/maven-plugin-tools-api/pom.xml>
to <https://builds.apache.org/job/maven-plugin-tools-jdk-1.7/ws/maven-plugin-plugin/target/local-repo/org/apache/maven/plugin-tools/maven-plugin-tools-api/3.5-SNAPSHOT/maven-plugin-tools-api-3.5-SNAPSHOT.pom>
[INFO] Installing <https://builds.apache.org/job/maven-plugin-tools-jdk-1.7/ws/maven-plugin-tools-api/target/maven-plugin-tools-api-3.5-SNAPSHOT.jar>
to <https://builds.apache.org/job/maven-plugin-tools-jdk-1.7/ws/maven-plugin-plugin/target/local-repo/org/apache/maven/plugin-tools/maven-plugin-tools-api/3.5-SNAPSHOT/maven-plugin-tools-api-3.5-SNAPSHOT.jar>
[INFO] Installing <https://builds.apache.org/job/maven-plugin-tools-jdk-1.7/ws/maven-plugin-tools-api/pom.xml>
to <https://builds.apache.org/job/maven-plugin-tools-jdk-1.7/ws/maven-plugin-plugin/target/local-repo/org/apache/maven/plugin-tools/maven-plugin-tools-api/3.5-SNAPSHOT/maven-plugin-tools-api-3.5-SNAPSHOT.pom>
[INFO] Installing <https://builds.apache.org/job/maven-plugin-tools-jdk-1.7/ws/maven-plugin-tools-generators/pom.xml>
to <https://builds.apache.org/job/maven-plugin-tools-jdk-1.7/ws/maven-plugin-plugin/target/local-repo/org/apache/maven/plugin-tools/maven-plugin-tools-generators/3.5-SNAPSHOT/maven-plugin-tools-generators-3.5-SNAPSHOT.pom>
[INFO] Installing <https://builds.apache.org/job/maven-plugin-tools-jdk-1.7/ws/maven-plugin-tools-generators/target/maven-plugin-tools-generators-3.5-SNAPSHOT.jar>
to <https://builds.apache.org/job/maven-plugin-tools-jdk-1.7/ws/maven-plugin-plugin/target/local-repo/org/apache/maven/plugin-tools/maven-plugin-tools-generators/3.5-SNAPSHOT/maven-plugin-tools-generators-3.5-SNAPSHOT.jar>
[INFO] Installing <https://builds.apache.org/job/maven-plugin-tools-jdk-1.7/ws/maven-plugin-tools-generators/pom.xml>
to <https://builds.apache.org/job/maven-plugin-tools-jdk-1.7/ws/maven-plugin-plugin/target/local-repo/org/apache/maven/plugin-tools/maven-plugin-tools-generators/3.5-SNAPSHOT/maven-plugin-tools-generators-3.5-SNAPSHOT.pom>
[INFO] Installing <https://builds.apache.org/job/maven-plugin-tools-jdk-1.7/ws/maven-plugin-tools-java/pom.xml>
to <https://builds.apache.org/job/maven-plugin-tools-jdk-1.7/ws/maven-plugin-plugin/target/local-repo/org/apache/maven/plugin-tools/maven-plugin-tools-java/3.5-SNAPSHOT/maven-plugin-tools-java-3.5-SNAPSHOT.pom>
[INFO] Installing <https://builds.apache.org/job/maven-plugin-tools-jdk-1.7/ws/maven-plugin-tools-java/target/maven-plugin-tools-java-3.5-SNAPSHOT.jar>
to <https://builds.apache.org/job/maven-plugin-tools-jdk-1.7/ws/maven-plugin-plugin/target/local-repo/org/apache/maven/plugin-tools/maven-plugin-tools-java/3.5-SNAPSHOT/maven-plugin-tools-java-3.5-SNAPSHOT.jar>
[INFO] Installing <https://builds.apache.org/job/maven-plugin-tools-jdk-1.7/ws/maven-plugin-tools-java/pom.xml>
to <https://builds.apache.org/job/maven-plugin-tools-jdk-1.7/ws/maven-plugin-plugin/target/local-repo/org/apache/maven/plugin-tools/maven-plugin-tools-java/3.5-SNAPSHOT/maven-plugin-tools-java-3.5-SNAPSHOT.pom>
[INFO] Installing <https://builds.apache.org/job/maven-plugin-tools-jdk-1.7/ws/maven-plugin-annotations/pom.xml>
to <https://builds.apache.org/job/maven-plugin-tools-jdk-1.7/ws/maven-plugin-plugin/target/local-repo/org/apache/maven/plugin-tools/maven-plugin-annotations/3.5-SNAPSHOT/maven-plugin-annotations-3.5-SNAPSHOT.pom>
[INFO] Installing <https://builds.apache.org/job/maven-plugin-tools-jdk-1.7/ws/maven-plugin-annotations/target/maven-plugin-annotations-3.5-SNAPSHOT.jar>
to <https://builds.apache.org/job/maven-plugin-tools-jdk-1.7/ws/maven-plugin-plugin/target/local-repo/org/apache/maven/plugin-tools/maven-plugin-annotations/3.5-SNAPSHOT/maven-plugin-annotations-3.5-SNAPSHOT.jar>
[INFO] Installing <https://builds.apache.org/job/maven-plugin-tools-jdk-1.7/ws/maven-plugin-annotations/pom.xml>
to <https://builds.apache.org/job/maven-plugin-tools-jdk-1.7/ws/maven-plugin-plugin/target/local-repo/org/apache/maven/plugin-tools/maven-plugin-annotations/3.5-SNAPSHOT/maven-plugin-annotations-3.5-SNAPSHOT.pom>
[INFO] Installing <https://builds.apache.org/job/maven-plugin-tools-jdk-1.7/ws/maven-plugin-tools-annotations/pom.xml>
to <https://builds.apache.org/job/maven-plugin-tools-jdk-1.7/ws/maven-plugin-plugin/target/local-repo/org/apache/maven/plugin-tools/maven-plugin-tools-annotations/3.5-SNAPSHOT/maven-plugin-tools-annotations-3.5-SNAPSHOT.pom>
[INFO] Installing <https://builds.apache.org/job/maven-plugin-tools-jdk-1.7/ws/maven-plugin-tools-annotations/target/maven-plugin-tools-annotations-3.5-SNAPSHOT.jar>
to <https://builds.apache.org/job/maven-plugin-tools-jdk-1.7/ws/maven-plugin-plugin/target/local-repo/org/apache/maven/plugin-tools/maven-plugin-tools-annotations/3.5-SNAPSHOT/maven-plugin-tools-annotations-3.5-SNAPSHOT.jar>
[INFO] Installing <https://builds.apache.org/job/maven-plugin-tools-jdk-1.7/ws/maven-plugin-tools-annotations/pom.xml>
to <https://builds.apache.org/job/maven-plugin-tools-jdk-1.7/ws/maven-plugin-plugin/target/local-repo/org/apache/maven/plugin-tools/maven-plugin-tools-annotations/3.5-SNAPSHOT/maven-plugin-tools-annotations-3.5-SNAPSHOT.pom>
[INFO] Installing <https://builds.apache.org/job/maven-plugin-tools-jdk-1.7/ws/maven-plugin-tools-annotations/target/maven-plugin-tools-annotations-3.5-SNAPSHOT-tests.jar>
to <https://builds.apache.org/job/maven-plugin-tools-jdk-1.7/ws/maven-plugin-plugin/target/local-repo/org/apache/maven/plugin-tools/maven-plugin-tools-annotations/3.5-SNAPSHOT/maven-plugin-tools-annotations-3.5-SNAPSHOT-tests.jar>
[INFO] Installing <https://builds.apache.org/job/maven-plugin-tools-jdk-1.7/ws/maven-plugin-tools-annotations/target/maven-plugin-tools-annotations-3.5-SNAPSHOT-test-sources.jar>
to <https://builds.apache.org/job/maven-plugin-tools-jdk-1.7/ws/maven-plugin-plugin/target/local-repo/org/apache/maven/plugin-tools/maven-plugin-tools-annotations/3.5-SNAPSHOT/maven-plugin-tools-annotations-3.5-SNAPSHOT-test-sources.jar>
[INFO] Installing <https://builds.apache.org/job/maven-plugin-tools-jdk-1.7/ws/maven-plugin-tools-javadoc/pom.xml>
to <https://builds.apache.org/job/maven-plugin-tools-jdk-1.7/ws/maven-plugin-plugin/target/local-repo/org/apache/maven/plugin-tools/maven-plugin-tools-javadoc/3.5-SNAPSHOT/maven-plugin-tools-javadoc-3.5-SNAPSHOT.pom>
[INFO] Installing <https://builds.apache.org/job/maven-plugin-tools-jdk-1.7/ws/maven-plugin-tools-javadoc/target/maven-plugin-tools-javadoc-3.5-SNAPSHOT.jar>
to <https://builds.apache.org/job/maven-plugin-tools-jdk-1.7/ws/maven-plugin-plugin/target/local-repo/org/apache/maven/plugin-tools/maven-plugin-tools-javadoc/3.5-SNAPSHOT/maven-plugin-tools-javadoc-3.5-SNAPSHOT.jar>
[INFO] Installing <https://builds.apache.org/job/maven-plugin-tools-jdk-1.7/ws/maven-script/pom.xml>
to <https://builds.apache.org/job/maven-plugin-tools-jdk-1.7/ws/maven-plugin-plugin/target/local-repo/org/apache/maven/plugin-tools/maven-script/3.5-SNAPSHOT/maven-script-3.5-SNAPSHOT.pom>
[INFO] Installing <https://builds.apache.org/job/maven-plugin-tools-jdk-1.7/ws/maven-script/target/maven-script-3.5-SNAPSHOT-site.xml>
to <https://builds.apache.org/job/maven-plugin-tools-jdk-1.7/ws/maven-plugin-plugin/target/local-repo/org/apache/maven/plugin-tools/maven-script/3.5-SNAPSHOT/maven-script-3.5-SNAPSHOT-site.xml>
[INFO] Installing <https://builds.apache.org/job/maven-plugin-tools-jdk-1.7/ws/maven-script/maven-plugin-tools-model/pom.xml>
to <https://builds.apache.org/job/maven-plugin-tools-jdk-1.7/ws/maven-plugin-plugin/target/local-repo/org/apache/maven/plugin-tools/maven-plugin-tools-model/3.5-SNAPSHOT/maven-plugin-tools-model-3.5-SNAPSHOT.pom>
[INFO] Installing <https://builds.apache.org/job/maven-plugin-tools-jdk-1.7/ws/maven-script/maven-plugin-tools-model/target/maven-plugin-tools-model-3.5-SNAPSHOT.jar>
to <https://builds.apache.org/job/maven-plugin-tools-jdk-1.7/ws/maven-plugin-plugin/target/local-repo/org/apache/maven/plugin-tools/maven-plugin-tools-model/3.5-SNAPSHOT/maven-plugin-tools-model-3.5-SNAPSHOT.jar>
[INFO] Installing <https://builds.apache.org/job/maven-plugin-tools-jdk-1.7/ws/maven-script/maven-plugin-tools-model/pom.xml>
to <https://builds.apache.org/job/maven-plugin-tools-jdk-1.7/ws/maven-plugin-plugin/target/local-repo/org/apache/maven/plugin-tools/maven-plugin-tools-model/3.5-SNAPSHOT/maven-plugin-tools-model-3.5-SNAPSHOT.pom>
[INFO] Installing <https://builds.apache.org/job/maven-plugin-tools-jdk-1.7/ws/maven-script/maven-plugin-tools-ant/pom.xml>
to <https://builds.apache.org/job/maven-plugin-tools-jdk-1.7/ws/maven-plugin-plugin/target/local-repo/org/apache/maven/plugin-tools/maven-plugin-tools-ant/3.5-SNAPSHOT/maven-plugin-tools-ant-3.5-SNAPSHOT.pom>
[INFO] Installing <https://builds.apache.org/job/maven-plugin-tools-jdk-1.7/ws/maven-script/maven-plugin-tools-ant/target/maven-plugin-tools-ant-3.5-SNAPSHOT.jar>
to <https://builds.apache.org/job/maven-plugin-tools-jdk-1.7/ws/maven-plugin-plugin/target/local-repo/org/apache/maven/plugin-tools/maven-plugin-tools-ant/3.5-SNAPSHOT/maven-plugin-tools-ant-3.5-SNAPSHOT.jar>
[INFO] Installing <https://builds.apache.org/job/maven-plugin-tools-jdk-1.7/ws/maven-script/maven-plugin-tools-ant/pom.xml>
to <https://builds.apache.org/job/maven-plugin-tools-jdk-1.7/ws/maven-plugin-plugin/target/local-repo/org/apache/maven/plugin-tools/maven-plugin-tools-ant/3.5-SNAPSHOT/maven-plugin-tools-ant-3.5-SNAPSHOT.pom>
[INFO] Installing <https://builds.apache.org/job/maven-plugin-tools-jdk-1.7/ws/maven-script/maven-script-ant/pom.xml>
to <https://builds.apache.org/job/maven-plugin-tools-jdk-1.7/ws/maven-plugin-plugin/target/local-repo/org/apache/maven/plugin-tools/maven-script-ant/3.5-SNAPSHOT/maven-script-ant-3.5-SNAPSHOT.pom>
[INFO] Installing <https://builds.apache.org/job/maven-plugin-tools-jdk-1.7/ws/maven-script/maven-script-ant/target/maven-script-ant-3.5-SNAPSHOT.jar>
to <https://builds.apache.org/job/maven-plugin-tools-jdk-1.7/ws/maven-plugin-plugin/target/local-repo/org/apache/maven/plugin-tools/maven-script-ant/3.5-SNAPSHOT/maven-script-ant-3.5-SNAPSHOT.jar>
[INFO] Installing <https://builds.apache.org/job/maven-plugin-tools-jdk-1.7/ws/maven-script/maven-script-ant/pom.xml>
to <https://builds.apache.org/job/maven-plugin-tools-jdk-1.7/ws/maven-plugin-plugin/target/local-repo/org/apache/maven/plugin-tools/maven-script-ant/3.5-SNAPSHOT/maven-script-ant-3.5-SNAPSHOT.pom>
[INFO] Installing <https://builds.apache.org/job/maven-plugin-tools-jdk-1.7/ws/maven-script/maven-plugin-tools-beanshell/pom.xml>
to <https://builds.apache.org/job/maven-plugin-tools-jdk-1.7/ws/maven-plugin-plugin/target/local-repo/org/apache/maven/plugin-tools/maven-plugin-tools-beanshell/3.5-SNAPSHOT/maven-plugin-tools-beanshell-3.5-SNAPSHOT.pom>
[INFO] Installing <https://builds.apache.org/job/maven-plugin-tools-jdk-1.7/ws/maven-script/maven-plugin-tools-beanshell/target/maven-plugin-tools-beanshell-3.5-SNAPSHOT.jar>
to <https://builds.apache.org/job/maven-plugin-tools-jdk-1.7/ws/maven-plugin-plugin/target/local-repo/org/apache/maven/plugin-tools/maven-plugin-tools-beanshell/3.5-SNAPSHOT/maven-plugin-tools-beanshell-3.5-SNAPSHOT.jar>
[INFO] Installing <https://builds.apache.org/job/maven-plugin-tools-jdk-1.7/ws/maven-script/maven-plugin-tools-beanshell/pom.xml>
to <https://builds.apache.org/job/maven-plugin-tools-jdk-1.7/ws/maven-plugin-plugin/target/local-repo/org/apache/maven/plugin-tools/maven-plugin-tools-beanshell/3.5-SNAPSHOT/maven-plugin-tools-beanshell-3.5-SNAPSHOT.pom>
[INFO] Installing <https://builds.apache.org/job/maven-plugin-tools-jdk-1.7/ws/maven-script/maven-script-beanshell/pom.xml>
to <https://builds.apache.org/job/maven-plugin-tools-jdk-1.7/ws/maven-plugin-plugin/target/local-repo/org/apache/maven/plugin-tools/maven-script-beanshell/3.5-SNAPSHOT/maven-script-beanshell-3.5-SNAPSHOT.pom>
[INFO] Installing <https://builds.apache.org/job/maven-plugin-tools-jdk-1.7/ws/maven-script/maven-script-beanshell/target/maven-script-beanshell-3.5-SNAPSHOT.jar>
to <https://builds.apache.org/job/maven-plugin-tools-jdk-1.7/ws/maven-plugin-plugin/target/local-repo/org/apache/maven/plugin-tools/maven-script-beanshell/3.5-SNAPSHOT/maven-script-beanshell-3.5-SNAPSHOT.jar>
[INFO] Installing <https://builds.apache.org/job/maven-plugin-tools-jdk-1.7/ws/maven-script/maven-script-beanshell/pom.xml>
to <https://builds.apache.org/job/maven-plugin-tools-jdk-1.7/ws/maven-plugin-plugin/target/local-repo/org/apache/maven/plugin-tools/maven-script-beanshell/3.5-SNAPSHOT/maven-script-beanshell-3.5-SNAPSHOT.pom>
[INFO] Installing <https://builds.apache.org/job/maven-plugin-tools-jdk-1.7/ws/maven-plugin-plugin/pom.xml>
to <https://builds.apache.org/job/maven-plugin-tools-jdk-1.7/ws/maven-plugin-plugin/target/local-repo/org/apache/maven/plugins/maven-plugin-plugin/3.5-SNAPSHOT/maven-plugin-plugin-3.5-SNAPSHOT.pom>
[INFO] Installing <https://builds.apache.org/job/maven-plugin-tools-jdk-1.7/ws/maven-plugin-plugin/target/maven-plugin-plugin-3.5-SNAPSHOT.jar>
to <https://builds.apache.org/job/maven-plugin-tools-jdk-1.7/ws/maven-plugin-plugin/target/local-repo/org/apache/maven/plugins/maven-plugin-plugin/3.5-SNAPSHOT/maven-plugin-plugin-3.5-SNAPSHOT.jar>
[INFO] 
[INFO] --- maven-invoker-plugin:1.10:run (integration-test) @ maven-plugin-plugin ---
[INFO] Building: mplugin-305_singleMojoDependencies/pom.xml
[INFO] run script verify.groovy
[INFO] ..SUCCESS (9.3 s)
[INFO] Building: java-basic/pom.xml
[INFO] run script verify.groovy
[INFO] ..SUCCESS (8.4 s)
[INFO] Building: mplugin-187/pom.xml
[INFO] ..SUCCESS (3.3 s)
[INFO] Building: mplugin-305_defaultMojoDependencies/pom.xml
[INFO] run script verify.groovy
[INFO] ..SUCCESS (6.5 s)
[INFO] Building: help-package/pom.xml
[INFO] run script verify.bsh
[INFO] ..SUCCESS (4.7 s)
[INFO] Building: ant-basic/pom.xml
[INFO] run script verify.groovy
[INFO] ..SUCCESS (7.4 s)
[INFO] Building: ant-reference-parameter/pom.xml
[INFO] ..SUCCESS (8.0 s)
[INFO] Building: beanshell-simple/pom.xml
[INFO] run script verify.groovy
[INFO] ..SUCCESS (6.4 s)
[INFO] Building: help-basic/pom.xml
[INFO] run script verify.groovy
[INFO] ..SUCCESS (8.8 s)
[INFO] Building: packaging-jar/pom.xml
[INFO] run script verify.groovy
[INFO] ..SUCCESS (6.9 s)
[INFO] Building: plugin-info-jdk-default-version/pom.xml
[INFO] run script verify.groovy
[INFO] ..SUCCESS (5.0 s)
[INFO] Building: mplugin-305_emptyMojoDependencies/pom.xml
[INFO] run script verify.groovy
[INFO] ..SUCCESS (5.5 s)
[INFO] Building: ignore-plugin-class-realm/pom.xml
[INFO] ..SUCCESS (7.7 s)
[INFO] Building: ant-since-maven-plugin/pom.xml
[INFO] ..SUCCESS (4.1 s)
[INFO] Building: plugin-report-annotations/pom.xml
[INFO] run script verify.bsh
[INFO] ..SUCCESS (12.5 s)
[INFO] Building: mplugin-272_java8/pom.xml
[INFO] ..SKIPPED due to JRE version
[INFO] Building: mplugin-191/pom.xml
[INFO] run script verify.groovy
[INFO] ..SUCCESS (5.4 s)
[INFO] Building: skip/pom.xml
[INFO] run script verify.groovy
[INFO] ..SUCCESS (4.3 s)
[INFO] Building: plugin-report/pom.xml
[INFO] run script verify.bsh
[INFO] ..SUCCESS (18.9 s)
[INFO] Building: plugin-info-jdk/pom.xml
[INFO] run script verify.groovy
[INFO] ..SUCCESS (10.2 s)
[INFO] Building: ant-simple-usage/pom.xml
[INFO] ..SUCCESS (5.1 s)
[INFO] Building: java-basic-annotations-jdk8/pom.xml
[INFO] ..SKIPPED due to JRE version
[INFO] Building: mplugin-223/pom.xml
[INFO] run script verify.groovy
[INFO] ..SUCCESS (5.2 s)
[INFO] Building: fix-maven-since-3.x/pom.xml
[INFO] run script verify.groovy
[INFO] ..SUCCESS (14.0 s)
[INFO] Building: annotation-with-inheritance-from-deps/pom.xml
[INFO] run script verify.groovy
[INFO] ..SUCCESS (15.8 s)
[INFO] Building: source-encoding/pom.xml
[INFO] run script verify.groovy
[INFO] ..SUCCESS (5.0 s)
[INFO] Building: java-basic-annotations/pom.xml
[INFO] run script verify.groovy
[INFO] ..SUCCESS (11.0 s)
[INFO] Building: annotation-with-inheritance-reactor/pom.xml
[INFO] run script verify.groovy
[INFO] ..SUCCESS (10.7 s)
[INFO] Building: annotation-with-inheritance/pom.xml
[INFO] run script verify.groovy
[INFO] ..SUCCESS (18.0 s)
[INFO] -------------------------------------------------
[INFO] Build Summary:
[INFO]   Passed: 27, Failed: 0, Errors: 0, Skipped: 2
[INFO] -------------------------------------------------
[INFO] 
[INFO] --- maven-checkstyle-plugin:2.13:check (checkstyle-check) @ maven-plugin-plugin ---
[INFO] 
[INFO] 
[INFO] --- maven-install-plugin:2.5.2:install (default-install) @ maven-plugin-plugin ---
[INFO] Installing <https://builds.apache.org/job/maven-plugin-tools-jdk-1.7/ws/maven-plugin-plugin/target/maven-plugin-plugin-3.5-SNAPSHOT.jar>
to /home/jenkins/jenkins-slave/maven-repositories/1/org/apache/maven/plugins/maven-plugin-plugin/3.5-SNAPSHOT/maven-plugin-plugin-3.5-SNAPSHOT.jar
[INFO] Installing <https://builds.apache.org/job/maven-plugin-tools-jdk-1.7/ws/maven-plugin-plugin/pom.xml>
to /home/jenkins/jenkins-slave/maven-repositories/1/org/apache/maven/plugins/maven-plugin-plugin/3.5-SNAPSHOT/maven-plugin-plugin-3.5-SNAPSHOT.pom
[INFO] ------------------------------------------------------------------------
[INFO] Reactor Summary:
[INFO] 
[INFO] Maven Plugin Tools ................................ SUCCESS [7.293s]
[INFO] Maven Plugin Tools Extractor API .................. SUCCESS [11.586s]
[INFO] Maven Plugin Tools Generators ..................... SUCCESS [5.144s]
[INFO] Maven Plugin Tool for Java with Javadoc Tags ...... SUCCESS [3.451s]
[INFO] Maven Plugin Tools Java 5 Annotations ............. SUCCESS [2.317s]
[INFO] Maven Plugin Tool for Java with Annotations ....... SUCCESS [5.516s]
[INFO] Maven Plugin Tools Javadoc Taglets ................ FAILURE [5.453s]
[INFO] Maven Script Mojo Support ......................... SUCCESS [0.738s]
[INFO] Maven Plugin Metadata Model ....................... SUCCESS [2.403s]
[INFO] Maven Plugin Tool for Ant ......................... SUCCESS [1.920s]
[INFO] Maven Ant Mojo Support ............................ SUCCESS [3.243s]
[INFO] Maven Plugin Tool for Beanshell ................... SUCCESS [1.458s]
[INFO] Maven Beanshell Mojo Support ...................... SUCCESS [1.677s]
[INFO] Maven Plugin Plugin ............................... SUCCESS [3:56.150s]
[INFO] ------------------------------------------------------------------------
[INFO] BUILD FAILURE
[INFO] ------------------------------------------------------------------------
[INFO] Total time: 4:57.156s
[INFO] Finished at: Thu Aug 11 19:15:05 UTC 2016
[INFO] Final Memory: 56M/500M
[INFO] ------------------------------------------------------------------------
Waiting for Jenkins to finish collecting data
[ERROR] Failed to execute goal org.apache.maven.plugins:maven-invoker-plugin:1.10:run (integration-test)
on project maven-plugin-tools-javadoc: 1 build failed. See console output above for details.
-> [Help 1]
org.apache.maven.lifecycle.LifecycleExecutionException: Failed to execute goal org.apache.maven.plugins:maven-invoker-plugin:1.10:run
(integration-test) on project maven-plugin-tools-javadoc: 1 build failed. See console output
above for details.
	at org.apache.maven.lifecycle.internal.MojoExecutor.execute(MojoExecutor.java:213)
	at org.apache.maven.lifecycle.internal.MojoExecutor.execute(MojoExecutor.java:153)
	at org.apache.maven.lifecycle.internal.MojoExecutor.execute(MojoExecutor.java:145)
	at org.apache.maven.lifecycle.internal.LifecycleModuleBuilder.buildProject(LifecycleModuleBuilder.java:84)
	at org.apache.maven.lifecycle.internal.LifecycleModuleBuilder.buildProject(LifecycleModuleBuilder.java:59)
	at org.apache.maven.lifecycle.internal.LifecycleStarter.singleThreadedBuild(LifecycleStarter.java:183)
	at org.apache.maven.lifecycle.internal.LifecycleStarter.execute(LifecycleStarter.java:161)
	at org.apache.maven.DefaultMaven.doExecute(DefaultMaven.java:320)
	at org.apache.maven.DefaultMaven.execute(DefaultMaven.java:156)
	at org.jvnet.hudson.maven3.launcher.Maven3Launcher.main(Maven3Launcher.java:117)
	at sun.reflect.NativeMethodAccessorImpl.invoke0(Native Method)
	at sun.reflect.NativeMethodAccessorImpl.invoke(NativeMethodAccessorImpl.java:57)
	at sun.reflect.DelegatingMethodAccessorImpl.invoke(DelegatingMethodAccessorImpl.java:43)
	at java.lang.reflect.Method.invoke(Method.java:606)
	at org.codehaus.plexus.classworlds.launcher.Launcher.launchStandard(Launcher.java:329)
	at org.codehaus.plexus.classworlds.launcher.Launcher.launch(Launcher.java:239)
	at org.jvnet.hudson.maven3.agent.Maven3Main.launch(Maven3Main.java:181)
	at sun.reflect.NativeMethodAccessorImpl.invoke0(Native Method)
	at sun.reflect.NativeMethodAccessorImpl.invoke(NativeMethodAccessorImpl.java:57)
	at sun.reflect.DelegatingMethodAccessorImpl.invoke(DelegatingMethodAccessorImpl.java:43)
	at java.lang.reflect.Method.invoke(Method.java:606)
	at hudson.maven.Maven3Builder.call(Maven3Builder.java:136)
	at hudson.maven.Maven3Builder.call(Maven3Builder.java:71)
	at hudson.remoting.UserRequest.perform(UserRequest.java:120)
	at hudson.remoting.UserRequest.perform(UserRequest.java:48)
	at hudson.remoting.Request$2.run(Request.java:326)
	at hudson.remoting.InterceptingExecutorService$1.call(InterceptingExecutorService.java:68)
	at java.util.concurrent.FutureTask.run(FutureTask.java:262)
	at java.util.concurrent.ThreadPoolExecutor.runWorker(ThreadPoolExecutor.java:1145)
	at java.util.concurrent.ThreadPoolExecutor$Worker.run(ThreadPoolExecutor.java:615)
	at java.lang.Thread.run(Thread.java:745)
Caused by: org.apache.maven.plugin.MojoFailureException: 1 build failed. See console output
above for details.
	at org.apache.maven.plugin.invoker.InvokerSession.handleFailures(InvokerSession.java:258)
	at org.apache.maven.plugin.invoker.InvokerMojo.processResults(InvokerMojo.java:69)
	at org.apache.maven.plugin.invoker.AbstractInvokerMojo.execute(AbstractInvokerMojo.java:741)
	at org.apache.maven.plugin.DefaultBuildPluginManager.executeMojo(DefaultBuildPluginManager.java:101)
	at org.apache.maven.lifecycle.internal.MojoExecutor.execute(MojoExecutor.java:209)
	... 30 more
[ERROR] 
[ERROR] Re-run Maven using the -X switch to enable full debug logging.
[JENKINS] Archiving <https://builds.apache.org/job/maven-plugin-tools-jdk-1.7/ws/maven-plugin-tools-api/pom.xml>
to org.apache.maven.plugin-tools/maven-plugin-tools-api/3.5-SNAPSHOT/maven-plugin-tools-api-3.5-SNAPSHOT.pom
[JENKINS] Archiving <https://builds.apache.org/job/maven-plugin-tools-jdk-1.7/ws/maven-plugin-tools-api/target/maven-plugin-tools-api-3.5-SNAPSHOT.jar>
to org.apache.maven.plugin-tools/maven-plugin-tools-api/3.5-SNAPSHOT/maven-plugin-tools-api-3.5-SNAPSHOT.jar
[ERROR] 
[ERROR] For more information about the errors and possible solutions, please read the following
articles:
[ERROR] [Help 1] http://cwiki.apache.org/confluence/display/MAVEN/MojoFailureException
[ERROR] 
[ERROR] After correcting the problems, you can resume the build with the command
[ERROR]   mvn <goals> -rf :maven-plugin-tools-javadoc
[JENKINS] Archiving <https://builds.apache.org/job/maven-plugin-tools-jdk-1.7/ws/maven-plugin-tools-generators/pom.xml>
to org.apache.maven.plugin-tools/maven-plugin-tools-generators/3.5-SNAPSHOT/maven-plugin-tools-generators-3.5-SNAPSHOT.pom
[JENKINS] Archiving <https://builds.apache.org/job/maven-plugin-tools-jdk-1.7/ws/maven-plugin-tools-generators/target/maven-plugin-tools-generators-3.5-SNAPSHOT.jar>
to org.apache.maven.plugin-tools/maven-plugin-tools-generators/3.5-SNAPSHOT/maven-plugin-tools-generators-3.5-SNAPSHOT.jar
[JENKINS] Archiving <https://builds.apache.org/job/maven-plugin-tools-jdk-1.7/ws/maven-script/pom.xml>
to org.apache.maven.plugin-tools/maven-script/3.5-SNAPSHOT/maven-script-3.5-SNAPSHOT.pom
[JENKINS] Archiving <https://builds.apache.org/job/maven-plugin-tools-jdk-1.7/ws/maven-script/target/maven-script-3.5-SNAPSHOT-site.xml>
to org.apache.maven.plugin-tools/maven-script/3.5-SNAPSHOT/maven-script-3.5-SNAPSHOT-site.xml
[JENKINS] Archiving <https://builds.apache.org/job/maven-plugin-tools-jdk-1.7/ws/maven-plugin-annotations/pom.xml>
to org.apache.maven.plugin-tools/maven-plugin-annotations/3.5-SNAPSHOT/maven-plugin-annotations-3.5-SNAPSHOT.pom
[JENKINS] Archiving <https://builds.apache.org/job/maven-plugin-tools-jdk-1.7/ws/maven-plugin-annotations/target/maven-plugin-annotations-3.5-SNAPSHOT.jar>
to org.apache.maven.plugin-tools/maven-plugin-annotations/3.5-SNAPSHOT/maven-plugin-annotations-3.5-SNAPSHOT.jar
[JENKINS] Archiving <https://builds.apache.org/job/maven-plugin-tools-jdk-1.7/ws/maven-plugin-plugin/pom.xml>
to org.apache.maven.plugins/maven-plugin-plugin/3.5-SNAPSHOT/maven-plugin-plugin-3.5-SNAPSHOT.pom
[JENKINS] Archiving <https://builds.apache.org/job/maven-plugin-tools-jdk-1.7/ws/maven-plugin-plugin/target/maven-plugin-plugin-3.5-SNAPSHOT.jar>
to org.apache.maven.plugins/maven-plugin-plugin/3.5-SNAPSHOT/maven-plugin-plugin-3.5-SNAPSHOT.jar
[JENKINS] Archiving <https://builds.apache.org/job/maven-plugin-tools-jdk-1.7/ws/pom.xml>
to org.apache.maven.plugin-tools/maven-plugin-tools/3.5-SNAPSHOT/maven-plugin-tools-3.5-SNAPSHOT.pom
[JENKINS] Archiving <https://builds.apache.org/job/maven-plugin-tools-jdk-1.7/ws/target/maven-plugin-tools-3.5-SNAPSHOT-site.xml>
to org.apache.maven.plugin-tools/maven-plugin-tools/3.5-SNAPSHOT/maven-plugin-tools-3.5-SNAPSHOT-site.xml
[JENKINS] Archiving <https://builds.apache.org/job/maven-plugin-tools-jdk-1.7/ws/maven-script/maven-plugin-tools-model/pom.xml>
to org.apache.maven.plugin-tools/maven-plugin-tools-model/3.5-SNAPSHOT/maven-plugin-tools-model-3.5-SNAPSHOT.pom
[JENKINS] Archiving <https://builds.apache.org/job/maven-plugin-tools-jdk-1.7/ws/maven-script/maven-plugin-tools-model/target/maven-plugin-tools-model-3.5-SNAPSHOT.jar>
to org.apache.maven.plugin-tools/maven-plugin-tools-model/3.5-SNAPSHOT/maven-plugin-tools-model-3.5-SNAPSHOT.jar
[JENKINS] Archiving <https://builds.apache.org/job/maven-plugin-tools-jdk-1.7/ws/maven-script/maven-plugin-tools-ant/pom.xml>
to org.apache.maven.plugin-tools/maven-plugin-tools-ant/3.5-SNAPSHOT/maven-plugin-tools-ant-3.5-SNAPSHOT.pom
[JENKINS] Archiving <https://builds.apache.org/job/maven-plugin-tools-jdk-1.7/ws/maven-script/maven-plugin-tools-ant/target/maven-plugin-tools-ant-3.5-SNAPSHOT.jar>
to org.apache.maven.plugin-tools/maven-plugin-tools-ant/3.5-SNAPSHOT/maven-plugin-tools-ant-3.5-SNAPSHOT.jar
[JENKINS] Archiving <https://builds.apache.org/job/maven-plugin-tools-jdk-1.7/ws/maven-plugin-tools-annotations/pom.xml>
to org.apache.maven.plugin-tools/maven-plugin-tools-annotations/3.5-SNAPSHOT/maven-plugin-tools-annotations-3.5-SNAPSHOT.pom
[JENKINS] Archiving <https://builds.apache.org/job/maven-plugin-tools-jdk-1.7/ws/maven-plugin-tools-annotations/target/maven-plugin-tools-annotations-3.5-SNAPSHOT.jar>
to org.apache.maven.plugin-tools/maven-plugin-tools-annotations/3.5-SNAPSHOT/maven-plugin-tools-annotations-3.5-SNAPSHOT.jar
[JENKINS] Archiving <https://builds.apache.org/job/maven-plugin-tools-jdk-1.7/ws/maven-plugin-tools-annotations/target/maven-plugin-tools-annotations-3.5-SNAPSHOT-tests.jar>
to org.apache.maven.plugin-tools/maven-plugin-tools-annotations/3.5-SNAPSHOT/maven-plugin-tools-annotations-3.5-SNAPSHOT-tests.jar
[JENKINS] Archiving <https://builds.apache.org/job/maven-plugin-tools-jdk-1.7/ws/maven-plugin-tools-annotations/target/maven-plugin-tools-annotations-3.5-SNAPSHOT-test-sources.jar>
to org.apache.maven.plugin-tools/maven-plugin-tools-annotations/3.5-SNAPSHOT/maven-plugin-tools-annotations-3.5-SNAPSHOT-test-sources.jar
[JENKINS] Archiving <https://builds.apache.org/job/maven-plugin-tools-jdk-1.7/ws/maven-script/maven-script-ant/pom.xml>
to org.apache.maven.plugin-tools/maven-script-ant/3.5-SNAPSHOT/maven-script-ant-3.5-SNAPSHOT.pom
[JENKINS] Archiving <https://builds.apache.org/job/maven-plugin-tools-jdk-1.7/ws/maven-script/maven-script-ant/target/maven-script-ant-3.5-SNAPSHOT.jar>
to org.apache.maven.plugin-tools/maven-script-ant/3.5-SNAPSHOT/maven-script-ant-3.5-SNAPSHOT.jar
[JENKINS] Archiving <https://builds.apache.org/job/maven-plugin-tools-jdk-1.7/ws/maven-script/maven-plugin-tools-beanshell/pom.xml>
to org.apache.maven.plugin-tools/maven-plugin-tools-beanshell/3.5-SNAPSHOT/maven-plugin-tools-beanshell-3.5-SNAPSHOT.pom
[JENKINS] Archiving <https://builds.apache.org/job/maven-plugin-tools-jdk-1.7/ws/maven-script/maven-plugin-tools-beanshell/target/maven-plugin-tools-beanshell-3.5-SNAPSHOT.jar>
to org.apache.maven.plugin-tools/maven-plugin-tools-beanshell/3.5-SNAPSHOT/maven-plugin-tools-beanshell-3.5-SNAPSHOT.jar
[JENKINS] Archiving <https://builds.apache.org/job/maven-plugin-tools-jdk-1.7/ws/maven-script/maven-script-beanshell/pom.xml>
to org.apache.maven.plugin-tools/maven-script-beanshell/3.5-SNAPSHOT/maven-script-beanshell-3.5-SNAPSHOT.pom
[JENKINS] Archiving <https://builds.apache.org/job/maven-plugin-tools-jdk-1.7/ws/maven-script/maven-script-beanshell/target/maven-script-beanshell-3.5-SNAPSHOT.jar>
to org.apache.maven.plugin-tools/maven-script-beanshell/3.5-SNAPSHOT/maven-script-beanshell-3.5-SNAPSHOT.jar
[JENKINS] Archiving <https://builds.apache.org/job/maven-plugin-tools-jdk-1.7/ws/maven-plugin-tools-java/pom.xml>
to org.apache.maven.plugin-tools/maven-plugin-tools-java/3.5-SNAPSHOT/maven-plugin-tools-java-3.5-SNAPSHOT.pom
[JENKINS] Archiving <https://builds.apache.org/job/maven-plugin-tools-jdk-1.7/ws/maven-plugin-tools-java/target/maven-plugin-tools-java-3.5-SNAPSHOT.jar>
to org.apache.maven.plugin-tools/maven-plugin-tools-java/3.5-SNAPSHOT/maven-plugin-tools-java-3.5-SNAPSHOT.jar
[JENKINS] Archiving <https://builds.apache.org/job/maven-plugin-tools-jdk-1.7/ws/maven-plugin-tools-javadoc/pom.xml>
to org.apache.maven.plugin-tools/maven-plugin-tools-javadoc/3.5-SNAPSHOT/maven-plugin-tools-javadoc-3.5-SNAPSHOT.pom
[JENKINS] Archiving <https://builds.apache.org/job/maven-plugin-tools-jdk-1.7/ws/maven-plugin-tools-javadoc/target/maven-plugin-tools-javadoc-3.5-SNAPSHOT.jar>
to org.apache.maven.plugin-tools/maven-plugin-tools-javadoc/3.5-SNAPSHOT/maven-plugin-tools-javadoc-3.5-SNAPSHOT.jar
channel stopped

Mime
View raw message