maven-notifications mailing list archives

Site index · List index
Message view « Date » · « Thread »
Top « Date » · « Thread »
From Apache Jenkins Server <jenk...@builds.apache.org>
Subject Build failed in Jenkins: maven-plugin-tools-m2 #202
Date Tue, 02 Aug 2016 20:21:05 GMT
See <https://builds.apache.org/job/maven-plugin-tools-m2/202/changes>

Changes:

[Robert Scholte] [MPLUGIN-305] MojoAnnotationsScanner should have better control over dependency
scanning
Introduce parameter mojoDependencies

------------------------------------------
[...truncated 2593 lines...]
        </li>
       </ul>
        
       Only makes sense to use in conjunction with the <code>parallel</code> parameter.
       The default value <code>0</code> behaves same as unspecified one.]]]],
parameter[attributes={}; value=[name[attributes={}; value=[threadCountMethods]], type[attributes={};
value=[int]], since[attributes={}; value=[2.16]], required[attributes={}; value=[false]],
editable[attributes={}; value=[true]], description[attributes={}; value=[(JUnit 4.7 provider)
This attribute allows you to specify the concurrency in test methods, i.e.:
       <ul>
       <li>number of concurrent methods if <code>threadCount</code> is 0
or unspecified</li>
       <li>limited concurrency of methods if <code>useUnlimitedThreads</code>
is set to <strong>true</strong></li>
       <li>if <code>threadCount</code> and certain thread-count parameters
are &gt; 0 for <code>parallel</code>, the
       concurrency is computed from ratio. For instance parallel=all and the ratio between
       <code>threadCountSuites</code>:<code>threadCountClasses</code>:<em>threadCountMethods</em>
is 2:3:<em>5</em>,
       there is 50% of <code>threadCount</code> in concurrent methods.</li>
       <li>as in the previous case but without this leaf thread-count. Example: parallel=all,
threadCount=16,
       threadCountSuites=2, threadCountClasses=3, but threadCountMethods is unspecified leaf,
the number of concurrent
       methods is varying from &gt;= 11 to 14 or 15. The threadCountSuites and threadCountClasses
become number of
       threads.</li>
       </ul>
       Only makes sense to use in conjunction with the <code>parallel</code> parameter.
The default value <code>0</code>
       behaves same as unspecified one.]]]], parameter[attributes={}; value=[name[attributes={};
value=[threadCountSuites]], type[attributes={}; value=[int]], since[attributes={}; value=[2.16]],
required[attributes={}; value=[false]], editable[attributes={}; value=[true]], description[attributes={};
value=[(JUnit 4.7 provider) This attribute allows you to specify the concurrency in test suites,
i.e.:
       <ul>
        <li>number of concurrent suites if <code>threadCount</code> is 0
or unspecified</li>
        <li>limited suites concurrency if <code>useUnlimitedThreads</code>
is set to <strong>true</strong></li>
        <li>if <code>threadCount</code> and certain thread-count parameters
are &gt; 0 for <code>parallel</code>, the
        concurrency is computed from ratio. For instance parallel=all and the ratio between
            <em>threadCountSuites</em>:<code>threadCountClasses</code>:<code>threadCountMethods</code>
is
            <em>2</em>:3:5, there is 20% of <code>threadCount</code>
in concurrent suites.</li>
       </ul>
        
       Only makes sense to use in conjunction with the <code>parallel</code> parameter.
       The default value <code>0</code> behaves same as unspecified one.]]]],
parameter[attributes={}; value=[name[attributes={}; value=[trimStackTrace]], type[attributes={};
value=[boolean]], since[attributes={}; value=[2.2]], required[attributes={}; value=[false]],
editable[attributes={}; value=[true]], description[attributes={}; value=[Whether to trim the
stack trace in the reports to just the lines within the test, or show the full trace.]]]],
parameter[attributes={}; value=[name[attributes={}; value=[useUnlimitedThreads]], type[attributes={};
value=[boolean]], since[attributes={}; value=[2.5]], required[attributes={}; value=[false]],
editable[attributes={}; value=[true]], description[attributes={}; value=[(JUnit 4.7 provider)
Indicates that the thread pool will be unlimited. The <code>parallel</code> parameter
and
       the actual number of classes/methods will decide. Setting this to "true" effectively
disables
       <code>perCoreThreadCount</code> and <code>threadCount</code>.
Defaults to "false".]]]], parameter[attributes={}; value=[name[attributes={}; value=[workingDirectory]],
type[attributes={}; value=[java.io.File]], since[attributes={}; value=[2.1.3]], required[attributes={};
value=[false]], editable[attributes={}; value=[true]], description[attributes={}; value=[Command
line working directory.]]]], parameter[attributes={}; value=[name[attributes={}; value=[project]],
type[attributes={}; value=[org.apache.maven.project.MavenProject]], required[attributes={};
value=[true]], editable[attributes={}; value=[false]], description[attributes={}; value=[]]]],
parameter[attributes={}; value=[name[attributes={}; value=[session]], type[attributes={};
value=[org.apache.maven.execution.MavenSession]], required[attributes={}; value=[true]], editable[attributes={};
value=[false]], description[attributes={}; value=[]]]]]], configuration[attributes={}; value=[additionalClasspathElements[attributes={implementation=java.lang.String[]};
value=[${maven.test.additionalClasspath}]], argLine[attributes={implementation=java.lang.String};
value=[${argLine}]], basedir[attributes={implementation=java.io.File, default-value=${basedir}};
value=[]], childDelegation[attributes={implementation=boolean, default-value=false}; value=[${childDelegation}]],
classpathDependencyExcludes[attributes={implementation=java.lang.String[]}; value=[${maven.test.dependency.excludes}]],
dependenciesToScan[attributes={implementation=java.lang.String[]}; value=[${dependenciesToScan}]],
disableXmlReport[attributes={implementation=boolean, default-value=false}; value=[${disableXmlReport}]],
enableAssertions[attributes={implementation=boolean, default-value=true}; value=[${enableAssertions}]],
excludedGroups[attributes={implementation=java.lang.String}; value=[${excludedGroups}]], failIfNoTests[attributes={implementation=java.lang.Boolean};
value=[${failIfNoTests}]], forkCount[attributes={implementation=java.lang.String, default-value=1};
value=[${forkCount}]], forkMode[attributes={implementation=java.lang.String, default-value=once};
value=[${forkMode}]], groups[attributes={implementation=java.lang.String}; value=[${groups}]],
junitArtifactName[attributes={implementation=java.lang.String, default-value=junit:junit};
value=[${junitArtifactName}]], jvm[attributes={implementation=java.lang.String}; value=[${jvm}]],
localRepository[attributes={implementation=org.apache.maven.artifact.repository.ArtifactRepository,
default-value=${localRepository}}; value=[]], objectFactory[attributes={implementation=java.lang.String};
value=[${objectFactory}]], parallel[attributes={implementation=java.lang.String}; value=[${parallel}]],
parallelMavenExecution[attributes={implementation=java.lang.Boolean, default-value=${session.parallel}};
value=[]], parallelOptimized[attributes={implementation=boolean, default-value=true}; value=[${parallelOptimized}]],
perCoreThreadCount[attributes={implementation=boolean, default-value=true}; value=[${perCoreThreadCount}]],
pluginArtifactMap[attributes={implementation=java.util.Map}; value=[${plugin.artifactMap}]],
pluginDescriptor[attributes={implementation=org.apache.maven.plugin.descriptor.PluginDescriptor,
default-value=${plugin}}; value=[]], projectArtifactMap[attributes={implementation=java.util.Map};
value=[${project.artifactMap}]], redirectTestOutputToFile[attributes={implementation=boolean,
default-value=false}; value=[${maven.test.redirectTestOutputToFile}]], remoteRepositories[attributes={implementation=java.util.List,
default-value=${project.pluginArtifactRepositories}}; value=[]], reportNameSuffix[attributes={implementation=java.lang.String,
default-value=}; value=[${surefire.reportNameSuffix}]], reuseForks[attributes={implementation=boolean,
default-value=true}; value=[${reuseForks}]], skip[attributes={implementation=boolean, default-value=false};
value=[${maven.test.skip}]], skipExec[attributes={implementation=boolean}; value=[${maven.test.skip.exec}]],
skipTests[attributes={implementation=boolean, default-value=false}; value=[${skipTests}]],
testClassesDirectory[attributes={implementation=java.io.File, default-value=${project.build.testOutputDirectory}};
value=[]], testNGArtifactName[attributes={implementation=java.lang.String, default-value=org.testng:testng};
value=[${testNGArtifactName}]], testSourceDirectory[attributes={implementation=java.io.File,
default-value=${project.build.testSourceDirectory}}; value=[]], threadCount[attributes={implementation=int};
value=[${threadCount}]], threadCountClasses[attributes={implementation=int, default-value=0};
value=[${threadCountClasses}]], threadCountMethods[attributes={implementation=int, default-value=0};
value=[${threadCountMethods}]], threadCountSuites[attributes={implementation=int, default-value=0};
value=[${threadCountSuites}]], trimStackTrace[attributes={implementation=boolean, default-value=true};
value=[${trimStackTrace}]], useUnlimitedThreads[attributes={implementation=boolean, default-value=false};
value=[${useUnlimitedThreads}]], workingDirectory[attributes={implementation=java.io.File};
value=[${basedir}]], project[attributes={implementation=org.apache.maven.project.MavenProject,
default-value=${project}}; value=[]], session[attributes={implementation=org.apache.maven.execution.MavenSession,
default-value=${session}}; value=[]]]], requirements[attributes={}; value=[requirement[attributes={};
value=[role[attributes={}; value=[org.apache.maven.artifact.factory.ArtifactFactory]], field-name[attributes={};
value=[artifactFactory]]]], requirement[attributes={}; value=[role[attributes={}; value=[org.apache.maven.artifact.resolver.ArtifactResolver]],
field-name[attributes={}; value=[artifactResolver]]]], requirement[attributes={}; value=[role[attributes={};
value=[org.apache.maven.artifact.metadata.ArtifactMetadataSource]], field-name[attributes={};
value=[metadataSource]]]], requirement[attributes={}; value=[role[attributes={}; value=[org.apache.maven.toolchain.ToolchainManager]],
field-name[attributes={}; value=[toolchainManager]]]]]]]]]], dependencies[attributes={}; value=[dependency[attributes={};
value=[groupId[attributes={}; value=[org.apache.maven]], artifactId[attributes={}; value=[maven-plugin-api]],
type[attributes={}; value=[jar]], version[attributes={}; value=[2.2.1]]]], dependency[attributes={};
value=[groupId[attributes={}; value=[org.apache.maven]], artifactId[attributes={}; value=[maven-artifact]],
type[attributes={}; value=[jar]], version[attributes={}; value=[3.0]]]], dependency[attributes={};
value=[groupId[attributes={}; value=[org.codehaus.plexus]], artifactId[attributes={}; value=[plexus-utils]],
type[attributes={}; value=[jar]], version[attributes={}; value=[1.5.15]]]], dependency[attributes={};
value=[groupId[attributes={}; value=[org.apache.maven.surefire]], artifactId[attributes={};
value=[maven-surefire-common]], type[attributes={}; value=[jar]], version[attributes={}; value=[2.19.1]]]],
dependency[attributes={}; value=[groupId[attributes={}; value=[org.apache.maven.surefire]],
artifactId[attributes={}; value=[surefire-api]], type[attributes={}; value=[jar]], version[attributes={};
value=[2.19.1]]]], dependency[attributes={}; value=[groupId[attributes={}; value=[org.apache.maven.surefire]],
artifactId[attributes={}; value=[surefire-booter]], type[attributes={}; value=[jar]], version[attributes={};
value=[2.19.1]]]], dependency[attributes={}; value=[groupId[attributes={}; value=[org.apache.maven]],
artifactId[attributes={}; value=[maven-plugin-descriptor]], type[attributes={}; value=[jar]],
version[attributes={}; value=[2.2.1]]]], dependency[attributes={}; value=[groupId[attributes={};
value=[org.codehaus.plexus]], artifactId[attributes={}; value=[plexus-container-default]],
type[attributes={}; value=[jar]], version[attributes={}; value=[1.0-alpha-9-stable-1]]]],
dependency[attributes={}; value=[groupId[attributes={}; value=[junit]], artifactId[attributes={};
value=[junit]], type[attributes={}; value=[jar]], version[attributes={}; value=[3.8.1]]]],
dependency[attributes={}; value=[groupId[attributes={}; value=[classworlds]], artifactId[attributes={};
value=[classworlds]], type[attributes={}; value=[jar]], version[attributes={}; value=[1.1]]]],
dependency[attributes={}; value=[groupId[attributes={}; value=[org.apache.maven]], artifactId[attributes={};
value=[maven-project]], type[attributes={}; value=[jar]], version[attributes={}; value=[2.2.1]]]],
dependency[attributes={}; value=[groupId[attributes={}; value=[org.apache.maven]], artifactId[attributes={};
value=[maven-settings]], type[attributes={}; value=[jar]], version[attributes={}; value=[2.2.1]]]],
dependency[attributes={}; value=[groupId[attributes={}; value=[org.apache.maven]], artifactId[attributes={};
value=[maven-model]], type[attributes={}; value=[jar]], version[attributes={}; value=[2.2.1]]]],
dependency[attributes={}; value=[groupId[attributes={}; value=[org.codehaus.plexus]], artifactId[attributes={};
value=[plexus-interpolation]], type[attributes={}; value=[jar]], version[attributes={}; value=[1.11]]]],
dependency[attributes={}; value=[groupId[attributes={}; value=[org.apache.maven]], artifactId[attributes={};
value=[maven-profile]], type[attributes={}; value=[jar]], version[attributes={}; value=[2.2.1]]]],
dependency[attributes={}; value=[groupId[attributes={}; value=[org.apache.maven]], artifactId[attributes={};
value=[maven-artifact-manager]], type[attributes={}; value=[jar]], version[attributes={};
value=[2.2.1]]]], dependency[attributes={}; value=[groupId[attributes={}; value=[org.apache.maven]],
artifactId[attributes={}; value=[maven-repository-metadata]], type[attributes={}; value=[jar]],
version[attributes={}; value=[2.2.1]]]], dependency[attributes={}; value=[groupId[attributes={};
value=[org.apache.maven.wagon]], artifactId[attributes={}; value=[wagon-provider-api]], type[attributes={};
value=[jar]], version[attributes={}; value=[1.0-beta-6]]]], dependency[attributes={}; value=[groupId[attributes={};
value=[backport-util-concurrent]], artifactId[attributes={}; value=[backport-util-concurrent]],
type[attributes={}; value=[jar]], version[attributes={}; value=[3.1]]]], dependency[attributes={};
value=[groupId[attributes={}; value=[org.apache.maven]], artifactId[attributes={}; value=[maven-plugin-registry]],
type[attributes={}; value=[jar]], version[attributes={}; value=[2.2.1]]]], dependency[attributes={};
value=[groupId[attributes={}; value=[org.apache.maven]], artifactId[attributes={}; value=[maven-core]],
type[attributes={}; value=[jar]], version[attributes={}; value=[2.2.1]]]], dependency[attributes={};
value=[groupId[attributes={}; value=[org.apache.maven]], artifactId[attributes={}; value=[maven-plugin-parameter-documenter]],
type[attributes={}; value=[jar]], version[attributes={}; value=[2.2.1]]]], dependency[attributes={};
value=[groupId[attributes={}; value=[org.apache.maven.wagon]], artifactId[attributes={}; value=[wagon-http]],
type[attributes={}; value=[jar]], version[attributes={}; value=[1.0-beta-6]]]], dependency[attributes={};
value=[groupId[attributes={}; value=[org.apache.maven.wagon]], artifactId[attributes={}; value=[wagon-http-shared]],
type[attributes={}; value=[jar]], version[attributes={}; value=[1.0-beta-6]]]], dependency[attributes={};
value=[groupId[attributes={}; value=[nekohtml]], artifactId[attributes={}; value=[xercesMinimal]],
type[attributes={}; value=[jar]], version[attributes={}; value=[1.9.6.2]]]], dependency[attributes={};
value=[groupId[attributes={}; value=[nekohtml]], artifactId[attributes={}; value=[nekohtml]],
type[attributes={}; value=[jar]], version[attributes={}; value=[1.9.6.2]]]], dependency[attributes={};
value=[groupId[attributes={}; value=[commons-httpclient]], artifactId[attributes={}; value=[commons-httpclient]],
type[attributes={}; value=[jar]], version[attributes={}; value=[3.1]]]], dependency[attributes={};
value=[groupId[attributes={}; value=[commons-codec]], artifactId[attributes={}; value=[commons-codec]],
type[attributes={}; value=[jar]], version[attributes={}; value=[1.2]]]], dependency[attributes={};
value=[groupId[attributes={}; value=[org.apache.maven.wagon]], artifactId[attributes={}; value=[wagon-webdav-jackrabbit]],
type[attributes={}; value=[jar]], version[attributes={}; value=[1.0-beta-6]]]], dependency[attributes={};
value=[groupId[attributes={}; value=[org.apache.jackrabbit]], artifactId[attributes={}; value=[jackrabbit-webdav]],
type[attributes={}; value=[jar]], version[attributes={}; value=[1.5.0]]]], dependency[attributes={};
value=[groupId[attributes={}; value=[org.apache.jackrabbit]], artifactId[attributes={}; value=[jackrabbit-jcr-commons]],
type[attributes={}; value=[jar]], version[attributes={}; value=[1.5.0]]]], dependency[attributes={};
value=[groupId[attributes={}; value=[org.slf4j]], artifactId[attributes={}; value=[slf4j-api]],
type[attributes={}; value=[jar]], version[attributes={}; value=[1.5.6]]]], dependency[attributes={};
value=[groupId[attributes={}; value=[org.slf4j]], artifactId[attributes={}; value=[slf4j-nop]],
type[attributes={}; value=[jar]], version[attributes={}; value=[1.5.3]]]], dependency[attributes={};
value=[groupId[attributes={}; value=[org.slf4j]], artifactId[attributes={}; value=[slf4j-jdk14]],
type[attributes={}; value=[jar]], version[attributes={}; value=[1.5.6]]]], dependency[attributes={};
value=[groupId[attributes={}; value=[org.slf4j]], artifactId[attributes={}; value=[jcl-over-slf4j]],
type[attributes={}; value=[jar]], version[attributes={}; value=[1.5.6]]]], dependency[attributes={};
value=[groupId[attributes={}; value=[org.apache.maven.reporting]], artifactId[attributes={};
value=[maven-reporting-api]], type[attributes={}; value=[jar]], version[attributes={}; value=[2.2.1]]]],
dependency[attributes={}; value=[groupId[attributes={}; value=[org.apache.maven.doxia]], artifactId[attributes={};
value=[doxia-logging-api]], type[attributes={}; value=[jar]], version[attributes={}; value=[1.1]]]],
dependency[attributes={}; value=[groupId[attributes={}; value=[org.apache.maven]], artifactId[attributes={};
value=[maven-error-diagnostics]], type[attributes={}; value=[jar]], version[attributes={};
value=[2.2.1]]]], dependency[attributes={}; value=[groupId[attributes={}; value=[org.apache.maven]],
artifactId[attributes={}; value=[maven-monitor]], type[attributes={}; value=[jar]], version[attributes={};
value=[2.2.1]]]], dependency[attributes={}; value=[groupId[attributes={}; value=[org.sonatype.plexus]],
artifactId[attributes={}; value=[plexus-sec-dispatcher]], type[attributes={}; value=[jar]],
version[attributes={}; value=[1.3]]]], dependency[attributes={}; value=[groupId[attributes={};
value=[org.sonatype.plexus]], artifactId[attributes={}; value=[plexus-cipher]], type[attributes={};
value=[jar]], version[attributes={}; value=[1.4]]]], dependency[attributes={}; value=[groupId[attributes={};
value=[org.apache.maven]], artifactId[attributes={}; value=[maven-toolchain]], type[attributes={};
value=[jar]], version[attributes={}; value=[2.2.1]]]], dependency[attributes={}; value=[groupId[attributes={};
value=[org.apache.commons]], artifactId[attributes={}; value=[commons-lang3]], type[attributes={};
value=[jar]], version[attributes={}; value=[3.1]]]]]]]]
[INFO] Building: mplugin-191/pom.xml
[INFO] run script verify.groovy
[INFO] ..SUCCESS (12.3 s)
[INFO] Building: help-package/pom.xml
[INFO] run script verify.bsh
[INFO] ..SUCCESS (10.9 s)
[INFO] Building: source-encoding/pom.xml
[INFO] run script verify.groovy
[INFO] ..SUCCESS (15.0 s)
[INFO] Building: ant-since-maven-plugin/pom.xml
[INFO] ..SUCCESS (9.3 s)
[INFO] Building: ignore-plugin-class-realm/pom.xml
[INFO] ..SUCCESS (17.9 s)
[INFO] Building: plugin-report/pom.xml
[INFO] run script verify.bsh
[INFO] ..SUCCESS (41.3 s)
[INFO] Building: fix-maven-since-3.x/pom.xml
[INFO] ..SKIPPED due to Maven version
[INFO] Building: ant-simple-usage/pom.xml
[INFO] ..SUCCESS (11.1 s)
[INFO] Building: beanshell-simple/pom.xml
[INFO] run script verify.groovy
[INFO] ..SUCCESS (12.4 s)
[INFO] Building: mplugin-305_singleMojoDependencies/pom.xml
[INFO] run script verify.groovy
[INFO] ..SUCCESS (12.5 s)
[INFO] Building: skip/pom.xml
[INFO] run script verify.groovy
[INFO] ..SUCCESS (8.7 s)
[INFO] Building: mplugin-187/pom.xml
[INFO] ..SUCCESS (7.0 s)
[INFO] Building: mplugin-305_defaultMojoDependencies/pom.xml
[INFO] run script verify.groovy
[INFO] ..SUCCESS (12.5 s)
[INFO] Building: plugin-info-jdk-default-version/pom.xml
[INFO] run script verify.groovy
[INFO] ..SUCCESS (11.1 s)
[INFO] Building: plugin-info-jdk/pom.xml
[INFO] run script verify.groovy
[INFO] ..SUCCESS (25.5 s)
[INFO] Building: plugin-report-annotations/pom.xml
[INFO] run script verify.bsh
[INFO] ..SUCCESS (24.1 s)
[INFO] Building: ant-basic/pom.xml
[INFO] run script verify.groovy
[INFO] ..SUCCESS (13.9 s)
[INFO] Building: annotation-with-inheritance-from-deps/pom.xml
[INFO] run script verify.groovy
[INFO] ..SUCCESS (32.1 s)
[INFO] Building: help-basic/pom.xml
[INFO] ..SKIPPED due to Maven version
[INFO] Building: annotation-with-inheritance-reactor/pom.xml
[INFO] run script verify.groovy
[INFO] ..SUCCESS (21.2 s)
[INFO] Building: annotation-with-inheritance/pom.xml
[INFO] run script verify.groovy
[INFO] ..SUCCESS (34.8 s)
[INFO] Building: java-basic-annotations-jdk8/pom.xml
[INFO] ..SKIPPED due to JRE version
[INFO] Building: java-basic-annotations/pom.xml
[INFO] run script verify.groovy
[INFO] ..SUCCESS (24.8 s)
[INFO] Building: mplugin-223/pom.xml
[INFO] run script verify.groovy
[INFO] ..SUCCESS (11.7 s)
[INFO] -------------------------------------------------
[INFO] Build Summary:
[INFO]   Passed: 24, Failed: 1, Errors: 0, Skipped: 4
[INFO] -------------------------------------------------
[ERROR] The following builds failed:
[ERROR] *  mplugin-305_emptyMojoDependencies/pom.xml
[INFO] -------------------------------------------------
[INFO] 
[INFO] 
[INFO] ------------------------------------------------------------------------
[INFO] Reactor Summary:
[INFO] ------------------------------------------------------------------------
[INFO] Maven Plugin Tools .................................... SUCCESS [17.990s]
[INFO] Maven Plugin Tools Extractor API ...................... SUCCESS [15.322s]
[INFO] Maven Plugin Tools Generators ......................... SUCCESS [12.528s]
[INFO] Maven Plugin Tool for Java with Javadoc Tags .......... SUCCESS [8.101s]
[INFO] Maven Plugin Tools Java 5 Annotations ................. SUCCESS [2.427s]
[INFO] Maven Plugin Tool for Java with Annotations ........... SUCCESS [8.250s]
[INFO] Maven Plugin Tools Javadoc Taglets .................... FAILED [7.932s]
[INFO] Maven Script Mojo Support ............................. SUCCESS [0.996s]
[INFO] Maven Plugin Metadata Model ........................... SUCCESS [7.154s]
[INFO] Maven Plugin Tool for Ant ............................. SUCCESS [4.962s]
[INFO] Maven Ant Mojo Support ................................ SUCCESS [6.416s]
[INFO] Maven Plugin Tool for Beanshell ....................... SUCCESS [2.795s]
[INFO] Maven Beanshell Mojo Support .......................... SUCCESS [2.936s]
[INFO] Maven Plugin Plugin ................................... FAILED [7:27.324s]
[INFO] ------------------------------------------------------------------------
[INFO] Error for project: Maven Plugin Tools Javadoc Taglets (during install)
[INFO] ------------------------------------------------------------------------
[INFO] 1 build failed. See console output above for details.
[INFO] ------------------------------------------------------------------------
[INFO] Trace
org.apache.maven.BuildFailureException: 1 build failed. See console output above for details.
	at org.apache.maven.lifecycle.DefaultLifecycleExecutor.executeGoals(DefaultLifecycleExecutor.java:715)
	at org.apache.maven.lifecycle.DefaultLifecycleExecutor.executeGoalWithLifecycle(DefaultLifecycleExecutor.java:556)
	at org.apache.maven.lifecycle.DefaultLifecycleExecutor.executeGoal(DefaultLifecycleExecutor.java:535)
	at org.apache.maven.lifecycle.DefaultLifecycleExecutor.executeGoalAndHandleFailures(DefaultLifecycleExecutor.java:387)
	at org.apache.maven.lifecycle.DefaultLifecycleExecutor.executeTaskSegments(DefaultLifecycleExecutor.java:348)
	at org.apache.maven.lifecycle.DefaultLifecycleExecutor.execute(DefaultLifecycleExecutor.java:180)
	at org.apache.maven.lifecycle.LifecycleExecutorInterceptor.execute(LifecycleExecutorInterceptor.java:65)
	at org.apache.maven.DefaultMaven.doExecute(DefaultMaven.java:328)
	at org.apache.maven.DefaultMaven.execute(DefaultMaven.java:138)
	at org.apache.maven.cli.MavenCli.main(MavenCli.java:362)
	at sun.reflect.NativeMethodAccessorImpl.invoke0(Native Method)
	at sun.reflect.NativeMethodAccessorImpl.invoke(NativeMethodAccessorImpl.java:57)
	at sun.reflect.DelegatingMethodAccessorImpl.invoke(DelegatingMethodAccessorImpl.java:43)
	at java.lang.reflect.Method.invoke(Method.java:606)
	at org.codehaus.classworlds.Launcher.launchEnhanced(Launcher.java:315)
	at org.codehaus.classworlds.Launcher.launch(Launcher.java:255)
	at hudson.maven.agent.Main.launch(Main.java:205)
	at hudson.maven.MavenBuilder.call(MavenBuilder.java:154)
	at hudson.maven.Maven2Builder.call(Maven2Builder.java:79)
	at hudson.maven.Maven2Builder.call(Maven2Builder.java:55)
	at hudson.remoting.UserRequest.perform(UserRequest.java:120)
	at hudson.remoting.UserRequest.perform(UserRequest.java:48)
	at hudson.remoting.Request$2.run(Request.java:326)
	at hudson.remoting.InterceptingExecutorService$1.call(InterceptingExecutorService.java:68)
	at java.util.concurrent.FutureTask.run(FutureTask.java:262)
	at java.util.concurrent.ThreadPoolExecutor.runWorker(ThreadPoolExecutor.java:1145)
	at java.util.concurrent.ThreadPoolExecutor$Worker.run(ThreadPoolExecutor.java:615)
	at java.lang.Thread.run(Thread.java:745)
Caused by: org.apache.maven.plugin.MojoFailureException: 1 build failed. See console output
above for details.
	at org.apache.maven.plugin.invoker.InvokerSession.handleFailures(InvokerSession.java:258)
	at org.apache.maven.plugin.invoker.InvokerMojo.processResults(InvokerMojo.java:69)
	at org.apache.maven.plugin.invoker.AbstractInvokerMojo.execute(AbstractInvokerMojo.java:741)
	at org.apache.maven.plugin.DefaultPluginManager.executeMojo(DefaultPluginManager.java:490)
	at hudson.maven.agent.PluginManagerInterceptor.executeMojo(PluginManagerInterceptor.java:182)
	at org.apache.maven.lifecycle.DefaultLifecycleExecutor.executeGoals(DefaultLifecycleExecutor.java:694)
	... 27 more
[INFO] ------------------------------------------------------------------------
[INFO] Error for project: Maven Plugin Plugin (during install)
[INFO] ------------------------------------------------------------------------
[INFO] 1 build failed. See console output above for details.
[INFO] ------------------------------------------------------------------------
[INFO] Trace
org.apache.maven.BuildFailureException: 1 build failed. See console output above for details.
	at org.apache.maven.lifecycle.DefaultLifecycleExecutor.executeGoals(DefaultLifecycleExecutor.java:715)
	at org.apache.maven.lifecycle.DefaultLifecycleExecutor.executeGoalWithLifecycle(DefaultLifecycleExecutor.java:556)
	at org.apache.maven.lifecycle.DefaultLifecycleExecutor.executeGoal(DefaultLifecycleExecutor.java:535)
	at org.apache.maven.lifecycle.DefaultLifecycleExecutor.executeGoalAndHandleFailures(DefaultLifecycleExecutor.java:387)
	at org.apache.maven.lifecycle.DefaultLifecycleExecutor.executeTaskSegments(DefaultLifecycleExecutor.java:348)
	at org.apache.maven.lifecycle.DefaultLifecycleExecutor.execute(DefaultLifecycleExecutor.java:180)
	at org.apache.maven.lifecycle.LifecycleExecutorInterceptor.execute(LifecycleExecutorInterceptor.java:65)
	at org.apache.maven.DefaultMaven.doExecute(DefaultMaven.java:328)
	at org.apache.maven.DefaultMaven.execute(DefaultMaven.java:138)
	at org.apache.maven.cli.MavenCli.main(MavenCli.java:362)
	at sun.reflect.NativeMethodAccessorImpl.invoke0(Native Method)
	at sun.reflect.NativeMethodAccessorImpl.invoke(NativeMethodAccessorImpl.java:57)
	at sun.reflect.DelegatingMethodAccessorImpl.invoke(DelegatingMethodAccessorImpl.java:43)
	at java.lang.reflect.Method.invoke(Method.java:606)
	at org.codehaus.classworlds.Launcher.launchEnhanced(Launcher.java:315)
	at org.codehaus.classworlds.Launcher.launch(Launcher.java:255)
	at hudson.maven.agent.Main.launch(Main.java:205)
	at hudson.maven.MavenBuilder.call(MavenBuilder.java:154)
	at hudson.maven.Maven2Builder.call(Maven2Builder.java:79)
	at hudson.maven.Maven2Builder.call(Maven2Builder.java:55)
	at hudson.remoting.UserRequest.perform(UserRequest.java:120)
	at hudson.remoting.UserRequest.perform(UserRequest.java:48)
	at hudson.remoting.Request$2.run(Request.java:326)
	at hudson.remoting.InterceptingExecutorService$1.call(InterceptingExecutorService.java:68)
	at java.util.concurrent.FutureTask.run(FutureTask.java:262)
	at java.util.concurrent.ThreadPoolExecutor.runWorker(ThreadPoolExecutor.java:1145)
	at java.util.concurrent.ThreadPoolExecutor$Worker.run(ThreadPoolExecutor.java:615)
	at java.lang.Thread.run(Thread.java:745)
Caused by: org.apache.maven.plugin.MojoFailureException: 1 build failed. See console output
above for details.
	at org.apache.maven.plugin.invoker.InvokerSession.handleFailures(InvokerSession.java:258)
	at org.apache.maven.plugin.invoker.InvokerMojo.processResults(InvokerMojo.java:69)
	at org.apache.maven.plugin.invoker.AbstractInvokerMojo.execute(AbstractInvokerMojo.java:741)
	at org.apache.maven.plugin.DefaultPluginManager.executeMojo(DefaultPluginManager.java:490)
	at hudson.maven.agent.PluginManagerInterceptor.executeMojo(PluginManagerInterceptor.java:182)
	at org.apache.maven.lifecycle.DefaultLifecycleExecutor.executeGoals(DefaultLifecycleExecutor.java:694)
	... 27 more
[INFO] ------------------------------------------------------------------------
[INFO] BUILD ERRORS
[INFO] ------------------------------------------------------------------------
[INFO] Total time: 9 minutes 13 seconds
[INFO] Finished at: Tue Aug 02 20:20:07 UTC 2016
[INFO] Final Memory: 89M/798M
[INFO] ------------------------------------------------------------------------
[JENKINS] Archiving <https://builds.apache.org/job/maven-plugin-tools-m2/ws/maven-plugin-tools-api/pom.xml>
to org.apache.maven.plugin-tools/maven-plugin-tools-api/3.5-SNAPSHOT/maven-plugin-tools-api-3.5-SNAPSHOT.pom
[JENKINS] Archiving <https://builds.apache.org/job/maven-plugin-tools-m2/ws/maven-plugin-tools-api/target/maven-plugin-tools-api-3.5-SNAPSHOT.jar>
to org.apache.maven.plugin-tools/maven-plugin-tools-api/3.5-SNAPSHOT/maven-plugin-tools-api-3.5-SNAPSHOT.jar
[JENKINS] Archiving <https://builds.apache.org/job/maven-plugin-tools-m2/ws/maven-plugin-tools-generators/pom.xml>
to org.apache.maven.plugin-tools/maven-plugin-tools-generators/3.5-SNAPSHOT/maven-plugin-tools-generators-3.5-SNAPSHOT.pom
[JENKINS] Archiving <https://builds.apache.org/job/maven-plugin-tools-m2/ws/maven-plugin-tools-generators/target/maven-plugin-tools-generators-3.5-SNAPSHOT.jar>
to org.apache.maven.plugin-tools/maven-plugin-tools-generators/3.5-SNAPSHOT/maven-plugin-tools-generators-3.5-SNAPSHOT.jar
[JENKINS] Archiving /home/jenkins/jenkins-slave/maven-repositories/0/org/apache/maven/plugin-tools/maven-script/3.5-SNAPSHOT/maven-script-3.5-SNAPSHOT.pom
to org.apache.maven.plugin-tools/maven-script/3.5-SNAPSHOT/maven-script-3.5-SNAPSHOT.pom
[JENKINS] Archiving <https://builds.apache.org/job/maven-plugin-tools-m2/ws/maven-script/target/maven-script-3.5-SNAPSHOT-site.xml>
to org.apache.maven.plugin-tools/maven-script/3.5-SNAPSHOT/maven-script-3.5-SNAPSHOT-site.xml
/home/jenkins/jenkins-slave/maven-repositories/0/org/apache/maven/plugin-tools/maven-script/3.5-SNAPSHOT/maven-script-3.5-SNAPSHOT.pom
is not inside <https://builds.apache.org/job/maven-plugin-tools-m2/ws/maven-script/;>
will archive in a separate pass
[JENKINS] Archiving <https://builds.apache.org/job/maven-plugin-tools-m2/ws/maven-plugin-annotations/pom.xml>
to org.apache.maven.plugin-tools/maven-plugin-annotations/3.5-SNAPSHOT/maven-plugin-annotations-3.5-SNAPSHOT.pom
[JENKINS] Archiving <https://builds.apache.org/job/maven-plugin-tools-m2/ws/maven-plugin-annotations/target/maven-plugin-annotations-3.5-SNAPSHOT.jar>
to org.apache.maven.plugin-tools/maven-plugin-annotations/3.5-SNAPSHOT/maven-plugin-annotations-3.5-SNAPSHOT.jar
[JENKINS] Archiving <https://builds.apache.org/job/maven-plugin-tools-m2/ws/maven-plugin-plugin/pom.xml>
to org.apache.maven.plugins/maven-plugin-plugin/3.5-SNAPSHOT/maven-plugin-plugin-3.5-SNAPSHOT.pom
[JENKINS] Archiving <https://builds.apache.org/job/maven-plugin-tools-m2/ws/maven-plugin-plugin/target/maven-plugin-plugin-3.5-SNAPSHOT.jar>
to org.apache.maven.plugins/maven-plugin-plugin/3.5-SNAPSHOT/maven-plugin-plugin-3.5-SNAPSHOT.jar
[JENKINS] Archiving /home/jenkins/jenkins-slave/maven-repositories/0/org/apache/maven/plugin-tools/maven-plugin-tools/3.5-SNAPSHOT/maven-plugin-tools-3.5-SNAPSHOT.pom
to org.apache.maven.plugin-tools/maven-plugin-tools/3.5-SNAPSHOT/maven-plugin-tools-3.5-SNAPSHOT.pom
[JENKINS] Archiving <https://builds.apache.org/job/maven-plugin-tools-m2/ws/target/maven-plugin-tools-3.5-SNAPSHOT-site.xml>
to org.apache.maven.plugin-tools/maven-plugin-tools/3.5-SNAPSHOT/maven-plugin-tools-3.5-SNAPSHOT-site.xml
/home/jenkins/jenkins-slave/maven-repositories/0/org/apache/maven/plugin-tools/maven-plugin-tools/3.5-SNAPSHOT/maven-plugin-tools-3.5-SNAPSHOT.pom
is not inside <https://builds.apache.org/job/maven-plugin-tools-m2/ws/;> will archive
in a separate pass
[JENKINS] Archiving <https://builds.apache.org/job/maven-plugin-tools-m2/ws/maven-script/maven-plugin-tools-model/pom.xml>
to org.apache.maven.plugin-tools/maven-plugin-tools-model/3.5-SNAPSHOT/maven-plugin-tools-model-3.5-SNAPSHOT.pom
[JENKINS] Archiving <https://builds.apache.org/job/maven-plugin-tools-m2/ws/maven-script/maven-plugin-tools-model/target/maven-plugin-tools-model-3.5-SNAPSHOT.jar>
to org.apache.maven.plugin-tools/maven-plugin-tools-model/3.5-SNAPSHOT/maven-plugin-tools-model-3.5-SNAPSHOT.jar
[JENKINS] Archiving <https://builds.apache.org/job/maven-plugin-tools-m2/ws/maven-script/maven-plugin-tools-ant/pom.xml>
to org.apache.maven.plugin-tools/maven-plugin-tools-ant/3.5-SNAPSHOT/maven-plugin-tools-ant-3.5-SNAPSHOT.pom
[JENKINS] Archiving <https://builds.apache.org/job/maven-plugin-tools-m2/ws/maven-script/maven-plugin-tools-ant/target/maven-plugin-tools-ant-3.5-SNAPSHOT.jar>
to org.apache.maven.plugin-tools/maven-plugin-tools-ant/3.5-SNAPSHOT/maven-plugin-tools-ant-3.5-SNAPSHOT.jar
[JENKINS] Archiving <https://builds.apache.org/job/maven-plugin-tools-m2/ws/maven-plugin-tools-annotations/pom.xml>
to org.apache.maven.plugin-tools/maven-plugin-tools-annotations/3.5-SNAPSHOT/maven-plugin-tools-annotations-3.5-SNAPSHOT.pom
[JENKINS] Archiving <https://builds.apache.org/job/maven-plugin-tools-m2/ws/maven-plugin-tools-annotations/target/maven-plugin-tools-annotations-3.5-SNAPSHOT.jar>
to org.apache.maven.plugin-tools/maven-plugin-tools-annotations/3.5-SNAPSHOT/maven-plugin-tools-annotations-3.5-SNAPSHOT.jar
[JENKINS] Archiving <https://builds.apache.org/job/maven-plugin-tools-m2/ws/maven-plugin-tools-annotations/target/maven-plugin-tools-annotations-3.5-SNAPSHOT-tests.jar>
to org.apache.maven.plugin-tools/maven-plugin-tools-annotations/3.5-SNAPSHOT/maven-plugin-tools-annotations-3.5-SNAPSHOT-tests.jar
[JENKINS] Archiving <https://builds.apache.org/job/maven-plugin-tools-m2/ws/maven-plugin-tools-annotations/target/maven-plugin-tools-annotations-3.5-SNAPSHOT-test-sources.jar>
to org.apache.maven.plugin-tools/maven-plugin-tools-annotations/3.5-SNAPSHOT/maven-plugin-tools-annotations-3.5-SNAPSHOT-test-sources.jar
[JENKINS] Archiving <https://builds.apache.org/job/maven-plugin-tools-m2/ws/maven-script/maven-script-ant/pom.xml>
to org.apache.maven.plugin-tools/maven-script-ant/3.5-SNAPSHOT/maven-script-ant-3.5-SNAPSHOT.pom
[JENKINS] Archiving <https://builds.apache.org/job/maven-plugin-tools-m2/ws/maven-script/maven-script-ant/target/maven-script-ant-3.5-SNAPSHOT.jar>
to org.apache.maven.plugin-tools/maven-script-ant/3.5-SNAPSHOT/maven-script-ant-3.5-SNAPSHOT.jar
[JENKINS] Archiving <https://builds.apache.org/job/maven-plugin-tools-m2/ws/maven-script/maven-plugin-tools-beanshell/pom.xml>
to org.apache.maven.plugin-tools/maven-plugin-tools-beanshell/3.5-SNAPSHOT/maven-plugin-tools-beanshell-3.5-SNAPSHOT.pom
[JENKINS] Archiving <https://builds.apache.org/job/maven-plugin-tools-m2/ws/maven-script/maven-plugin-tools-beanshell/target/maven-plugin-tools-beanshell-3.5-SNAPSHOT.jar>
to org.apache.maven.plugin-tools/maven-plugin-tools-beanshell/3.5-SNAPSHOT/maven-plugin-tools-beanshell-3.5-SNAPSHOT.jar
[JENKINS] Archiving <https://builds.apache.org/job/maven-plugin-tools-m2/ws/maven-script/maven-script-beanshell/pom.xml>
to org.apache.maven.plugin-tools/maven-script-beanshell/3.5-SNAPSHOT/maven-script-beanshell-3.5-SNAPSHOT.pom
[JENKINS] Archiving <https://builds.apache.org/job/maven-plugin-tools-m2/ws/maven-script/maven-script-beanshell/target/maven-script-beanshell-3.5-SNAPSHOT.jar>
to org.apache.maven.plugin-tools/maven-script-beanshell/3.5-SNAPSHOT/maven-script-beanshell-3.5-SNAPSHOT.jar
[JENKINS] Archiving <https://builds.apache.org/job/maven-plugin-tools-m2/ws/maven-plugin-tools-java/pom.xml>
to org.apache.maven.plugin-tools/maven-plugin-tools-java/3.5-SNAPSHOT/maven-plugin-tools-java-3.5-SNAPSHOT.pom
[JENKINS] Archiving <https://builds.apache.org/job/maven-plugin-tools-m2/ws/maven-plugin-tools-java/target/maven-plugin-tools-java-3.5-SNAPSHOT.jar>
to org.apache.maven.plugin-tools/maven-plugin-tools-java/3.5-SNAPSHOT/maven-plugin-tools-java-3.5-SNAPSHOT.jar
[JENKINS] Archiving <https://builds.apache.org/job/maven-plugin-tools-m2/ws/maven-plugin-tools-javadoc/pom.xml>
to org.apache.maven.plugin-tools/maven-plugin-tools-javadoc/3.5-SNAPSHOT/maven-plugin-tools-javadoc-3.5-SNAPSHOT.pom
[JENKINS] Archiving <https://builds.apache.org/job/maven-plugin-tools-m2/ws/maven-plugin-tools-javadoc/target/maven-plugin-tools-javadoc-3.5-SNAPSHOT.jar>
to org.apache.maven.plugin-tools/maven-plugin-tools-javadoc/3.5-SNAPSHOT/maven-plugin-tools-javadoc-3.5-SNAPSHOT.jar
channel stopped

Mime
View raw message