maven-notifications mailing list archives

Site index · List index
Message view « Date » · « Thread »
Top « Date » · « Thread »
From Apache Jenkins Server <jenk...@builds.apache.org>
Subject Build failed in Jenkins: maven-plugins #7078
Date Tue, 02 Aug 2016 08:26:10 GMT
See <https://builds.apache.org/job/maven-plugins/7078/>

------------------------------------------
Started by upstream project "maven-shared" build number 2745
originally caused by:
 Started by upstream project "maven-plugins" build number 7077
 originally caused by:
  Started by upstream project "maven-shared" build number 2744
  originally caused by:
   Started by upstream project "maven-plugins" build number 7076
   originally caused by:
    Started by upstream project "maven-shared" build number 2743
    originally caused by:
     Started by upstream project "maven-plugins" build number 7075
     originally caused by:
      Started by upstream project "maven-shared" build number 2742
      originally caused by:
       Started by upstream project "maven-plugins" build number 7074
       originally caused by:
        Started by upstream project "maven-shared" build number 2741
        originally caused by:
         Started by upstream project "maven-plugins" build number 7073
         originally caused by:
          Started by upstream project "maven-shared" build number 2740
          originally caused by:
           Started by upstream project "maven-plugins" build number 7072
           originally caused by:
            (deeply nested causes)
[EnvInject] - Loading node environment variables.
Building remotely on H10 (docker Ubuntu ubuntu yahoo-not-h2) in workspace <https://builds.apache.org/job/maven-plugins/ws/>
Updating http://svn.apache.org/repos/asf/maven/plugins/trunk at revision '2016-08-02T08:24:26.581
+0000'
U         maven-jarsigner-plugin/pom.xml
U         maven-shade-plugin/src/it/reloc-abs-resource-path/pom.xml
U         maven-shade-plugin/src/it/reloc-anno/pom.xml
U         maven-shade-plugin/src/it/reloc-class-from-string-pool/pom.xml
U         maven-shade-plugin/src/it/reloc-enum-ref-from-anno/pom.xml
U         maven-shade-plugin/src/it/component-descriptor-relocation/pom.xml
U         maven-compiler-plugin/pom.xml
U         maven-install-plugin/pom.xml
At revision 1754844

No changes for http://svn.apache.org/repos/asf/maven/plugins/trunk since the previous build
Parsing POMs
Downloaded artifact http://repo.maven.apache.org/maven2/org/apache/maven/maven-parent/24/maven-parent-24.pom
Downloaded artifact http://repo.maven.apache.org/maven2/org/apache/maven/plugins/maven-plugins/30/maven-plugins-30.pom
Downloaded artifact http://repo.maven.apache.org/maven2/org/apache/maven/plugins/maven-plugins/28/maven-plugins-28.pom
Downloaded artifact http://repo.maven.apache.org/maven2/org/apache/maven/maven-parent/27/maven-parent-27.pom
Modules changed, recalculating dependency graph
Established TCP socket on 46140
maven31-agent.jar already up to date
maven31-interceptor.jar already up to date
maven3-interceptor-commons.jar already up to date
[maven-plugins] $ /home/jenkins/jenkins-slave/tools/hudson.model.JDK/latest1.7/bin/java -Xmx2g
-Xms256m -XX:MaxPermSize=512m -cp /home/jenkins/jenkins-slave/maven31-agent.jar:/home/jenkins/jenkins-slave/tools/hudson.tasks.Maven_MavenInstallation/maven-3.1.1/boot/plexus-classworlds-2.5.1.jar:/home/jenkins/jenkins-slave/tools/hudson.tasks.Maven_MavenInstallation/maven-3.1.1/conf/logging
jenkins.maven3.agent.Maven31Main /home/jenkins/jenkins-slave/tools/hudson.tasks.Maven_MavenInstallation/maven-3.1.1
/home/jenkins/jenkins-slave/slave.jar /home/jenkins/jenkins-slave/maven31-interceptor.jar
/home/jenkins/jenkins-slave/maven3-interceptor-commons.jar 46140
Exception in thread "main" java.lang.ClassNotFoundException: hudson.remoting.Launcher
	at org.codehaus.plexus.classworlds.strategy.SelfFirstStrategy.loadClass(SelfFirstStrategy.java:50)
	at org.codehaus.plexus.classworlds.realm.ClassRealm.unsynchronizedLoadClass(ClassRealm.java:259)
	at org.codehaus.plexus.classworlds.realm.ClassRealm.loadClass(ClassRealm.java:235)
	at org.codehaus.plexus.classworlds.realm.ClassRealm.loadClass(ClassRealm.java:227)
	at jenkins.maven3.agent.Maven31Main.main(Maven31Main.java:142)
	at jenkins.maven3.agent.Maven31Main.main(Maven31Main.java:73)
ERROR: Failed to parse POMs
java.io.EOFException: unexpected stream termination
	at hudson.remoting.ChannelBuilder.negotiate(ChannelBuilder.java:365)
	at hudson.remoting.ChannelBuilder.build(ChannelBuilder.java:310)
	at hudson.slaves.Channels.forProcess(Channels.java:115)
	at hudson.maven.AbstractMavenProcessFactory.newProcess(AbstractMavenProcessFactory.java:297)
	at hudson.maven.ProcessCache.get(ProcessCache.java:236)
	at hudson.maven.MavenModuleSetBuild$MavenModuleSetBuildExecution.doRun(MavenModuleSetBuild.java:778)
	at hudson.model.AbstractBuild$AbstractBuildExecution.run(AbstractBuild.java:534)
	at hudson.model.Run.execute(Run.java:1738)
	at hudson.maven.MavenModuleSetBuild.run(MavenModuleSetBuild.java:531)
	at hudson.model.ResourceController.execute(ResourceController.java:98)
	at hudson.model.Executor.run(Executor.java:410)
[WARNINGS] Skipping publisher since build result is FAILURE

Mime
View raw message