maven-notifications mailing list archives

Site index · List index
Message view « Date » · « Thread »
Top « Date » · « Thread »
From Apache Jenkins Server <jenk...@builds.apache.org>
Subject Build failed in Jenkins: maven-plugins #7337
Date Fri, 07 Oct 2016 19:00:05 GMT
See <https://builds.apache.org/job/maven-plugins/7337/>

------------------------------------------
[...truncated 17157 lines...]
A         maven-site-plugin/src/it/MSITE-159/src/site/apt
AU        maven-site-plugin/src/it/MSITE-159/src/site/apt/index.apt
A         maven-site-plugin/src/it/MSITE-456
AU        maven-site-plugin/src/it/MSITE-456/verify.bsh
A         maven-site-plugin/src/it/MSITE-456/child
AU        maven-site-plugin/src/it/MSITE-456/child/pom.xml
AU        maven-site-plugin/src/it/MSITE-456/pom.xml
A         maven-site-plugin/src/it/surefire-report
A         maven-site-plugin/src/it/surefire-report/src
A         maven-site-plugin/src/it/surefire-report/src/main
A         maven-site-plugin/src/it/surefire-report/src/main/java
A         maven-site-plugin/src/it/surefire-report/src/main/java/org
A         maven-site-plugin/src/it/surefire-report/src/main/java/org/apache
A         maven-site-plugin/src/it/surefire-report/src/main/java/org/apache/maven
A         maven-site-plugin/src/it/surefire-report/src/main/java/org/apache/maven/plugins
A         maven-site-plugin/src/it/surefire-report/src/main/java/org/apache/maven/plugins/site
A         maven-site-plugin/src/it/surefire-report/src/main/java/org/apache/maven/plugins/site/its
AU        maven-site-plugin/src/it/surefire-report/src/main/java/org/apache/maven/plugins/site/its/App.java
A         maven-site-plugin/src/it/surefire-report/src/test
A         maven-site-plugin/src/it/surefire-report/src/test/java
A         maven-site-plugin/src/it/surefire-report/src/test/java/org
A         maven-site-plugin/src/it/surefire-report/src/test/java/org/apache
A         maven-site-plugin/src/it/surefire-report/src/test/java/org/apache/maven
A         maven-site-plugin/src/it/surefire-report/src/test/java/org/apache/maven/plugins
A         maven-site-plugin/src/it/surefire-report/src/test/java/org/apache/maven/plugins/site
A         maven-site-plugin/src/it/surefire-report/src/test/java/org/apache/maven/plugins/site/its
AU        maven-site-plugin/src/it/surefire-report/src/test/java/org/apache/maven/plugins/site/its/AppTest.java
AU        maven-site-plugin/src/it/surefire-report/verify.groovy
AU        maven-site-plugin/src/it/surefire-report/pom.xml
A         maven-site-plugin/src/it/MSITE-458
A         maven-site-plugin/src/it/MSITE-458/first
AU        maven-site-plugin/src/it/MSITE-458/first/pom.xml
A         maven-site-plugin/src/it/MSITE-458/src
A         maven-site-plugin/src/it/MSITE-458/src/site
AU        maven-site-plugin/src/it/MSITE-458/src/site/site.xml
A         maven-site-plugin/src/it/MSITE-458/src/site/apt
AU        maven-site-plugin/src/it/MSITE-458/src/site/apt/index.apt
AU        maven-site-plugin/src/it/MSITE-458/invoker.properties
AU        maven-site-plugin/src/it/MSITE-458/pom.xml
A         maven-site-plugin/src/it/MSITE-458/second
AU        maven-site-plugin/src/it/MSITE-458/second/pom.xml
AU        maven-site-plugin/src/it/MSITE-458/verify.bsh
AU        maven-site-plugin/src/it/settings.xml
A         maven-site-plugin/src/it/empty-report-set
AU        maven-site-plugin/src/it/empty-report-set/pom.xml
AU        maven-site-plugin/src/it/empty-report-set/verify.bsh
A         maven-site-plugin/src/it/MSITE-658
A         maven-site-plugin/src/it/MSITE-658/src
A         maven-site-plugin/src/it/MSITE-658/src/site
AU        maven-site-plugin/src/it/MSITE-658/src/site/site.xml
AU        maven-site-plugin/src/it/MSITE-658/src/site/site_de.xml
AU        maven-site-plugin/src/it/MSITE-658/invoker.properties
AU        maven-site-plugin/src/it/MSITE-658/pom.xml
AU        maven-site-plugin/src/it/MSITE-658/verify.bsh
A         maven-site-plugin/src/it/reportConfig
AU        maven-site-plugin/src/it/reportConfig/invoker.properties
AU        maven-site-plugin/src/it/reportConfig/verify.groovy
AU        maven-site-plugin/src/it/reportConfig/pom.xml
A         maven-site-plugin/src/it/effective-site
AU        maven-site-plugin/src/it/effective-site/invoker.properties
AU        maven-site-plugin/src/it/effective-site/verify.groovy
AU        maven-site-plugin/src/it/effective-site/pom.xml
A         maven-site-plugin/src/it/effective-site/src
A         maven-site-plugin/src/it/effective-site/src/site
AU        maven-site-plugin/src/it/effective-site/src/site/site.xml
A         maven-site-plugin/src/it/MSITE-497
A         maven-site-plugin/src/it/MSITE-497/apps
AU        maven-site-plugin/src/it/MSITE-497/apps/pom.xml
A         maven-site-plugin/src/it/MSITE-497/apps/app
A         maven-site-plugin/src/it/MSITE-497/apps/app/src
A         maven-site-plugin/src/it/MSITE-497/apps/app/src/test
A         maven-site-plugin/src/it/MSITE-497/apps/app/src/test/java
A         maven-site-plugin/src/it/MSITE-497/apps/app/src/test/java/org
A         maven-site-plugin/src/it/MSITE-497/apps/app/src/test/java/org/apache
A         maven-site-plugin/src/it/MSITE-497/apps/app/src/test/java/org/apache/maven
AU        maven-site-plugin/src/it/MSITE-497/apps/app/src/test/java/org/apache/maven/AppTest.java
A         maven-site-plugin/src/it/MSITE-497/apps/app/src/main
A         maven-site-plugin/src/it/MSITE-497/apps/app/src/main/java
A         maven-site-plugin/src/it/MSITE-497/apps/app/src/main/java/org
A         maven-site-plugin/src/it/MSITE-497/apps/app/src/main/java/org/apache
A         maven-site-plugin/src/it/MSITE-497/apps/app/src/main/java/org/apache/maven
AU        maven-site-plugin/src/it/MSITE-497/apps/app/src/main/java/org/apache/maven/App.java
AU        maven-site-plugin/src/it/MSITE-497/apps/app/pom.xml
A         maven-site-plugin/src/it/MSITE-497/src
A         maven-site-plugin/src/it/MSITE-497/src/site
AU        maven-site-plugin/src/it/MSITE-497/src/site/site.xml
A         maven-site-plugin/src/it/MSITE-497/src/site/apt
AU        maven-site-plugin/src/it/MSITE-497/src/site/apt/index.apt
AU        maven-site-plugin/src/it/MSITE-497/invoker.properties
AU        maven-site-plugin/src/it/MSITE-497/pom.xml
AU        maven-site-plugin/pom.xml
A         maven-javadoc-plugin
A         maven-javadoc-plugin/src
A         maven-javadoc-plugin/src/main
A         maven-javadoc-plugin/src/main/javadoc
A         maven-javadoc-plugin/src/main/javadoc/org
A         maven-javadoc-plugin/src/main/javadoc/org/apache
A         maven-javadoc-plugin/src/main/javadoc/org/apache/maven
A         maven-javadoc-plugin/src/main/javadoc/org/apache/maven/plugin
A         maven-javadoc-plugin/src/main/javadoc/org/apache/maven/plugin/javadoc
AU        maven-javadoc-plugin/src/main/javadoc/org/apache/maven/plugin/javadoc/package.html
A         maven-javadoc-plugin/src/main/resources
AU        maven-javadoc-plugin/src/main/resources/log4j.properties
AU        maven-javadoc-plugin/src/main/resources/test-javadoc-report_en.properties
AU        maven-javadoc-plugin/src/main/resources/javadoc-report.properties
AU        maven-javadoc-plugin/src/main/resources/javadoc-report_en.properties
AU        maven-javadoc-plugin/src/main/resources/test-javadoc-report_fr.properties
AU        maven-javadoc-plugin/src/main/resources/test-javadoc-report_de.properties
AU        maven-javadoc-plugin/src/main/resources/test-javadoc-report_sv.properties
A         maven-javadoc-plugin/src/main/resources/test-javadoc-report_nl.properties
AU        maven-javadoc-plugin/src/main/resources/javadoc-report_fr.properties
AU        maven-javadoc-plugin/src/main/resources/javadoc-report_de.properties
AU        maven-javadoc-plugin/src/main/resources/javadoc-report_sv.properties
A         maven-javadoc-plugin/src/main/resources/javadoc-report_nl.properties
A         maven-javadoc-plugin/src/main/resources/org
A         maven-javadoc-plugin/src/main/resources/org/apache
A         maven-javadoc-plugin/src/main/resources/org/apache/maven
A         maven-javadoc-plugin/src/main/resources/org/apache/maven/plugin
A         maven-javadoc-plugin/src/main/resources/org/apache/maven/plugin/javadoc
A         maven-javadoc-plugin/src/main/resources/org/apache/maven/plugin/javadoc/css
AU        maven-javadoc-plugin/src/main/resources/org/apache/maven/plugin/javadoc/css/stylesheet.css
A         maven-javadoc-plugin/src/main/resources/org/apache/maven/plugin/javadoc/java-api-package-list-1.3
A         maven-javadoc-plugin/src/main/resources/org/apache/maven/plugin/javadoc/java-api-package-list-1.4
A         maven-javadoc-plugin/src/main/resources/org/apache/maven/plugin/javadoc/java-api-package-list-1.5
AU        maven-javadoc-plugin/src/main/resources/org/apache/maven/plugin/javadoc/frame-injection-fix.txt
A         maven-javadoc-plugin/src/main/resources/org/apache/maven/plugin/javadoc/java-api-package-list-1.6
A         maven-javadoc-plugin/src/main/resources/org/apache/maven/plugin/javadoc/java-api-package-list-1.7
A         maven-javadoc-plugin/src/main/resources/org/apache/maven/pluERROR: Failed to check
out http://svn.apache.org/repos/asf/maven/plugins/trunk
org.tmatesoft.svn.core.SVNException: svn: E204899: No space left on device
	at org.tmatesoft.svn.core.internal.wc.SVNErrorManager.error(SVNErrorManager.java:64)
	at org.tmatesoft.svn.core.internal.wc.SVNErrorManager.error(SVNErrorManager.java:51)
	at org.tmatesoft.svn.core.internal.io.dav.http.HTTPConnection.request(HTTPConnection.java:793)
	at org.tmatesoft.svn.core.internal.io.dav.http.HTTPConnection.request(HTTPConnection.java:398)
	at org.tmatesoft.svn.core.internal.io.dav.http.HTTPConnection.request(HTTPConnection.java:386)
	at org.tmatesoft.svn.core.internal.io.dav.DAVConnection.performHttpRequest(DAVConnection.java:863)
	at org.tmatesoft.svn.core.internal.io.dav.DAVConnection.doReport(DAVConnection.java:360)
	at org.tmatesoft.svn.core.internal.io.dav.DAVRepository.runReport(DAVRepository.java:1340)
	at org.tmatesoft.svn.core.internal.io.dav.DAVRepository.update(DAVRepository.java:868)
	at org.tmatesoft.svn.core.internal.wc2.ng.SvnNgAbstractUpdate.updateInternal(SvnNgAbstractUpdate.java:247)
	at org.tmatesoft.svn.core.internal.wc2.ng.SvnNgAbstractUpdate.update(SvnNgAbstractUpdate.java:111)
	at org.tmatesoft.svn.core.internal.wc2.ng.SvnNgAbstractUpdate.checkout(SvnNgAbstractUpdate.java:855)
	at org.tmatesoft.svn.core.internal.wc2.ng.SvnNgCheckout.run(SvnNgCheckout.java:26)
	at org.tmatesoft.svn.core.internal.wc2.ng.SvnNgCheckout.run(SvnNgCheckout.java:11)
	at org.tmatesoft.svn.core.internal.wc2.ng.SvnNgOperationRunner.run(SvnNgOperationRunner.java:20)
	at org.tmatesoft.svn.core.internal.wc2.SvnOperationRunner.run(SvnOperationRunner.java:21)
	at org.tmatesoft.svn.core.wc2.SvnOperationFactory.run(SvnOperationFactory.java:1235)
	at org.tmatesoft.svn.core.wc2.SvnOperation.run(SvnOperation.java:294)
	at hudson.scm.subversion.CheckoutUpdater$1.perform(CheckoutUpdater.java:119)
	at hudson.scm.subversion.WorkspaceUpdater$UpdateTask.delegateTo(WorkspaceUpdater.java:162)
	at hudson.scm.subversion.WorkspaceUpdater$UpdateTask.delegateTo(WorkspaceUpdater.java:170)
	at hudson.scm.subversion.UpdateUpdater$TaskImpl.perform(UpdateUpdater.java:183)
	at hudson.scm.subversion.WorkspaceUpdater$UpdateTask.delegateTo(WorkspaceUpdater.java:162)
	at hudson.scm.SubversionSCM$CheckOutTask.perform(SubversionSCM.java:996)
	at hudson.scm.SubversionSCM$CheckOutTask.invoke(SubversionSCM.java:972)
	at hudson.scm.SubversionSCM$CheckOutTask.invoke(SubversionSCM.java:948)
	at hudson.FilePath$FileCallableWrapper.call(FilePath.java:2772)
	at hudson.remoting.UserRequest.perform(UserRequest.java:153)
	at hudson.remoting.UserRequest.perform(UserRequest.java:50)
	at hudson.remoting.Request$2.run(Request.java:332)
	at hudson.remoting.InterceptingExecutorService$1.call(InterceptingExecutorService.java:68)
	at java.util.concurrent.FutureTask.run(FutureTask.java:262)
	at java.util.concurrent.ThreadPoolExecutor.runWorker(ThreadPoolExecutor.java:1145)
	at java.util.concurrent.ThreadPoolExecutor$Worker.run(ThreadPoolExecutor.java:615)
	at java.lang.Thread.run(Thread.java:745)
gin/javadoc/java-api-package-list-1.8
AU        maven-javadoc-plugin/src/main/resources/test-javadoc-report.properties
A         maven-javadoc-plugin/src/main/mdo
AU        maven-javadoc-plugin/src/main/mdo/javadocOptions.mdo
A         maven-javadoc-plugin/src/main/java
A         maven-javadoc-plugin/src/main/java/org
A         maven-javadoc-plugin/src/main/java/org/apache
A         maven-javadoc-plugin/src/main/java/org/apache/maven
A         maven-javadoc-plugin/src/main/java/org/apache/maven/plugin
A         maven-javadoc-plugin/src/main/java/org/apache/maven/plugin/javadoc
java.io.IOException: remote file operation failed: <https://builds.apache.org/job/maven-plugins/ws/>
at hudson.remoting.Channel@2667bce2:jenkins-test-39e: java.io.IOException: Failed to check
out http://svn.apache.org/repos/asf/maven/plugins/trunk
	at hudson.FilePath.act(FilePath.java:1014)
	at hudson.FilePath.act(FilePath.java:996)
	at hudson.scm.SubversionSCM.checkout(SubversionSCM.java:897)
	at hudson.scm.SubversionSCM.checkout(SubversionSCM.java:833)
	at hudson.scm.SCM.checkout(SCM.java:485)
	at hudson.model.AbstractProject.checkout(AbstractProject.java:1269)
	at hudson.model.AbstractBuild$AbstractBuildExecution.defaultCheckout(AbstractBuild.java:604)
	at jenkins.scm.SCMCheckoutStrategy.checkout(SCMCheckoutStrategy.java:86)
	at hudson.model.AbstractBuild$AbstractBuildExecution.run(AbstractBuild.java:529)
	at hudson.model.Run.execute(Run.java:1741)
	at hudson.maven.MavenModuleSetBuild.run(MavenModuleSetBuild.java:531)
	at hudson.model.ResourceController.execute(ResourceController.java:98)
	at hudson.model.Executor.run(Executor.java:410)
Caused by: java.io.IOException: Failed to check out http://svn.apache.org/repos/asf/maven/plugins/trunk
	at hudson.scm.subversion.CheckoutUpdater$1.perform(CheckoutUpdater.java:130)
	at hudson.scm.subversion.WorkspaceUpdater$UpdateTask.delegateTo(WorkspaceUpdater.java:162)
	at hudson.scm.subversion.WorkspaceUpdater$UpdateTask.delegateTo(WorkspaceUpdater.java:170)
	at hudson.scm.subversion.UpdateUpdater$TaskImpl.perform(UpdateUpdater.java:183)
	at hudson.scm.subversion.WorkspaceUpdater$UpdateTask.delegateTo(WorkspaceUpdater.java:162)
	at hudson.scm.SubversionSCM$CheckOutTask.perform(SubversionSCM.java:996)
	at hudson.scm.SubversionSCM$CheckOutTask.invoke(SubversionSCM.java:972)
	at hudson.scm.SubversionSCM$CheckOutTask.invoke(SubversionSCM.java:948)
	at hudson.FilePath$FileCallableWrapper.call(FilePath.java:2772)
	at hudson.remoting.UserRequest.perform(UserRequest.java:153)
	at hudson.remoting.UserRequest.perform(UserRequest.java:50)
	at hudson.remoting.Request$2.run(Request.java:332)
	at hudson.remoting.InterceptingExecutorService$1.call(InterceptingExecutorService.java:68)
	at java.util.concurrent.FutureTask.run(FutureTask.java:262)
	at java.util.concurrent.ThreadPoolExecutor.runWorker(ThreadPoolExecutor.java:1145)
	at java.util.concurrent.ThreadPoolExecutor$Worker.run(ThreadPoolExecutor.java:615)
	at java.lang.Thread.run(Thread.java:745)
	at ......remote call to jenkins-test-39e(Native Method)
	at hudson.remoting.Channel.attachCallSiteStackTrace(Channel.java:1416)
	at hudson.remoting.UserResponse.retrieve(UserRequest.java:253)
	at hudson.remoting.Channel.call(Channel.java:781)
	at hudson.FilePath.act(FilePath.java:1007)
	... 12 more
Caused by: org.tmatesoft.svn.core.SVNException: svn: E204899: No space left on device
	at org.tmatesoft.svn.core.internal.wc.SVNErrorManager.error(SVNErrorManager.java:64)
	at org.tmatesoft.svn.core.internal.wc.SVNErrorManager.error(SVNErrorManager.java:51)
	at org.tmatesoft.svn.core.internal.io.dav.http.HTTPConnection.request(HTTPConnection.java:793)
	at org.tmatesoft.svn.core.internal.io.dav.http.HTTPConnection.request(HTTPConnection.java:398)
	at org.tmatesoft.svn.core.internal.io.dav.http.HTTPConnection.request(HTTPConnection.java:386)
	at org.tmatesoft.svn.core.internal.io.dav.DAVConnection.performHttpRequest(DAVConnection.java:863)
	at org.tmatesoft.svn.core.internal.io.dav.DAVConnection.doReport(DAVConnection.java:360)
	at org.tmatesoft.svn.core.internal.io.dav.DAVRepository.runReport(DAVRepository.java:1340)
	at org.tmatesoft.svn.core.internal.io.dav.DAVRepository.update(DAVRepository.java:868)
	at org.tmatesoft.svn.core.internal.wc2.ng.SvnNgAbstractUpdate.updateInternal(SvnNgAbstractUpdate.java:247)
	at org.tmatesoft.svn.core.internal.wc2.ng.SvnNgAbstractUpdate.update(SvnNgAbstractUpdate.java:111)
	at org.tmatesoft.svn.core.internal.wc2.ng.SvnNgAbstractUpdate.checkout(SvnNgAbstractUpdate.java:855)
	at org.tmatesoft.svn.core.internal.wc2.ng.SvnNgCheckout.run(SvnNgCheckout.java:26)
	at org.tmatesoft.svn.core.internal.wc2.ng.SvnNgCheckout.run(SvnNgCheckout.java:11)
	at org.tmatesoft.svn.core.internal.wc2.ng.SvnNgOperationRunner.run(SvnNgOperationRunner.java:20)
	at org.tmatesoft.svn.core.internal.wc2.SvnOperationRunner.run(SvnOperationRunner.java:21)
	at org.tmatesoft.svn.core.wc2.SvnOperationFactory.run(SvnOperationFactory.java:1235)
	at org.tmatesoft.svn.core.wc2.SvnOperation.run(SvnOperation.java:294)
	at hudson.scm.subversion.CheckoutUpdater$1.perform(CheckoutUpdater.java:119)
	at hudson.scm.subversion.WorkspaceUpdater$UpdateTask.delegateTo(WorkspaceUpdater.java:162)
	at hudson.scm.subversion.WorkspaceUpdater$UpdateTask.delegateTo(WorkspaceUpdater.java:170)
	at hudson.scm.subversion.UpdateUpdater$TaskImpl.perform(UpdateUpdater.java:183)
	at hudson.scm.subversion.WorkspaceUpdater$UpdateTask.delegateTo(WorkspaceUpdater.java:162)
	at hudson.scm.SubversionSCM$CheckOutTask.perform(SubversionSCM.java:996)
	at hudson.scm.SubversionSCM$CheckOutTask.invoke(SubversionSCM.java:972)
	at hudson.scm.SubversionSCM$CheckOutTask.invoke(SubversionSCM.java:948)
	at hudson.FilePath$FileCallableWrapper.call(FilePath.java:2772)
	at hudson.remoting.UserRequest.perform(UserRequest.java:153)
	at hudson.remoting.UserRequest.perform(UserRequest.java:50)
	at hudson.remoting.Request$2.run(Request.java:332)
	at hudson.remoting.InterceptingExecutorService$1.call(InterceptingExecutorService.java:68)
	at java.util.concurrent.FutureTask.run(FutureTask.java:262)
	at java.util.concurrent.ThreadPoolExecutor.runWorker(ThreadPoolExecutor.java:1145)
	at java.util.concurrent.ThreadPoolExecutor$Worker.run(ThreadPoolExecutor.java:615)
	at java.lang.Thread.run(Thread.java:745)
[WARNINGS] Skipping publisher since build result is FAILURE

Mime
View raw message