maven-notifications mailing list archives

Site index · List index
Message view « Date » · « Thread »
Top « Date » · « Thread »
From Apache Jenkins Server <jenk...@builds.apache.org>
Subject Build failed in Jenkins: maven-plugins-ITs-m3.0.4 #1798
Date Fri, 21 Oct 2016 17:08:40 GMT
See <https://builds.apache.org/job/maven-plugins-ITs-m3.0.4/1798/changes>

Changes:

[Robert Scholte] [MDEP-538] Display moduleName 
Got stacktraces for valid jars, so ignore all possible expections.

------------------------------------------
[...truncated 22730 lines...]
[INFO] --- maven-compiler-plugin:3.5.1:testCompile (default-testCompile) @ maven-pmd-plugin
---
[INFO] Changes detected - recompiling the module!
[INFO] Compiling 10 source files to <https://builds.apache.org/job/maven-plugins-ITs-m3.0.4/ws/maven-pmd-plugin/target/test-classes>
[INFO] <https://builds.apache.org/job/maven-plugins-ITs-m3.0.4/ws/maven-pmd-plugin/src/test/java/org/apache/maven/plugin/pmd/stubs/PmdPluginArtifactStub.java>:
<https://builds.apache.org/job/maven-plugins-ITs-m3.0.4/ws/maven-pmd-plugin/src/test/java/org/apache/maven/plugin/pmd/stubs/PmdPluginArtifactStub.java>
uses unchecked or unsafe operations.
[INFO] <https://builds.apache.org/job/maven-plugins-ITs-m3.0.4/ws/maven-pmd-plugin/src/test/java/org/apache/maven/plugin/pmd/stubs/PmdPluginArtifactStub.java>:
Recompile with -Xlint:unchecked for details.
[INFO] 
[INFO] --- maven-surefire-plugin:2.19.1:test (default-test) @ maven-pmd-plugin ---

-------------------------------------------------------
 T E S T S
-------------------------------------------------------
Running org.apache.maven.plugin.pmd.CpdViolationCheckMojoTest
[INFO] You have 1 warning. For more details see: <https://builds.apache.org/job/maven-plugins-ITs-m3.0.4/ws/maven-pmd-plugin/target/test/unit/default-configuration/target/cpd.xml>
[INFO] You have 1 CPD duplication. For more details see: <https://builds.apache.org/job/maven-plugins-ITs-m3.0.4/ws/maven-pmd-plugin/target/test/unit/default-configuration/target/cpd.xml>
Tests run: 4, Failures: 0, Errors: 0, Skipped: 0, Time elapsed: 2.434 sec - in org.apache.maven.plugin.pmd.CpdViolationCheckMojoTest
Running org.apache.maven.plugin.pmd.PmdReportTest
[ERROR] PMD processing errors:
[ERROR] <https://builds.apache.org/job/maven-plugins-ITs-m3.0.4/ws/maven-pmd-plugin/src/test/resources/unit/processing-error/src/BrokenFile.java>:
Error while parsing <https://builds.apache.org/job/maven-plugins-ITs-m3.0.4/ws/maven-pmd-plugin/src/test/resources/unit/processing-error/src/BrokenFile.java>
Tests run: 15, Failures: 0, Errors: 0, Skipped: 0, Time elapsed: 5.68 sec - in org.apache.maven.plugin.pmd.PmdReportTest
Running org.apache.maven.plugin.pmd.CpdReportTest
[WARNING] File encoding has not been set, using platform encoding UTF-8, i.e. build is platform
dependent!
Added <https://builds.apache.org/job/maven-plugins-ITs-m3.0.4/ws/maven-pmd-plugin/src/test/resources/unit/default-configuration/js/Sample.js>
Added <https://builds.apache.org/job/maven-plugins-ITs-m3.0.4/ws/maven-pmd-plugin/src/test/resources/unit/default-configuration/js/SampleDup.js>
Tests run: 10, Failures: 0, Errors: 0, Skipped: 0, Time elapsed: 0.975 sec - in org.apache.maven.plugin.pmd.CpdReportTest
Running org.apache.maven.plugin.pmd.PmdViolationCheckMojoTest
[INFO] You have 8 warnings. For more details see: <https://builds.apache.org/job/maven-plugins-ITs-m3.0.4/ws/maven-pmd-plugin/target/test/unit/default-configuration/target/pmd.xml>
[INFO] You have 8 warnings. For more details see: <https://builds.apache.org/job/maven-plugins-ITs-m3.0.4/ws/maven-pmd-plugin/target/test/unit/default-configuration/target/pmd.xml>
[INFO] PMD Warning: def.configuration.App:80 Rule:UselessParentheses Priority:4 Useless parentheses..
[INFO] PMD Warning: def/configuration/App2.java:22 Rule:UnusedImports Priority:4 Avoid unused
imports such as 'java.io.File'.
[INFO] PMD Warning: def.configuration.AppSample:58 Rule:UselessParentheses Priority:4 Useless
parentheses..
[INFO] PMD Failure: def.configuration.App:31 Rule:UnusedPrivateField Priority:3 Avoid unused
private fields such as 'unusedVar2'..
[INFO] PMD Failure: def.configuration.App:56 Rule:EmptyCatchBlock Priority:3 Avoid empty catch
blocks.
[INFO] PMD Failure: def.configuration.AppSample:27 Rule:UnusedPrivateField Priority:3 Avoid
unused private fields such as 'unusedVar'..
[INFO] PMD Failure: def.configuration.AppSample:45 Rule:UnusedFormalParameter Priority:3 Avoid
unused method parameters such as 'unusedParam'..
[INFO] PMD Failure: def.configuration.AppSample:45 Rule:UnusedPrivateMethod Priority:3 Avoid
unused private methods such as 'unusedMethod(String)'..
Caught expected message: You have 5 PMD violations and 3 warnings. For more details see: <https://builds.apache.org/job/maven-plugins-ITs-m3.0.4/ws/maven-pmd-plugin/target/test/unit/default-configuration/target/pmd.xml>
[INFO] You have 8 warnings. For more details see: <https://builds.apache.org/job/maven-plugins-ITs-m3.0.4/ws/maven-pmd-plugin/target/test/unit/default-configuration/target/pmd.xml>
Tests run: 5, Failures: 0, Errors: 0, Skipped: 0, Time elapsed: 0.908 sec - in org.apache.maven.plugin.pmd.PmdViolationCheckMojoTest

Results :

Tests run: 34, Failures: 0, Errors: 0, Skipped: 0

[INFO] 
[INFO] --- maven-jar-plugin:3.0.0:jar (default-jar) @ maven-pmd-plugin ---
[INFO] Building jar: <https://builds.apache.org/job/maven-plugins-ITs-m3.0.4/ws/maven-pmd-plugin/target/maven-pmd-plugin-3.8-SNAPSHOT.jar>
[INFO] 
[INFO] --- maven-plugin-plugin:3.4:addPluginArtifactMetadata (default-addPluginArtifactMetadata)
@ maven-pmd-plugin ---
[INFO] 
[INFO] --- maven-site-plugin:3.5.1:attach-descriptor (attach-descriptor) @ maven-pmd-plugin
---
[INFO] 
[INFO] --- maven-invoker-plugin:2.0.0:install (integration-test) @ maven-pmd-plugin ---
[INFO] Installing <https://builds.apache.org/job/maven-plugins-ITs-m3.0.4/ws/maven-acr-plugin/pom.xml>
to <https://builds.apache.org/job/maven-plugins-ITs-m3.0.4/ws/maven-pmd-plugin/target/local-repo/org/apache/maven/plugins/maven-acr-plugin/3.0.1-SNAPSHOT/maven-acr-plugin-3.0.1-SNAPSHOT.pom>
[INFO] Installing <https://builds.apache.org/job/maven-plugins-ITs-m3.0.4/ws/maven-acr-plugin/target/maven-acr-plugin-3.0.1-SNAPSHOT.jar>
to <https://builds.apache.org/job/maven-plugins-ITs-m3.0.4/ws/maven-pmd-plugin/target/local-repo/org/apache/maven/plugins/maven-acr-plugin/3.0.1-SNAPSHOT/maven-acr-plugin-3.0.1-SNAPSHOT.jar>
[INFO] Installing <https://builds.apache.org/job/maven-plugins-ITs-m3.0.4/ws/maven-acr-plugin/pom.xml>
to <https://builds.apache.org/job/maven-plugins-ITs-m3.0.4/ws/maven-pmd-plugin/target/local-repo/org/apache/maven/plugins/maven-acr-plugin/3.0.1-SNAPSHOT/maven-acr-plugin-3.0.1-SNAPSHOT.pom>
[INFO] Installing <https://builds.apache.org/job/maven-plugins-ITs-m3.0.4/ws/maven-ant-plugin/pom.xml>
to <https://builds.apache.org/job/maven-plugins-ITs-m3.0.4/ws/maven-pmd-plugin/target/local-repo/org/apache/maven/plugins/maven-ant-plugin/2.5-SNAPSHOT/maven-ant-plugin-2.5-SNAPSHOT.pom>
[INFO] Installing <https://builds.apache.org/job/maven-plugins-ITs-m3.0.4/ws/maven-ant-plugin/target/maven-ant-plugin-2.5-SNAPSHOT.jar>
to <https://builds.apache.org/job/maven-plugins-ITs-m3.0.4/ws/maven-pmd-plugin/target/local-repo/org/apache/maven/plugins/maven-ant-plugin/2.5-SNAPSHOT/maven-ant-plugin-2.5-SNAPSHOT.jar>
[INFO] Installing <https://builds.apache.org/job/maven-plugins-ITs-m3.0.4/ws/maven-antrun-plugin/pom.xml>
to <https://builds.apache.org/job/maven-plugins-ITs-m3.0.4/ws/maven-pmd-plugin/target/local-repo/org/apache/maven/plugins/maven-antrun-plugin/1.9-SNAPSHOT/maven-antrun-plugin-1.9-SNAPSHOT.pom>
[INFO] Installing <https://builds.apache.org/job/maven-plugins-ITs-m3.0.4/ws/maven-antrun-plugin/target/maven-antrun-plugin-1.9-SNAPSHOT.jar>
to <https://builds.apache.org/job/maven-plugins-ITs-m3.0.4/ws/maven-pmd-plugin/target/local-repo/org/apache/maven/plugins/maven-antrun-plugin/1.9-SNAPSHOT/maven-antrun-plugin-1.9-SNAPSHOT.jar>
[INFO] Installing <https://builds.apache.org/job/maven-plugins-ITs-m3.0.4/ws/maven-changelog-plugin/pom.xml>
to <https://builds.apache.org/job/maven-plugins-ITs-m3.0.4/ws/maven-pmd-plugin/target/local-repo/org/apache/maven/plugins/maven-changelog-plugin/2.4-SNAPSHOT/maven-changelog-plugin-2.4-SNAPSHOT.pom>
[INFO] Installing <https://builds.apache.org/job/maven-plugins-ITs-m3.0.4/ws/maven-changelog-plugin/target/maven-changelog-plugin-2.4-SNAPSHOT.jar>
to <https://builds.apache.org/job/maven-plugins-ITs-m3.0.4/ws/maven-pmd-plugin/target/local-repo/org/apache/maven/plugins/maven-changelog-plugin/2.4-SNAPSHOT/maven-changelog-plugin-2.4-SNAPSHOT.jar>
[INFO] Installing <https://builds.apache.org/job/maven-plugins-ITs-m3.0.4/ws/maven-changes-plugin/pom.xml>
to <https://builds.apache.org/job/maven-plugins-ITs-m3.0.4/ws/maven-pmd-plugin/target/local-repo/org/apache/maven/plugins/maven-changes-plugin/2.13-SNAPSHOT/maven-changes-plugin-2.13-SNAPSHOT.pom>
[INFO]                                                                         
[INFO] ------------------------------------------------------------------------
[INFO] Building Apache Maven GPG Plugin 1.7-SNAPSHOT
[INFO] ------------------------------------------------------------------------
[INFO] 
[INFO] --- maven-clean-plugin:3.0.0:clean (default-clean) @ maven-gpg-plugin ---
[INFO] 
[INFO] --- maven-enforcer-plugin:1.4.1:enforce (enforce-bytecode-version) @ maven-gpg-plugin
---
[INFO] 
[INFO] --- maven-enforcer-plugin:1.4.1:enforce (ban-known-bad-maven-versions) @ maven-gpg-plugin
---
[INFO] 
[INFO] --- maven-enforcer-plugin:1.4.1:enforce (ensure-no-container-api) @ maven-gpg-plugin
---
[INFO] 
[INFO] --- apache-rat-plugin:0.11:check (rat-check) @ maven-gpg-plugin ---
[INFO] 51 implicit excludes (use -debug for more details).
[INFO] Exclude: DEPENDENCIES
[INFO] Exclude: src/test/resources/gnupg/*
[INFO] 66 resources included (use -debug for more details)
[INFO] Rat check: Summary of files. Unapproved: 0 unknown: 0 generated: 0 approved: 54 licence.
[INFO] 
[INFO] --- maven-plugin-plugin:3.4:helpmojo (generate-helpmojo) @ maven-gpg-plugin ---
[INFO] Using 'UTF-8' encoding to read mojo metadata.
[INFO] Mojo extractor with id: java-annotations found 0 mojo descriptors.
[INFO] Mojo extractor with id: java-javadoc found 0 mojo descriptors.
[INFO] 
[INFO] --- maven-remote-resources-plugin:1.5:process (process-resource-bundles) @ maven-gpg-plugin
---
[INFO] 
[INFO] --- maven-resources-plugin:2.7:resources (default-resources) @ maven-gpg-plugin ---
[INFO] Using 'UTF-8' encoding to copy filtered resources.
[INFO] Copying 1 resource
[INFO] Copying 3 resources
[INFO] 
[INFO] --- maven-compiler-plugin:3.5.1:compile (default-compile) @ maven-gpg-plugin ---
[INFO] Changes detected - recompiling the module!
[INFO] Compiling 9 source files to <https://builds.apache.org/job/maven-plugins-ITs-m3.0.4/ws/maven-gpg-plugin/target/classes>
[INFO] <https://builds.apache.org/job/maven-plugins-ITs-m3.0.4/ws/maven-gpg-plugin/src/main/java/org/apache/maven/plugin/gpg/GpgSignAttachedMojo.java>:
Some input files use unchecked or unsafe operations.
[INFO] <https://builds.apache.org/job/maven-plugins-ITs-m3.0.4/ws/maven-gpg-plugin/src/main/java/org/apache/maven/plugin/gpg/GpgSignAttachedMojo.java>:
Recompile with -Xlint:unchecked for details.
[INFO] 
[INFO] --- maven-plugin-plugin:3.4:descriptor (default-descriptor) @ maven-gpg-plugin ---
[INFO] Using 'UTF-8' encoding to read mojo metadata.
[INFO] Mojo extractor with id: java-annotations found 3 mojo descriptors.
[INFO] Mojo extractor with id: java-javadoc found 0 mojo descriptors.
[INFO] 
[INFO] --- maven-resources-plugin:2.7:testResources (default-testResources) @ maven-gpg-plugin
---
[INFO] Using 'UTF-8' encoding to copy filtered resources.
[INFO] Copying 8 resources
[INFO] Copying 3 resources
[INFO] 
[INFO] --- maven-compiler-plugin:3.5.1:testCompile (default-testCompile) @ maven-gpg-plugin
---
[INFO] No sources to compile
[INFO] 
[INFO] --- maven-surefire-plugin:2.19.1:test (default-test) @ maven-gpg-plugin ---
[INFO] 
[INFO] --- maven-jar-plugin:3.0.0:jar (default-jar) @ maven-gpg-plugin ---
[INFO] Building jar: <https://builds.apache.org/job/maven-plugins-ITs-m3.0.4/ws/maven-gpg-plugin/target/maven-gpg-plugin-1.7-SNAPSHOT.jar>
[INFO] 
[INFO] --- maven-plugin-plugin:3.4:addPluginArtifactMetadata (default-addPluginArtifactMetadata)
@ maven-gpg-plugin ---
[INFO] 
[INFO] --- maven-site-plugin:3.5.1:attach-descriptor (attach-descriptor) @ maven-gpg-plugin
---
[INFO] 
[INFO] --- maven-invoker-plugin:2.0.0:install (integration-test) @ maven-gpg-plugin ---
[INFO] Installing <https://builds.apache.org/job/maven-plugins-ITs-m3.0.4/ws/maven-acr-plugin/pom.xml>
to <https://builds.apache.org/job/maven-plugins-ITs-m3.0.4/ws/maven-gpg-plugin/target/local-repo/org/apache/maven/plugins/maven-acr-plugin/3.0.1-SNAPSHOT/maven-acr-plugin-3.0.1-SNAPSHOT.pom>
[INFO] Installing <https://builds.apache.org/job/maven-plugins-ITs-m3.0.4/ws/maven-acr-plugin/target/maven-acr-plugin-3.0.1-SNAPSHOT.jar>
to <https://builds.apache.org/job/maven-plugins-ITs-m3.0.4/ws/maven-gpg-plugin/target/local-repo/org/apache/maven/plugins/maven-acr-plugin/3.0.1-SNAPSHOT/maven-acr-plugin-3.0.1-SNAPSHOT.jar>
[INFO] Installing <https://builds.apache.org/job/maven-plugins-ITs-m3.0.4/ws/maven-acr-plugin/pom.xml>
to <https://builds.apache.org/job/maven-plugins-ITs-m3.0.4/ws/maven-gpg-plugin/target/local-repo/org/apache/maven/plugins/maven-acr-plugin/3.0.1-SNAPSHOT/maven-acr-plugin-3.0.1-SNAPSHOT.pom>
[INFO] Installing <https://builds.apache.org/job/maven-plugins-ITs-m3.0.4/ws/maven-ant-plugin/pom.xml>
to <https://builds.apache.org/job/maven-plugins-ITs-m3.0.4/ws/maven-gpg-plugin/target/local-repo/org/apache/maven/plugins/maven-ant-plugin/2.5-SNAPSHOT/maven-ant-plugin-2.5-SNAPSHOT.pom>
[INFO] Installing <https://builds.apache.org/job/maven-plugins-ITs-m3.0.4/ws/maven-ant-plugin/target/maven-ant-plugin-2.5-SNAPSHOT.jar>
to <https://builds.apache.org/job/maven-plugins-ITs-m3.0.4/ws/maven-gpg-plugin/target/local-repo/org/apache/maven/plugins/maven-ant-plugin/2.5-SNAPSHOT/maven-ant-plugin-2.5-SNAPSHOT.jar>
[INFO] Installing <https://builds.apache.org/job/maven-plugins-ITs-m3.0.4/ws/maven-antrun-plugin/pom.xml>
to <https://builds.apache.org/job/maven-plugins-ITs-m3.0.4/ws/maven-gpg-plugin/target/local-repo/org/apache/maven/plugins/maven-antrun-plugin/1.9-SNAPSHOT/maven-antrun-plugin-1.9-SNAPSHOT.pom>
[INFO] Installing <https://builds.apache.org/job/maven-plugins-ITs-m3.0.4/ws/maven-antrun-plugin/target/maven-antrun-plugin-1.9-SNAPSHOT.jar>
to <https://builds.apache.org/job/maven-plugins-ITs-m3.0.4/ws/maven-gpg-plugin/target/local-repo/org/apache/maven/plugins/maven-antrun-plugin/1.9-SNAPSHOT/maven-antrun-plugin-1.9-SNAPSHOT.jar>
[INFO] Installing <https://builds.apache.org/job/maven-plugins-ITs-m3.0.4/ws/maven-changelog-plugin/pom.xml>
to <https://builds.apache.org/job/maven-plugins-ITs-m3.0.4/ws/maven-gpg-plugin/target/local-repo/org/apache/maven/plugins/maven-changelog-plugin/2.4-SNAPSHOT/maven-changelog-plugin-2.4-SNAPSHOT.pom>
[INFO] Installing <https://builds.apache.org/job/maven-plugins-ITs-m3.0.4/ws/maven-changelog-plugin/target/maven-changelog-plugin-2.4-SNAPSHOT.jar>
to <https://builds.apache.org/job/maven-plugins-ITs-m3.0.4/ws/maven-gpg-plugin/target/local-repo/org/apache/maven/plugins/maven-changelog-plugin/2.4-SNAPSHOT/maven-changelog-plugin-2.4-SNAPSHOT.jar>
[INFO] Installing <https://builds.apache.org/job/maven-plugins-ITs-m3.0.4/ws/maven-changes-plugin/pom.xml>
to <https://builds.apache.org/job/maven-plugins-ITs-m3.0.4/ws/maven-gpg-plugin/target/local-repo/org/apache/maven/plugins/maven-changes-plugin/2.13-SNAPSHOT/maven-changes-plugin-2.13-SNAPSHOT.pom>
[INFO]                                                                         
[INFO] ------------------------------------------------------------------------
[INFO] Building Apache Maven Plugins Aggregator 1-SNAPSHOT
[INFO] ------------------------------------------------------------------------
[INFO] 
[INFO] --- maven-clean-plugin:2.5:clean (default-clean) @ maven-plugins-aggregator ---
[INFO] 
[INFO] --- maven-enforcer-plugin:1.3.1:enforce (enforce-bytecode-version) @ maven-plugins-aggregator
---
[INFO] 
[INFO] --- maven-enforcer-plugin:1.3.1:enforce (ban-known-bad-maven-versions) @ maven-plugins-aggregator
---
[INFO] 
[INFO] --- maven-remote-resources-plugin:1.5:process (default) @ maven-plugins-aggregator
---
[INFO] 
[INFO] --- maven-site-plugin:3.3:attach-descriptor (attach-descriptor) @ maven-plugins-aggregator
---
[INFO] 
[INFO] --- maven-install-plugin:2.5.1:install (default-install) @ maven-plugins-aggregator
---
[INFO] Installing <https://builds.apache.org/job/maven-plugins-ITs-m3.0.4/ws/pom.xml>
to /home/jenkins/.m2/repository/org/apache/maven/plugins/maven-plugins-aggregator/1-SNAPSHOT/maven-plugins-aggregator-1-SNAPSHOT.pom
[INFO] ------------------------------------------------------------------------
[INFO] Reactor Summary:
[INFO] 
[INFO] Apache Maven ACR Plugin ........................... SUCCESS [34.926s]
[INFO] Apache Maven Ant Plugin ........................... FAILURE [4:40.334s]
[INFO] Apache Maven AntRun Plugin ........................ FAILURE [1:19.729s]
[INFO] Apache Maven Changelog Plugin ..................... FAILURE [1:16.719s]
[INFO] Apache Maven Changes Plugin ....................... FAILURE [43.385s]
[INFO] Apache Maven Clean Plugin ......................... FAILURE [5.376s]
[INFO] Apache Maven Compiler Plugin ...................... FAILURE [11.710s]
[INFO] Apache Maven Deploy Plugin ........................ FAILURE [7.723s]
[INFO] Apache Maven Documentation Checker Plugin ......... FAILURE [1.748s]
[INFO] Apache Maven EAR Plugin ........................... FAILURE [4.235s]
[INFO] Apache Maven EJB Plugin ........................... FAILURE [7.418s]
[INFO] Apache Maven Help Plugin .......................... FAILURE [4.545s]
[INFO] Apache Maven Install Plugin ....................... FAILURE [6.400s]
[INFO] Apache Maven Jarsigner Plugin ..................... FAILURE [1.682s]
[INFO] Apache Maven Javadoc Plugin ....................... FAILURE [2:12.889s]
[INFO] Apache Maven JDeps Plugin ......................... FAILURE [1.794s]
[INFO] Apache Maven Linkcheck Plugin ..................... FAILURE [2.487s]
[INFO] Apache Maven Patch Plugin ......................... FAILURE [0.336s]
[INFO] Apache Maven PDF Plugin ........................... FAILURE [8.968s]
[INFO] Apache Maven RAR Plugin ........................... FAILURE [4.193s]
[INFO] Apache Maven Repository Plugin .................... FAILURE [3.788s]
[INFO] Apache Maven Resources Plugin ..................... FAILURE [7.505s]
[INFO] Apache Maven Site Plugin .......................... FAILURE [13.336s]
[INFO] Apache Maven Source Plugin ........................ FAILURE [6.261s]
[INFO] Apache Maven Stage Plugin ......................... FAILURE [2.985s]
[INFO] Apache Maven Toolchains Plugin .................... FAILURE [1.098s]
[INFO] Apache Maven Verifier Plugin ...................... FAILURE [1.425s]
[INFO] Apache Maven WAR Plugin ........................... FAILURE [13.858s]
[INFO] Apache Maven DOAP Plugin .......................... FAILURE [15.355s]
[INFO] Apache Maven Invoker Plugin ....................... FAILURE [8.727s]
[INFO] Apache Maven JAR Plugin ........................... FAILURE [4.191s]
[INFO] Apache Maven Checkstyle Plugin .................... FAILURE [20.709s]
[INFO] Apache Maven PMD Plugin ........................... FAILURE [16.790s]
[INFO] Apache Maven GPG Plugin ........................... FAILURE [1.495s]
[INFO] Apache Maven Plugins Aggregator ................... SUCCESS [0.671s]
[INFO] ------------------------------------------------------------------------
[INFO] BUILD FAILURE
[INFO] ------------------------------------------------------------------------
[INFO] Total time: 13:56.150s
[INFO] Finished at: Fri Oct 21 17:08:32 UTC 2016
[INFO] Final Memory: 147M/1469M
[INFO] ------------------------------------------------------------------------
[WARNING] The requested profile "apache.snapshots" could not be activated because it does
not exist.
[ERROR] Failed to execute goal org.apache.maven.plugins:maven-invoker-plugin:2.0.0:verify
(integration-test) on project maven-ant-plugin: 11 builds failed. See console output above
for details. -> [Help 1]
[ERROR] Failed to execute goal org.apache.maven.plugins:maven-invoker-plugin:2.0.0:verify
(integration-test) on project maven-antrun-plugin: 1 build failed. See console output above
for details. -> [Help 1]
[ERROR] Failed to execute goal org.apache.maven.plugins:maven-invoker-plugin:2.0.0:verify
(integration-test) on project maven-changelog-plugin: 2 builds failed. See console output
above for details. -> [Help 1]
[ERROR] Failed to execute goal org.apache.maven.plugins:maven-surefire-plugin:2.19.1:test
(default-test) on project maven-changes-plugin: There are test failures.
[ERROR] 
[ERROR] Please refer to <https://builds.apache.org/job/maven-plugins-ITs-m3.0.4/ws/maven-changes-plugin/target/surefire-reports>
for the individual test results.
[ERROR] -> [Help 1]
[ERROR] Failed to execute goal org.apache.maven.plugins:maven-invoker-plugin:2.0.0:install
(integration-test) on project maven-clean-plugin: Failed to install project dependencies:
MavenProject: org.apache.maven.plugins:maven-clean-plugin:3.0.1-SNAPSHOT @ <https://builds.apache.org/job/maven-plugins-ITs-m3.0.4/ws/maven-clean-plugin/pom.xml>:
Failed to install project artifacts: MavenProject: org.apache.maven.plugins:maven-changes-plugin:2.13-SNAPSHOT
@ <https://builds.apache.org/job/maven-plugins-ITs-m3.0.4/ws/maven-changes-plugin/pom.xml>:
Failed to install artifact: org.apache.maven.plugins:maven-changes-plugin:maven-plugin:2.13-SNAPSHOT:
Artifact is not fully assembled: <https://builds.apache.org/job/maven-plugins-ITs-m3.0.4/ws/maven-changes-plugin/target/classes>
-> [Help 2]
[ERROR] Failed to execute goal on project maven-compiler-plugin: Could not resolve dependencies
for project org.apache.maven.plugins:maven-compiler-plugin:maven-plugin:3.6-SNAPSHOT: Failed
to collect dependencies for [org.apache.maven.plugin-tools:maven-plugin-annotations:jar:3.4
(provided), org.apache.maven:maven-plugin-api:jar:3.0 (compile), org.apache.maven:maven-artifact:jar:3.0
(compile), org.apache.maven:maven-core:jar:3.0 (compile), org.apache.maven.shared:maven-shared-utils:jar:3.1.0
(compile), org.apache.maven.shared:maven-shared-incremental:jar:1.1 (compile), org.ow2.asm:asm:jar:6.0_ALPHA
(compile), org.codehaus.plexus:plexus-compiler-api:jar:2.8.1 (compile), org.codehaus.plexus:plexus-compiler-manager:jar:2.8.1
(compile), org.codehaus.plexus:plexus-compiler-javac:jar:2.8.1 (runtime), org.apache.maven.plugin-testing:maven-plugin-testing-harness:jar:2.1
(test), org.apache.maven:maven-compat:jar:3.0 (test), org.mockito:mockito-core:jar:1.9.5 (test),
junit:junit:jar:4.12 (test), org.codehaus.groovy:groovy-eclipse-compiler:jar:2.7.0-01 (test),
org.codehaus.groovy:groovy-eclipse-batch:jar:2.0.4-04 (test), org.codehaus.groovy:groovy-all:jar:1.8.0
(test), org.apache.openjpa:openjpa:jar:2.2.0 (compile)]: Failed to read artifact descriptor
for org.codehaus.plexus:plexus-compiler-api:jar:2.8.1: Could not transfer artifact org.codehaus.plexus:plexus-compiler-api:pom:2.8.1
from/to central (http://repo.maven.apache.org/maven2): repo.maven.apache.org: Name or service
not known: Unknown host repo.maven.apache.org: Name or service not known -> [Help 3]
[ERROR] Failed to execute goal org.apache.maven.plugins:maven-invoker-plugin:2.0.0:install
(integration-test) on project maven-deploy-plugin: Failed to install project dependencies:
MavenProject: org.apache.maven.plugins:maven-deploy-plugin:3.0.0-SNAPSHOT @ <https://builds.apache.org/job/maven-plugins-ITs-m3.0.4/ws/maven-deploy-plugin/pom.xml>:
Failed to install project artifacts: MavenProject: org.apache.maven.plugins:maven-changes-plugin:2.13-SNAPSHOT
@ <https://builds.apache.org/job/maven-plugins-ITs-m3.0.4/ws/maven-changes-plugin/pom.xml>:
Failed to install artifact: org.apache.maven.plugins:maven-changes-plugin:maven-plugin:2.13-SNAPSHOT:
Artifact is not fully assembled: <https://builds.apache.org/job/maven-plugins-ITs-m3.0.4/ws/maven-changes-plugin/target/classes>
-> [Help 2]
[ERROR] Failed to execute goal org.apache.maven.plugins:maven-invoker-plugin:2.0.0:install
(integration-test) on project maven-docck-plugin: Failed to install project dependencies:
MavenProject: org.apache.maven.plugins:maven-docck-plugin:1.2-SNAPSHOT @ <https://builds.apache.org/job/maven-plugins-ITs-m3.0.4/ws/maven-docck-plugin/pom.xml>:
Failed to install project artifacts: MavenProject: org.apache.maven.plugins:maven-changes-plugin:2.13-SNAPSHOT
@ <https://builds.apache.org/job/maven-plugins-ITs-m3.0.4/ws/maven-changes-plugin/pom.xml>:
Failed to install artifact: org.apache.maven.plugins:maven-changes-plugin:maven-plugin:2.13-SNAPSHOT:
Artifact is not fully assembled: <https://builds.apache.org/job/maven-plugins-ITs-m3.0.4/ws/maven-changes-plugin/target/classes>
-> [Help 2]
[ERROR] Failed to execute goal org.apache.maven.plugins:maven-invoker-plugin:2.0.0:install
(integration-test) on project maven-ear-plugin: Failed to install project dependencies: MavenProject:
org.apache.maven.plugins:maven-ear-plugin:3.0.0-SNAPSHOT @ <https://builds.apache.org/job/maven-plugins-ITs-m3.0.4/ws/maven-ear-plugin/pom.xml>:
Failed to install project artifacts: MavenProject: org.apache.maven.plugins:maven-changes-plugin:2.13-SNAPSHOT
@ <https://builds.apache.org/job/maven-plugins-ITs-m3.0.4/ws/maven-changes-plugin/pom.xml>:
Failed to install artifact: org.apache.maven.plugins:maven-changes-plugin:maven-plugin:2.13-SNAPSHOT:
Artifact is not fully assembled: <https://builds.apache.org/job/maven-plugins-ITs-m3.0.4/ws/maven-changes-plugin/target/classes>
-> [Help 2]
[ERROR] Failed to execute goal org.apache.maven.plugins:maven-invoker-plugin:2.0.0:install
(integration-test) on project maven-ejb-plugin: Failed to install project dependencies: MavenProject:
org.apache.maven.plugins:maven-ejb-plugin:2.5.2-SNAPSHOT @ <https://builds.apache.org/job/maven-plugins-ITs-m3.0.4/ws/maven-ejb-plugin/pom.xml>:
Failed to install project artifacts: MavenProject: org.apache.maven.plugins:maven-changes-plugin:2.13-SNAPSHOT
@ <https://builds.apache.org/job/maven-plugins-ITs-m3.0.4/ws/maven-changes-plugin/pom.xml>:
Failed to install artifact: org.apache.maven.plugins:maven-changes-plugin:maven-plugin:2.13-SNAPSHOT:
Artifact is not fully assembled: <https://builds.apache.org/job/maven-plugins-ITs-m3.0.4/ws/maven-changes-plugin/target/classes>
-> [Help 2]
[ERROR] Failed to execute goal org.apache.maven.plugins:maven-invoker-plugin:2.0.0:install
(integration-test) on project maven-help-plugin: Failed to install project dependencies: MavenProject:
org.apache.maven.plugins:maven-help-plugin:2.2.1-SNAPSHOT @ <https://builds.apache.org/job/maven-plugins-ITs-m3.0.4/ws/maven-help-plugin/pom.xml>:
Failed to install project artifacts: MavenProject: org.apache.maven.plugins:maven-changes-plugin:2.13-SNAPSHOT
@ <https://builds.apache.org/job/maven-plugins-ITs-m3.0.4/ws/maven-changes-plugin/pom.xml>:
Failed to install artifact: org.apache.maven.plugins:maven-changes-plugin:maven-plugin:2.13-SNAPSHOT:
Artifact is not fully assembled: <https://builds.apache.org/job/maven-plugins-ITs-m3.0.4/ws/maven-changes-plugin/target/classes>
-> [Help 2]
[ERROR] Failed to execute goal org.apache.maven.plugins:maven-invoker-plugin:2.0.0:install
(integration-test) on project maven-install-plugin: Failed to install project dependencies:
MavenProject: org.apache.maven.plugins:maven-install-plugin:3.0.0-SNAPSHOT @ <https://builds.apache.org/job/maven-plugins-ITs-m3.0.4/ws/maven-install-plugin/pom.xml>:
Failed to install project artifacts: MavenProject: org.apache.maven.plugins:maven-changes-plugin:2.13-SNAPSHOT
@ <https://builds.apache.org/job/maven-plugins-ITs-m3.0.4/ws/maven-changes-plugin/pom.xml>:
Failed to install artifact: org.apache.maven.plugins:maven-changes-plugin:maven-plugin:2.13-SNAPSHOT:
Artifact is not fully assembled: <https://builds.apache.org/job/maven-plugins-ITs-m3.0.4/ws/maven-changes-plugin/target/classes>
-> [Help 2]
[ERROR] Failed to execute goal org.apache.maven.plugins:maven-invoker-plugin:2.0.0:install
(integration-test) on project maven-jarsigner-plugin: Failed to install project dependencies:
MavenProject: org.apache.maven.plugins:maven-jarsigner-plugin:1.5-SNAPSHOT @ <https://builds.apache.org/job/maven-plugins-ITs-m3.0.4/ws/maven-jarsigner-plugin/pom.xml>:
Failed to install project artifacts: MavenProject: org.apache.maven.plugins:maven-changes-plugin:2.13-SNAPSHOT
@ <https://builds.apache.org/job/maven-plugins-ITs-m3.0.4/ws/maven-changes-plugin/pom.xml>:
Failed to install artifact: org.apache.maven.plugins:maven-changes-plugin:maven-plugin:2.13-SNAPSHOT:
Artifact is not fully assembled: <https://builds.apache.org/job/maven-plugins-ITs-m3.0.4/ws/maven-changes-plugin/target/classes>
-> [Help 2]
[ERROR] Failed to execute goal org.apache.maven.plugins:maven-invoker-plugin:2.0.0:install
(integration-test) on project maven-javadoc-plugin: Failed to install project dependencies:
MavenProject: org.apache.maven.plugins:maven-javadoc-plugin:3.0.0-SNAPSHOT @ <https://builds.apache.org/job/maven-plugins-ITs-m3.0.4/ws/maven-javadoc-plugin/pom.xml>:
Failed to install project artifacts: MavenProject: org.apache.maven.plugins:maven-changes-plugin:2.13-SNAPSHOT
@ <https://builds.apache.org/job/maven-plugins-ITs-m3.0.4/ws/maven-changes-plugin/pom.xml>:
Failed to install artifact: org.apache.maven.plugins:maven-changes-plugin:maven-plugin:2.13-SNAPSHOT:
Artifact is not fully assembled: <https://builds.apache.org/job/maven-plugins-ITs-m3.0.4/ws/maven-changes-plugin/target/classes>
-> [Help 2]
[ERROR] Failed to execute goal org.apache.maven.plugins:maven-invoker-plugin:2.0.0:install
(integration-test) on project maven-jdeps-plugin: Failed to install project dependencies:
MavenProject: org.apache.maven.plugins:maven-jdeps-plugin:3.0.1-SNAPSHOT @ <https://builds.apache.org/job/maven-plugins-ITs-m3.0.4/ws/maven-jdeps-plugin/pom.xml>:
Failed to install project artifacts: MavenProject: org.apache.maven.plugins:maven-changes-plugin:2.13-SNAPSHOT
@ <https://builds.apache.org/job/maven-plugins-ITs-m3.0.4/ws/maven-changes-plugin/pom.xml>:
Failed to install artifact: org.apache.maven.plugins:maven-changes-plugin:maven-plugin:2.13-SNAPSHOT:
Artifact is not fully assembled: <https://builds.apache.org/job/maven-plugins-ITs-m3.0.4/ws/maven-changes-plugin/target/classes>
-> [Help 2]
[ERROR] Failed to execute goal org.apache.maven.plugins:maven-invoker-plugin:2.0.0:install
(integration-test) on project maven-linkcheck-plugin: Failed to install project dependencies:
MavenProject: org.apache.maven.plugins:maven-linkcheck-plugin:1.3-SNAPSHOT @ <https://builds.apache.org/job/maven-plugins-ITs-m3.0.4/ws/maven-linkcheck-plugin/pom.xml>:
Failed to install project artifacts: MavenProject: org.apache.maven.plugins:maven-changes-plugin:2.13-SNAPSHOT
@ <https://builds.apache.org/job/maven-plugins-ITs-m3.0.4/ws/maven-changes-plugin/pom.xml>:
Failed to install artifact: org.apache.maven.plugins:maven-changes-plugin:maven-plugin:2.13-SNAPSHOT:
Artifact is not fully assembled: <https://builds.apache.org/job/maven-plugins-ITs-m3.0.4/ws/maven-changes-plugin/target/classes>
-> [Help 2]
[ERROR] Failed to execute goal org.apache.maven.plugins:maven-invoker-plugin:2.0.0:install
(integration-test) on project maven-patch-plugin: Failed to install project dependencies:
MavenProject: org.apache.maven.plugins:maven-patch-plugin:1.3-SNAPSHOT @ <https://builds.apache.org/job/maven-plugins-ITs-m3.0.4/ws/maven-patch-plugin/pom.xml>:
Failed to install project artifacts: MavenProject: org.apache.maven.plugins:maven-changes-plugin:2.13-SNAPSHOT
@ <https://builds.apache.org/job/maven-plugins-ITs-m3.0.4/ws/maven-changes-plugin/pom.xml>:
Failed to install artifact: org.apache.maven.plugins:maven-changes-plugin:maven-plugin:2.13-SNAPSHOT:
Artifact is not fully assembled: <https://builds.apache.org/job/maven-plugins-ITs-m3.0.4/ws/maven-changes-plugin/target/classes>
-> [Help 2]
[ERROR] Failed to execute goal org.apache.maven.plugins:maven-invoker-plugin:2.0.0:install
(integration-test) on project maven-pdf-plugin: Failed to install project dependencies: MavenProject:
org.apache.maven.plugins:maven-pdf-plugin:1.4-SNAPSHOT @ <https://builds.apache.org/job/maven-plugins-ITs-m3.0.4/ws/maven-pdf-plugin/pom.xml>:
Failed to install project artifacts: MavenProject: org.apache.maven.plugins:maven-changes-plugin:2.13-SNAPSHOT
@ <https://builds.apache.org/job/maven-plugins-ITs-m3.0.4/ws/maven-changes-plugin/pom.xml>:
Failed to install artifact: org.apache.maven.plugins:maven-changes-plugin:maven-plugin:2.13-SNAPSHOT:
Artifact is not fully assembled: <https://builds.apache.org/job/maven-plugins-ITs-m3.0.4/ws/maven-changes-plugin/target/classes>
-> [Help 2]
[ERROR] Failed to execute goal org.apache.maven.plugins:maven-invoker-plugin:2.0.0:install
(integration-test) on project maven-rar-plugin: Failed to install project dependencies: MavenProject:
org.apache.maven.plugins:maven-rar-plugin:3.0.0-SNAPSHOT @ <https://builds.apache.org/job/maven-plugins-ITs-m3.0.4/ws/maven-rar-plugin/pom.xml>:
Failed to install project artifacts: MavenProject: org.apache.maven.plugins:maven-changes-plugin:2.13-SNAPSHOT
@ <https://builds.apache.org/job/maven-plugins-ITs-m3.0.4/ws/maven-changes-plugin/pom.xml>:
Failed to install artifact: org.apache.maven.plugins:maven-changes-plugin:maven-plugin:2.13-SNAPSHOT:
Artifact is not fully assembled: <https://builds.apache.org/job/maven-plugins-ITs-m3.0.4/ws/maven-changes-plugin/target/classes>
-> [Help 2]
[ERROR] Failed to execute goal org.apache.maven.plugins:maven-invoker-plugin:2.0.0:install
(integration-test) on project maven-repository-plugin: Failed to install project dependencies:
MavenProject: org.apache.maven.plugins:maven-repository-plugin:2.5-SNAPSHOT @ <https://builds.apache.org/job/maven-plugins-ITs-m3.0.4/ws/maven-repository-plugin/pom.xml>:
Failed to install project artifacts: MavenProject: org.apache.maven.plugins:maven-changes-plugin:2.13-SNAPSHOT
@ <https://builds.apache.org/job/maven-plugins-ITs-m3.0.4/ws/maven-changes-plugin/pom.xml>:
Failed to install artifact: org.apache.maven.plugins:maven-changes-plugin:maven-plugin:2.13-SNAPSHOT:
Artifact is not fully assembled: <https://builds.apache.org/job/maven-plugins-ITs-m3.0.4/ws/maven-changes-plugin/target/classes>
-> [Help 2]
[ERROR] Failed to execute goal org.apache.maven.plugins:maven-invoker-plugin:2.0.0:install
(integration-test) on project maven-resources-plugin: Failed to install project dependencies:
MavenProject: org.apache.maven.plugins:maven-resources-plugin:3.0.2-SNAPSHOT @ <https://builds.apache.org/job/maven-plugins-ITs-m3.0.4/ws/maven-resources-plugin/pom.xml>:
Failed to install project artifacts: MavenProject: org.apache.maven.plugins:maven-changes-plugin:2.13-SNAPSHOT
@ <https://builds.apache.org/job/maven-plugins-ITs-m3.0.4/ws/maven-changes-plugin/pom.xml>:
Failed to install artifact: org.apache.maven.plugins:maven-changes-plugin:maven-plugin:2.13-SNAPSHOT:
Artifact is not fully assembled: <https://builds.apache.org/job/maven-plugins-ITs-m3.0.4/ws/maven-changes-plugin/target/classes>
-> [Help 2]
[ERROR] Failed to execute goal org.apache.maven.plugins:maven-invoker-plugin:2.0.0:install
(integration-test) on project maven-site-plugin: Failed to install project dependencies: MavenProject:
org.apache.maven.plugins:maven-site-plugin:3.6-SNAPSHOT @ <https://builds.apache.org/job/maven-plugins-ITs-m3.0.4/ws/maven-site-plugin/dependency-reduced-pom.xml>:
Failed to install project artifacts: MavenProject: org.apache.maven.plugins:maven-changes-plugin:2.13-SNAPSHOT
@ <https://builds.apache.org/job/maven-plugins-ITs-m3.0.4/ws/maven-changes-plugin/pom.xml>:
Failed to install artifact: org.apache.maven.plugins:maven-changes-plugin:maven-plugin:2.13-SNAPSHOT:
Artifact is not fully assembled: <https://builds.apache.org/job/maven-plugins-ITs-m3.0.4/ws/maven-changes-plugin/target/classes>
-> [Help 2]
[ERROR] Failed to execute goal org.apache.maven.plugins:maven-invoker-plugin:2.0.0:install
(integration-test) on project maven-source-plugin: Failed to install project dependencies:
MavenProject: org.apache.maven.plugins:maven-source-plugin:3.0.2-SNAPSHOT @ <https://builds.apache.org/job/maven-plugins-ITs-m3.0.4/ws/maven-source-plugin/pom.xml>:
Failed to install project artifacts: MavenProject: org.apache.maven.plugins:maven-changes-plugin:2.13-SNAPSHOT
@ <https://builds.apache.org/job/maven-plugins-ITs-m3.0.4/ws/maven-changes-plugin/pom.xml>:
Failed to install artifact: org.apache.maven.plugins:maven-changes-plugin:maven-plugin:2.13-SNAPSHOT:
Artifact is not fully assembled: <https://builds.apache.org/job/maven-plugins-ITs-m3.0.4/ws/maven-changes-plugin/target/classes>
-> [Help 2]
[ERROR] Failed to execute goal org.apache.maven.plugins:maven-invoker-plugin:2.0.0:install
(integration-test) on project maven-stage-plugin: Failed to install project dependencies:
MavenProject: org.apache.maven.plugins:maven-stage-plugin:1.1-SNAPSHOT @ <https://builds.apache.org/job/maven-plugins-ITs-m3.0.4/ws/maven-stage-plugin/pom.xml>:
Failed to install project artifacts: MavenProject: org.apache.maven.plugins:maven-changes-plugin:2.13-SNAPSHOT
@ <https://builds.apache.org/job/maven-plugins-ITs-m3.0.4/ws/maven-changes-plugin/pom.xml>:
Failed to install artifact: org.apache.maven.plugins:maven-changes-plugin:maven-plugin:2.13-SNAPSHOT:
Artifact is not fully assembled: <https://builds.apache.org/job/maven-plugins-ITs-m3.0.4/ws/maven-changes-plugin/target/classes>
-> [Help 2]
[ERROR] Failed to execute goal org.apache.maven.plugins:maven-invoker-plugin:2.0.0:install
(integration-test) on project maven-toolchains-plugin: Failed to install project dependencies:
MavenProject: org.apache.maven.plugins:maven-toolchains-plugin:3.0.0-SNAPSHOT @ <https://builds.apache.org/job/maven-plugins-ITs-m3.0.4/ws/maven-toolchains-plugin/pom.xml>:
Failed to install project artifacts: MavenProject: org.apache.maven.plugins:maven-changes-plugin:2.13-SNAPSHOT
@ <https://builds.apache.org/job/maven-plugins-ITs-m3.0.4/ws/maven-changes-plugin/pom.xml>:
Failed to install artifact: org.apache.maven.plugins:maven-changes-plugin:maven-plugin:2.13-SNAPSHOT:
Artifact is not fully assembled: <https://builds.apache.org/job/maven-plugins-ITs-m3.0.4/ws/maven-changes-plugin/target/classes>
-> [Help 2]
[ERROR] Failed to execute goal org.apache.maven.plugins:maven-invoker-plugin:2.0.0:install
(integration-test) on project maven-verifier-plugin: Failed to install project dependencies:
MavenProject: org.apache.maven.plugins:maven-verifier-plugin:3.0.0-SNAPSHOT @ <https://builds.apache.org/job/maven-plugins-ITs-m3.0.4/ws/maven-verifier-plugin/pom.xml>:
Failed to install project artifacts: MavenProject: org.apache.maven.plugins:maven-changes-plugin:2.13-SNAPSHOT
@ <https://builds.apache.org/job/maven-plugins-ITs-m3.0.4/ws/maven-changes-plugin/pom.xml>:
Failed to install artifact: org.apache.maven.plugins:maven-changes-plugin:maven-plugin:2.13-SNAPSHOT:
Artifact is not fully assembled: <https://builds.apache.org/job/maven-plugins-ITs-m3.0.4/ws/maven-changes-plugin/target/classes>
-> [Help 2]
[ERROR] Failed to execute goal org.apache.maven.plugins:maven-invoker-plugin:2.0.0:install
(integration-test) on project maven-war-plugin: Failed to install project dependencies: MavenProject:
org.apache.maven.plugins:maven-war-plugin:3.0.1-SNAPSHOT @ <https://builds.apache.org/job/maven-plugins-ITs-m3.0.4/ws/maven-war-plugin/pom.xml>:
Failed to install project artifacts: MavenProject: org.apache.maven.plugins:maven-changes-plugin:2.13-SNAPSHOT
@ <https://builds.apache.org/job/maven-plugins-ITs-m3.0.4/ws/maven-changes-plugin/pom.xml>:
Failed to install artifact: org.apache.maven.plugins:maven-changes-plugin:maven-plugin:2.13-SNAPSHOT:
Artifact is not fully assembled: <https://builds.apache.org/job/maven-plugins-ITs-m3.0.4/ws/maven-changes-plugin/target/classes>
-> [Help 2]
[ERROR] Failed to execute goal org.apache.maven.plugins:maven-surefire-plugin:2.18.1:test
(default-test) on project maven-doap-plugin: There are test failures.
[ERROR] 
[ERROR] Please refer to <https://builds.apache.org/job/maven-plugins-ITs-m3.0.4/ws/maven-doap-plugin/target/surefire-reports>
for the individual test results.
[ERROR] -> [Help 1]
[ERROR] Failed to execute goal org.apache.maven.plugins:maven-invoker-plugin:2.0.0:install
(integration-test) on project maven-invoker-plugin: Failed to install project dependencies:
MavenProject: org.apache.maven.plugins:maven-invoker-plugin:3.0.0-SNAPSHOT @ <https://builds.apache.org/job/maven-plugins-ITs-m3.0.4/ws/maven-invoker-plugin/pom.xml>:
Failed to install project artifacts: MavenProject: org.apache.maven.plugins:maven-changes-plugin:2.13-SNAPSHOT
@ <https://builds.apache.org/job/maven-plugins-ITs-m3.0.4/ws/maven-changes-plugin/pom.xml>:
Failed to install artifact: org.apache.maven.plugins:maven-changes-plugin:maven-plugin:2.13-SNAPSHOT:
Artifact is not fully assembled: <https://builds.apache.org/job/maven-plugins-ITs-m3.0.4/ws/maven-changes-plugin/target/classes>
-> [Help 2]
[ERROR] Failed to execute goal org.apache.maven.plugins:maven-invoker-plugin:2.0.0:install
(integration-test) on project maven-jar-plugin: Failed to install project dependencies: MavenProject:
org.apache.maven.plugins:maven-jar-plugin:3.0.3-SNAPSHOT @ <https://builds.apache.org/job/maven-plugins-ITs-m3.0.4/ws/maven-jar-plugin/pom.xml>:
Failed to install project artifacts: MavenProject: org.apache.maven.plugins:maven-changes-plugin:2.13-SNAPSHOT
@ <https://builds.apache.org/job/maven-plugins-ITs-m3.0.4/ws/maven-changes-plugin/pom.xml>:
Failed to install artifact: org.apache.maven.plugins:maven-changes-plugin:maven-plugin:2.13-SNAPSHOT:
Artifact is not fully assembled: <https://builds.apache.org/job/maven-plugins-ITs-m3.0.4/ws/maven-changes-plugin/target/classes>
-> [Help 2]
[ERROR] Failed to execute goal org.apache.maven.plugins:maven-invoker-plugin:2.0.0:install
(integration-test) on project maven-checkstyle-plugin: Failed to install project dependencies:
MavenProject: org.apache.maven.plugins:maven-checkstyle-plugin:2.18-SNAPSHOT @ <https://builds.apache.org/job/maven-plugins-ITs-m3.0.4/ws/maven-checkstyle-plugin/pom.xml>:
Failed to install project artifacts: MavenProject: org.apache.maven.plugins:maven-changes-plugin:2.13-SNAPSHOT
@ <https://builds.apache.org/job/maven-plugins-ITs-m3.0.4/ws/maven-changes-plugin/pom.xml>:
Failed to install artifact: org.apache.maven.plugins:maven-changes-plugin:maven-plugin:2.13-SNAPSHOT:
Artifact is not fully assembled: <https://builds.apache.org/job/maven-plugins-ITs-m3.0.4/ws/maven-changes-plugin/target/classes>
-> [Help 2]
[ERROR] Failed to execute goal org.apache.maven.plugins:maven-invoker-plugin:2.0.0:install
(integration-test) on project maven-pmd-plugin: Failed to install project dependencies: MavenProject:
org.apache.maven.plugins:maven-pmd-plugin:3.8-SNAPSHOT @ <https://builds.apache.org/job/maven-plugins-ITs-m3.0.4/ws/maven-pmd-plugin/pom.xml>:
Failed to install project artifacts: MavenProject: org.apache.maven.plugins:maven-changes-plugin:2.13-SNAPSHOT
@ <https://builds.apache.org/job/maven-plugins-ITs-m3.0.4/ws/maven-changes-plugin/pom.xml>:
Failed to install artifact: org.apache.maven.plugins:maven-changes-plugin:maven-plugin:2.13-SNAPSHOT:
Artifact is not fully assembled: <https://builds.apache.org/job/maven-plugins-ITs-m3.0.4/ws/maven-changes-plugin/target/classes>
-> [Help 2]
[ERROR] Failed to execute goal org.apache.maven.plugins:maven-invoker-plugin:2.0.0:install
(integration-test) on project maven-gpg-plugin: Failed to install project dependencies: MavenProject:
org.apache.maven.plugins:maven-gpg-plugin:1.7-SNAPSHOT @ <https://builds.apache.org/job/maven-plugins-ITs-m3.0.4/ws/maven-gpg-plugin/pom.xml>:
Failed to install project artifacts: MavenProject: org.apache.maven.plugins:maven-changes-plugin:2.13-SNAPSHOT
@ <https://builds.apache.org/job/maven-plugins-ITs-m3.0.4/ws/maven-changes-plugin/pom.xml>:
Failed to install artifact: org.apache.maven.plugins:maven-changes-plugin:maven-plugin:2.13-SNAPSHOT:
Artifact is not fully assembled: <https://builds.apache.org/job/maven-plugins-ITs-m3.0.4/ws/maven-changes-plugin/target/classes>
-> [Help 2]
[ERROR] 
[ERROR] To see the full stack trace of the errors, re-run Maven with the -e switch.
[ERROR] Re-run Maven using the -X switch to enable full debug logging.
[ERROR] 
[ERROR] For more information about the errors and possible solutions, please read the following
articles:
[ERROR] [Help 1] http://cwiki.apache.org/confluence/display/MAVEN/MojoFailureException
[ERROR] [Help 2] http://cwiki.apache.org/confluence/display/MAVEN/MojoExecutionException
[ERROR] [Help 3] http://cwiki.apache.org/confluence/display/MAVEN/DependencyResolutionException
[ERROR] 
[ERROR] After correcting the problems, you can resume the build with the command
[ERROR]   mvn <goals> -rf :maven-ant-plugin
Build step 'Invoke top-level Maven targets' marked build as failure
Deleting 1 temporary files
Recording test results

Mime
View raw message