maven-notifications mailing list archives

Site index · List index
Message view « Date » · « Thread »
Top « Date » · « Thread »
From Apache Jenkins Server <jenk...@builds.apache.org>
Subject Build failed in Jenkins: core-it-maven-3-win #1346
Date Sat, 01 Oct 2016 17:12:43 GMT
See <https://builds.apache.org/job/core-it-maven-3-win/1346/changes>

Changes:

[khmarbaise] [MNG-6092] warn if prerequisites.maven is used for non-plugin projects

[khmarbaise] [MNG-6092] warn if prerequisites.maven is used for non-plugin projects 

------------------------------------------
[...truncated 11253 lines...]
    at org.eclipse.aether.internal.transport.wagon.PlexusWagonProvider.lookup (PlexusWagonProvider.java:58)
    at org.eclipse.aether.transport.wagon.WagonTransporter.lookupWagon (WagonTransporter.java:271)
    at org.eclipse.aether.transport.wagon.WagonTransporter.<init> (WagonTransporter.java:115)
    at org.eclipse.aether.transport.wagon.WagonTransporterFactory.newInstance (WagonTransporterFactory.java:127)
    at org.eclipse.aether.internal.impl.DefaultTransporterProvider.newTransporter (DefaultTransporterProvider.java:110)
    at org.eclipse.aether.connector.basic.BasicRepositoryConnector.<init> (BasicRepositoryConnector.java:115)
    at org.eclipse.aether.connector.basic.BasicRepositoryConnectorFactory.newInstance (BasicRepositoryConnectorFactory.java:180)
    at org.eclipse.aether.internal.impl.DefaultRepositoryConnectorProvider.newRepositoryConnector
(DefaultRepositoryConnectorProvider.java:113)
    at org.eclipse.aether.internal.impl.DefaultArtifactResolver.performDownloads (DefaultArtifactResolver.java:516)
    at org.eclipse.aether.internal.impl.DefaultArtifactResolver.resolve (DefaultArtifactResolver.java:421)
    at org.eclipse.aether.internal.impl.DefaultArtifactResolver.resolveArtifacts (DefaultArtifactResolver.java:246)
    at org.eclipse.aether.internal.impl.DefaultArtifactResolver.resolveArtifact (DefaultArtifactResolver.java:223)
    at org.apache.maven.repository.internal.DefaultArtifactDescriptorReader.loadPom (DefaultArtifactDescriptorReader.java:267)
    at org.apache.maven.repository.internal.DefaultArtifactDescriptorReader.readArtifactDescriptor
(DefaultArtifactDescriptorReader.java:198)
    at org.eclipse.aether.internal.impl.DefaultDependencyCollector.collectDependencies (DefaultDependencyCollector.java:202)
    at org.eclipse.aether.internal.impl.DefaultRepositorySystem.collectDependencies (DefaultRepositorySystem.java:316)
    at org.apache.maven.plugin.internal.DefaultPluginDependenciesResolver.resolveInternal
(DefaultPluginDependenciesResolver.java:202)
    at org.apache.maven.plugin.internal.DefaultPluginDependenciesResolver.resolve (DefaultPluginDependenciesResolver.java:149)
    at org.apache.maven.plugin.internal.DefaultMavenPluginManager.resolveExtensionArtifacts
(DefaultMavenPluginManager.java:906)
    at org.apache.maven.plugin.internal.DefaultMavenPluginManager.setupExtensionsRealm (DefaultMavenPluginManager.java:837)
    at org.apache.maven.project.DefaultProjectBuildingHelper.createProjectRealm (DefaultProjectBuildingHelper.java:196)
    at org.apache.maven.project.DefaultModelBuildingListener.buildExtensionsAssembled (DefaultModelBuildingListener.java:99)
    at org.apache.maven.model.building.ModelBuildingEventCatapult$1.fire (ModelBuildingEventCatapult.java:44)
    at org.apache.maven.model.building.DefaultModelBuilder.fireEvent (DefaultModelBuilder.java:1679)
    at org.apache.maven.model.building.DefaultModelBuilder.build (DefaultModelBuilder.java:496)
    at org.apache.maven.project.DefaultProjectBuilder.build (DefaultProjectBuilder.java:580)
    at org.apache.maven.project.DefaultProjectBuilder.build (DefaultProjectBuilder.java:371)
    at org.apache.maven.graph.DefaultGraphBuilder.collectProjects (DefaultGraphBuilder.java:419)
    at org.apache.maven.graph.DefaultGraphBuilder.getProjectsForMavenReactor (DefaultGraphBuilder.java:410)
    at org.apache.maven.graph.DefaultGraphBuilder.build (DefaultGraphBuilder.java:83)
    at org.apache.maven.DefaultMaven.buildGraph (DefaultMaven.java:511)
    at org.apache.maven.DefaultMaven.doExecute (DefaultMaven.java:221)
    at org.apache.maven.DefaultMaven.doExecute (DefaultMaven.java:194)
    at org.apache.maven.DefaultMaven.execute (DefaultMaven.java:107)
    at org.apache.maven.cli.MavenCli.execute (MavenCli.java:1016)
    at org.apache.maven.cli.MavenCli.doMain (MavenCli.java:314)
    at org.apache.maven.cli.MavenCli.main (MavenCli.java:217)
    at sun.reflect.NativeMethodAccessorImpl.invoke0 (Native Method)
    at sun.reflect.NativeMethodAccessorImpl.invoke (NativeMethodAccessorImpl.java:57)
    at sun.reflect.DelegatingMethodAccessorImpl.invoke (DelegatingMethodAccessorImpl.java:43)
    at java.lang.reflect.Method.invoke (Method.java:606)
    at org.codehaus.plexus.classworlds.launcher.Launcher.launchEnhanced (Launcher.java:289)
    at org.codehaus.plexus.classworlds.launcher.Launcher.launch (Launcher.java:229)
    at org.codehaus.plexus.classworlds.launcher.Launcher.mainWithExitCode (Launcher.java:415)
    at org.codehaus.plexus.classworlds.launcher.Launcher.main (Launcher.java:356)
Caused by: java.util.NoSuchElementException
    at org.eclipse.sisu.plexus.RealmFilteredBeans$FilteredItr.next (RealmFilteredBeans.java:118)
    at org.eclipse.sisu.plexus.RealmFilteredBeans$FilteredItr.next (RealmFilteredBeans.java:1)
    at org.eclipse.sisu.plexus.DefaultPlexusBeans$Itr.next (DefaultPlexusBeans.java:76)
    at org.eclipse.sisu.plexus.DefaultPlexusBeans$Itr.next (DefaultPlexusBeans.java:1)
    at org.codehaus.plexus.DefaultPlexusContainer.lookup (DefaultPlexusContainer.java:263)
    at org.codehaus.plexus.DefaultPlexusContainer.lookup (DefaultPlexusContainer.java:255)
    at org.eclipse.aether.internal.transport.wagon.PlexusWagonProvider.lookup (PlexusWagonProvider.java:58)
    at org.eclipse.aether.transport.wagon.WagonTransporter.lookupWagon (WagonTransporter.java:271)
    at org.eclipse.aether.transport.wagon.WagonTransporter.<init> (WagonTransporter.java:115)
    at org.eclipse.aether.transport.wagon.WagonTransporterFactory.newInstance (WagonTransporterFactory.java:127)
    at org.eclipse.aether.internal.impl.DefaultTransporterProvider.newTransporter (DefaultTransporterProvider.java:110)
    at org.eclipse.aether.connector.basic.BasicRepositoryConnector.<init> (BasicRepositoryConnector.java:115)
    at org.eclipse.aether.connector.basic.BasicRepositoryConnectorFactory.newInstance (BasicRepositoryConnectorFactory.java:180)
    at org.eclipse.aether.internal.impl.DefaultRepositoryConnectorProvider.newRepositoryConnector
(DefaultRepositoryConnectorProvider.java:113)
    at org.eclipse.aether.internal.impl.DefaultArtifactResolver.performDownloads (DefaultArtifactResolver.java:516)
    at org.eclipse.aether.internal.impl.DefaultArtifactResolver.resolve (DefaultArtifactResolver.java:421)
    at org.eclipse.aether.internal.impl.DefaultArtifactResolver.resolveArtifacts (DefaultArtifactResolver.java:246)
    at org.eclipse.aether.internal.impl.DefaultArtifactResolver.resolveArtifact (DefaultArtifactResolver.java:223)
    at org.apache.maven.repository.internal.DefaultArtifactDescriptorReader.loadPom (DefaultArtifactDescriptorReader.java:267)
    at org.apache.maven.repository.internal.DefaultArtifactDescriptorReader.readArtifactDescriptor
(DefaultArtifactDescriptorReader.java:198)
    at org.eclipse.aether.internal.impl.DefaultDependencyCollector.collectDependencies (DefaultDependencyCollector.java:202)
    at org.eclipse.aether.internal.impl.DefaultRepositorySystem.collectDependencies (DefaultRepositorySystem.java:316)
    at org.apache.maven.plugin.internal.DefaultPluginDependenciesResolver.resolveInternal
(DefaultPluginDependenciesResolver.java:202)
    at org.apache.maven.plugin.internal.DefaultPluginDependenciesResolver.resolve (DefaultPluginDependenciesResolver.java:149)
    at org.apache.maven.plugin.internal.DefaultMavenPluginManager.resolveExtensionArtifacts
(DefaultMavenPluginManager.java:906)
    at org.apache.maven.plugin.internal.DefaultMavenPluginManager.setupExtensionsRealm (DefaultMavenPluginManager.java:837)
    at org.apache.maven.project.DefaultProjectBuildingHelper.createProjectRealm (DefaultProjectBuildingHelper.java:196)
    at org.apache.maven.project.DefaultModelBuildingListener.buildExtensionsAssembled (DefaultModelBuildingListener.java:99)
    at org.apache.maven.model.building.ModelBuildingEventCatapult$1.fire (ModelBuildingEventCatapult.java:44)
    at org.apache.maven.model.building.DefaultModelBuilder.fireEvent (DefaultModelBuilder.java:1679)
    at org.apache.maven.model.building.DefaultModelBuilder.build (DefaultModelBuilder.java:496)
    at org.apache.maven.project.DefaultProjectBuilder.build (DefaultProjectBuilder.java:580)
    at org.apache.maven.project.DefaultProjectBuilder.build (DefaultProjectBuilder.java:371)
    at org.apache.maven.graph.DefaultGraphBuilder.collectProjects (DefaultGraphBuilder.java:419)
    at org.apache.maven.graph.DefaultGraphBuilder.getProjectsForMavenReactor (DefaultGraphBuilder.java:410)
    at org.apache.maven.graph.DefaultGraphBuilder.build (DefaultGraphBuilder.java:83)
    at org.apache.maven.DefaultMaven.buildGraph (DefaultMaven.java:511)
    at org.apache.maven.DefaultMaven.doExecute (DefaultMaven.java:221)
    at org.apache.maven.DefaultMaven.doExecute (DefaultMaven.java:194)
    at org.apache.maven.DefaultMaven.execute (DefaultMaven.java:107)
    at org.apache.maven.cli.MavenCli.execute (MavenCli.java:1016)
    at org.apache.maven.cli.MavenCli.doMain (MavenCli.java:314)
    at org.apache.maven.cli.MavenCli.main (MavenCli.java:217)
    at sun.reflect.NativeMethodAccessorImpl.invoke0 (Native Method)
    at sun.reflect.NativeMethodAccessorImpl.invoke (NativeMethodAccessorImpl.java:57)
    at sun.reflect.DelegatingMethodAccessorImpl.invoke (DelegatingMethodAccessorImpl.java:43)
    at java.lang.reflect.Method.invoke (Method.java:606)
    at org.codehaus.plexus.classworlds.launcher.Launcher.launchEnhanced (Launcher.java:289)
    at org.codehaus.plexus.classworlds.launcher.Launcher.launch (Launcher.java:229)
    at org.codehaus.plexus.classworlds.launcher.Launcher.mainWithExitCode (Launcher.java:415)
    at org.codehaus.plexus.classworlds.launcher.Launcher.main (Launcher.java:356)
[ERROR] 
[ERROR] 
[ERROR] For more information about the errors and possible solutions, please read the following
articles:
[ERROR] [Help 1] http://cwiki.apache.org/confluence/display/MAVEN/ProjectBuildingException
[ERROR] [Help 2] http://cwiki.apache.org/confluence/display/MAVEN/PluginManagerException

	at org.apache.maven.it.Verifier.executeGoals(Verifier.java:1374)
	at org.apache.maven.it.Verifier.executeGoal(Verifier.java:1259)
	at org.apache.maven.it.Verifier.executeGoal(Verifier.java:1253)
	at org.apache.maven.it.MavenITmng3599useHttpProxyForWebDAVTest.testitUseHttpProxyForWebDAV(MavenITmng3599useHttpProxyForWebDAVTest.java:208)


Results :

Tests in error: 
  MavenITmng3599useHttpProxyForWebDAVTest>AbstractMavenIntegrationTestCase.runTest:222->testitUseHttpProxyForWebDAV:208
ยป Verification

Tests run: 794, Failures: 0, Errors: 1, Skipped: 0

[INFO] ------------------------------------------------------------------------
[INFO] Reactor Summary:
[INFO] 
[INFO] Maven Core ITs ..................................... SUCCESS [ 33.688 s]
[INFO] Maven IT Support ................................... SUCCESS [  1.687 s]
[INFO] Maven IT :: Plugins ................................ SUCCESS [  1.500 s]
[INFO] Maven IT Plugin :: Active Collection ............... SUCCESS [  8.219 s]
[INFO] Maven IT Plugin :: Ant-Based ....................... SUCCESS [  5.563 s]
[INFO] Maven IT Plugin :: Artifact ........................ SUCCESS [  3.015 s]
[INFO] Maven IT Plugin :: Class Loader :: Dependency A .... SUCCESS [  1.250 s]
[INFO] Maven IT Plugin :: Class Loader :: Dependency B .... SUCCESS [  1.235 s]
[INFO] Maven IT Plugin :: Class Loader :: Dependency C .... SUCCESS [  1.234 s]
[INFO] Maven IT Plugin :: Class Loader .................... SUCCESS [  2.703 s]
[INFO] Maven IT Plugin :: Class Loader :: Aggregator ...... SUCCESS [  1.250 s]
[INFO] Maven IT Plugin :: Configuration ................... SUCCESS [  1.813 s]
[INFO] Maven IT Plugin :: Context Passing ................. SUCCESS [  1.281 s]
[INFO] Maven ITs :: Core Plugin Stubs ..................... SUCCESS [  1.140 s]
[INFO] Maven IT Clean Plugin Stub ......................... SUCCESS [  1.454 s]
[INFO] Maven IT Compiler Plugin Stub ...................... SUCCESS [  1.453 s]
[INFO] Maven IT Deploy Plugin Stub ........................ SUCCESS [  1.484 s]
[INFO] Maven IT EAR Plugin Stub ........................... SUCCESS [  1.391 s]
[INFO] Maven IT EJB Plugin Stub ........................... SUCCESS [  1.437 s]
[INFO] Maven IT Install Plugin Stub ....................... SUCCESS [  1.297 s]
[INFO] Maven IT JAR Plugin Stub ........................... SUCCESS [  1.328 s]
[INFO] Maven IT Javadoc Plugin Stub ....................... SUCCESS [  1.313 s]
[INFO] Maven IT Plugin Plugin Stub ........................ SUCCESS [  1.406 s]
[INFO] Maven IT RAR Plugin Stub ........................... SUCCESS [  1.453 s]
[INFO] Maven IT Resources Plugin Stub ..................... SUCCESS [  1.844 s]
[INFO] Maven IT Site Plugin Stub .......................... SUCCESS [  1.359 s]
[INFO] Maven IT Source Plugin Stub ........................ SUCCESS [  1.375 s]
[INFO] Maven IT Surefire Plugin Stub ...................... SUCCESS [  1.391 s]
[INFO] Maven IT WAR Plugin Stub ........................... SUCCESS [  1.390 s]
[INFO] Maven IT Plugin :: Dependency Collection ........... SUCCESS [  1.422 s]
[INFO] Maven IT Plugin :: Dependency Resolution ........... SUCCESS [  6.719 s]
[INFO] Maven IT Plugin :: Expression ...................... SUCCESS [  1.875 s]
[INFO] Maven IT Plugin :: Error Mojos ..................... SUCCESS [  2.531 s]
[INFO] Maven IT Component ................................. SUCCESS [  1.235 s]
[INFO] Maven IT Plugin :: Extension Consumer .............. SUCCESS [  1.328 s]
[INFO] Maven IT Plugin :: Extension Provider .............. SUCCESS [  1.297 s]
[INFO] Maven IT Plugin :: Fork ............................ SUCCESS [  1.453 s]
[INFO] Maven IT Plugin :: Invalid Descriptor .............. SUCCESS [  1.219 s]
[INFO] Maven IT Plugin :: Log File ........................ SUCCESS [  1.218 s]
[INFO] Maven IT Helper Library ............................ SUCCESS [  3.547 s]
[INFO] Maven IT Plugin :: Model Interpolation ............. SUCCESS [  1.828 s]
[INFO] Maven IT Plugin :: No Default Component ............ SUCCESS [  1.282 s]
[INFO] Maven IT Plugin :: No Project ...................... SUCCESS [  1.234 s]
[INFO] Maven IT Plugin :: Online .......................... SUCCESS [  1.156 s]
[INFO] Maven IT Plugin :: Optional Mojos .................. SUCCESS [  1.672 s]
[INFO] Maven IT Plugin :: Packaging ....................... SUCCESS [  1.313 s]
[INFO] Maven IT Plugin :: Parameter Implementation ........ SUCCESS [  1.250 s]
[INFO] Maven IT Plugin :: Plugin Dependency ............... SUCCESS [  1.296 s]
[INFO] Maven IT Plugin :: Project ......................... SUCCESS [  1.607 s]
[INFO] Maven IT Plugin :: Project Interpolation ........... SUCCESS [  1.535 s]
[INFO] Maven IT Plugin :: Setter .......................... SUCCESS [  1.255 s]
[INFO] Maven IT Plugin :: Singleton Component ............. SUCCESS [  1.331 s]
[INFO] Maven IT Plugin :: Site ............................ SUCCESS [  2.731 s]
[INFO] Maven IT Plugin :: Toolchain ....................... SUCCESS [  5.069 s]
[INFO] Maven IT Plugin :: Touch ........................... SUCCESS [  1.624 s]
[INFO] Maven IT Plugin :: Uses Properties Plugin .......... SUCCESS [  1.252 s]
[INFO] Maven IT Plugin :: Uses Wagon Plugin ............... SUCCESS [  2.798 s]
[INFO] Maven IT Plugin :: This plugin should contain the mojos needed by all tests. SUCCESS
[  1.322 s]
[INFO] Maven IT Plugin :: Plexus Utils 1.1 ................ SUCCESS [  1.367 s]
[INFO] Maven IT Plugin :: Plexus Utils New ................ SUCCESS [  1.347 s]
[INFO] Maven IT Plugin :: Plexus Component API ............ SUCCESS [  2.024 s]
[INFO] Maven IT Plugin :: Log4J Client .................... SUCCESS [  1.433 s]
[INFO] Maven IT Plugin :: Extension 1 ..................... SUCCESS [  1.313 s]
[INFO] Maven IT Plugin :: Extension 2 ..................... SUCCESS [  1.183 s]
[INFO] Maven IT Plugin :: Plexus Lifecycle ................ SUCCESS [  1.856 s]
[INFO] Maven IT Plugin :: Settings ........................ SUCCESS [  1.435 s]
[INFO] Maven IT Plugin :: mng-5805 extension .............. SUCCESS [  1.179 s]
[INFO] Maven IT Plugin :: mng-5805 plugin ................. SUCCESS [  1.437 s]
[INFO] Maven IT Plugin :: mng-5805 plugin-dep ............. SUCCESS [  1.182 s]
[INFO] Maven IT Plugin :: mng-5958 extension .............. SUCCESS [  3.442 s]
[INFO] Maven IT Toolchain ................................. SUCCESS [  1.872 s]
[INFO] Maven IT Wagon ..................................... SUCCESS [  1.667 s]
[INFO] Maven IT Support Artifacts ......................... SUCCESS [  2.695 s]
[INFO] Maven IT Extension ................................. SUCCESS [  1.160 s]
[INFO] Maven ITs .......................................... FAILURE [  01:11 h]
[INFO] ------------------------------------------------------------------------
[INFO] BUILD FAILURE
[INFO] ------------------------------------------------------------------------
[INFO] Total time: 01:14 h
[INFO] Finished at: 2016-10-01T10:12:27-07:00
[INFO] Final Memory: 61M/765M
[INFO] ------------------------------------------------------------------------
[ERROR] Failed to execute goal org.apache.maven.plugins:maven-surefire-plugin:2.18.1:test
(default-test) on project core-it-suite: There are test failures.
[ERROR] 
[ERROR] Please refer to F:\ws\m3-its\core-integration-testing-trunk\core-it-suite\target\surefire-reports
for the individual test results.
[ERROR] -> [Help 1]
org.apache.maven.lifecycle.LifecycleExecutionException: Failed to execute goal org.apache.maven.plugins:maven-surefire-plugin:2.18.1:test
(default-test) on project core-it-suite: There are test failures.

Please refer to F:\ws\m3-its\core-integration-testing-trunk\core-it-suite\target\surefire-reports
for the individual test results.
	at org.apache.maven.lifecycle.internal.MojoExecutor.execute(MojoExecutor.java:212)
	at org.apache.maven.lifecycle.internal.MojoExecutor.execute(MojoExecutor.java:153)
	at org.apache.maven.lifecycle.internal.MojoExecutor.execute(MojoExecutor.java:145)
	at org.apache.maven.lifecycle.internal.LifecycleModuleBuilder.buildProject(LifecycleModuleBuilder.java:116)
	at org.apache.maven.lifecycle.internal.LifecycleModuleBuilder.buildProject(LifecycleModuleBuilder.java:80)
	at org.apache.maven.lifecycle.internal.builder.singlethreaded.SingleThreadedBuilder.build(SingleThreadedBuilder.java:51)
	at org.apache.maven.lifecycle.internal.LifecycleStarter.execute(LifecycleStarter.java:128)
	at org.apache.maven.DefaultMaven.doExecute(DefaultMaven.java:307)
	at org.apache.maven.DefaultMaven.doExecute(DefaultMaven.java:193)
	at org.apache.maven.DefaultMaven.execute(DefaultMaven.java:106)
	at org.apache.maven.cli.MavenCli.execute(MavenCli.java:863)
	at org.apache.maven.cli.MavenCli.doMain(MavenCli.java:288)
	at org.apache.maven.cli.MavenCli.main(MavenCli.java:199)
	at sun.reflect.NativeMethodAccessorImpl.invoke0(Native Method)
	at sun.reflect.NativeMethodAccessorImpl.invoke(NativeMethodAccessorImpl.java:57)
	at sun.reflect.DelegatingMethodAccessorImpl.invoke(DelegatingMethodAccessorImpl.java:43)
	at java.lang.reflect.Method.invoke(Method.java:606)
	at org.codehaus.plexus.classworlds.launcher.Launcher.launchEnhanced(Launcher.java:289)
	at org.codehaus.plexus.classworlds.launcher.Launcher.launch(Launcher.java:229)
	at org.codehaus.plexus.classworlds.launcher.Launcher.mainWithExitCode(Launcher.java:415)
	at org.codehaus.plexus.classworlds.launcher.Launcher.main(Launcher.java:356)
Caused by: org.apache.maven.plugin.MojoFailureException: There are test failures.

Please refer to F:\ws\m3-its\core-integration-testing-trunk\core-it-suite\target\surefire-reports
for the individual test results.
	at org.apache.maven.plugin.surefire.SurefireHelper.reportExecution(SurefireHelper.java:82)
	at org.apache.maven.plugin.surefire.SurefirePlugin.handleSummary(SurefirePlugin.java:254)
	at org.apache.maven.plugin.surefire.AbstractSurefireMojo.executeAfterPreconditionsChecked(AbstractSurefireMojo.java:854)
	at org.apache.maven.plugin.surefire.AbstractSurefireMojo.execute(AbstractSurefireMojo.java:722)
	at org.apache.maven.plugin.DefaultBuildPluginManager.executeMojo(DefaultBuildPluginManager.java:134)
	at org.apache.maven.lifecycle.internal.MojoExecutor.execute(MojoExecutor.java:207)
	... 20 more
[ERROR] 
[ERROR] Re-run Maven using the -X switch to enable full debug logging.
[ERROR] 
[ERROR] For more information about the errors and possible solutions, please read the following
articles:
[ERROR] [Help 1] http://cwiki.apache.org/confluence/display/MAVEN/MojoFailureException
[ERROR] 
[ERROR] After correcting the problems, you can resume the build with the command
[ERROR]   mvn <goals> -rf :core-it-suite
Build step 'Invoke top-level Maven targets' marked build as failure
Recording test results

Mime
View raw message