maven-notifications mailing list archives

Site index · List index
Message view « Date » · « Thread »
Top « Date » · « Thread »
From Apache Jenkins Server <jenk...@builds.apache.org>
Subject Build failed in Jenkins: dist-tool-plugin #1521
Date Tue, 01 Nov 2016 10:03:29 GMT
See <https://builds.apache.org/job/dist-tool-plugin/1521/>

------------------------------------------
[...truncated 2904 lines...]
[INFO] Downloaded: https://repo.maven.apache.org/maven2/org/apache/maven/doxia/doxia-converter/1.2/doxia-converter-1.2.pom
(6 KB at 622.2 KB/sec)
[INFO] Downloading: https://repo.maven.apache.org/maven2/org/apache/maven/doxia/doxia-tools/1.2/doxia-tools-1.2.pom
[INFO] Downloaded: https://repo.maven.apache.org/maven2/org/apache/maven/doxia/doxia-tools/1.2/doxia-tools-1.2.pom
(9 KB at 1080.2 KB/sec)
[INFO] Downloading: https://repo.maven.apache.org/maven2/org/apache/maven/doxia/doxia-linkcheck/1.2/doxia-linkcheck-1.2.pom
[INFO] Downloaded: https://repo.maven.apache.org/maven2/org/apache/maven/doxia/doxia-linkcheck/1.2/doxia-linkcheck-1.2.pom
(4 KB at 420.3 KB/sec)
[INFO] Downloading: https://repo.maven.apache.org/maven2/org/apache/maven/doxia/doxia-sitetools/1.7.2/doxia-sitetools-1.7.2.pom
[INFO] Downloaded: https://repo.maven.apache.org/maven2/org/apache/maven/doxia/doxia-sitetools/1.7.2/doxia-sitetools-1.7.2.pom
(14 KB at 1136.6 KB/sec)
[INFO] Downloading: https://repo.maven.apache.org/maven2/org/apache/maven/indexer/maven-indexer/5.1.1/maven-indexer-5.1.1.pom
[INFO] Downloaded: https://repo.maven.apache.org/maven2/org/apache/maven/indexer/maven-indexer/5.1.1/maven-indexer-5.1.1.pom
(13 KB at 1204.0 KB/sec)
[INFO] Downloading: https://repo.maven.apache.org/maven2/org/apache/maven/apache-maven/3.0.5/apache-maven-3.0.5.pom
[INFO] Downloaded: https://repo.maven.apache.org/maven2/org/apache/maven/apache-maven/3.0.5/apache-maven-3.0.5.pom
(6 KB at 665.0 KB/sec)
[INFO] Downloading: https://repo.maven.apache.org/maven2/org/apache/maven/maven/3.0.5/maven-3.0.5.pom
[INFO] Downloaded: https://repo.maven.apache.org/maven2/org/apache/maven/maven/3.0.5/maven-3.0.5.pom
(22 KB at 2735.7 KB/sec)
[INFO] Downloading: https://repo.maven.apache.org/maven2/org/apache/maven/apache-maven/3.1.1/apache-maven-3.1.1.pom
[INFO] Downloaded: https://repo.maven.apache.org/maven2/org/apache/maven/apache-maven/3.1.1/apache-maven-3.1.1.pom
(7 KB at 737.4 KB/sec)
[INFO] Downloading: https://repo.maven.apache.org/maven2/org/apache/maven/maven/3.1.1/maven-3.1.1.pom
[INFO] Downloaded: https://repo.maven.apache.org/maven2/org/apache/maven/maven/3.1.1/maven-3.1.1.pom
(22 KB at 3082.4 KB/sec)
[INFO] Downloading: https://repo.maven.apache.org/maven2/org/apache/maven/apache-maven/3.3.9/apache-maven-3.3.9.pom
[INFO] Downloaded: https://repo.maven.apache.org/maven2/org/apache/maven/apache-maven/3.3.9/apache-maven-3.3.9.pom
(7 KB at 123.8 KB/sec)
[INFO] Downloading: https://repo.maven.apache.org/maven2/org/apache/maven/maven/3.3.9/maven-3.3.9.pom
[INFO] Downloaded: https://repo.maven.apache.org/maven2/org/apache/maven/maven/3.3.9/maven-3.3.9.pom
(24 KB at 2921.1 KB/sec)
[INFO] Downloading: https://repo.maven.apache.org/maven2/org/apache/maven/plugin-testing/maven-plugin-testing/3.3.0/maven-plugin-testing-3.3.0.pom
[INFO] Downloaded: https://repo.maven.apache.org/maven2/org/apache/maven/plugin-testing/maven-plugin-testing/3.3.0/maven-plugin-testing-3.3.0.pom
(11 KB at 1296.6 KB/sec)
[INFO] Downloading: https://repo.maven.apache.org/maven2/org/apache/maven/plugin-tools/maven-plugin-tools/3.5/maven-plugin-tools-3.5.pom
[INFO] Downloaded: https://repo.maven.apache.org/maven2/org/apache/maven/plugin-tools/maven-plugin-tools/3.5/maven-plugin-tools-3.5.pom
(16 KB at 1756.7 KB/sec)
[INFO] Downloading: https://repo.maven.apache.org/maven2/org/apache/maven/plugins/maven-acr-plugin/3.0.0/maven-acr-plugin-3.0.0.pom
[INFO] Downloaded: https://repo.maven.apache.org/maven2/org/apache/maven/plugins/maven-acr-plugin/3.0.0/maven-acr-plugin-3.0.0.pom
(5 KB at 368.8 KB/sec)
[INFO] Downloading: https://repo.maven.apache.org/maven2/org/apache/maven/plugins/maven-ant-plugin/2.4/maven-ant-plugin-2.4.pom
[INFO] Downloaded: https://repo.maven.apache.org/maven2/org/apache/maven/plugins/maven-ant-plugin/2.4/maven-ant-plugin-2.4.pom
(6 KB at 680.3 KB/sec)
[INFO] Downloading: https://repo.maven.apache.org/maven2/org/apache/maven/plugins/maven-changelog-plugin/2.3/maven-changelog-plugin-2.3.pom
[INFO] Downloaded: https://repo.maven.apache.org/maven2/org/apache/maven/plugins/maven-changelog-plugin/2.3/maven-changelog-plugin-2.3.pom
(14 KB at 1325.7 KB/sec)
[INFO] Downloading: https://repo.maven.apache.org/maven2/org/apache/maven/plugins/maven-checkstyle-plugin/2.17/maven-checkstyle-plugin-2.17.pom
[INFO] Downloaded: https://repo.maven.apache.org/maven2/org/apache/maven/plugins/maven-checkstyle-plugin/2.17/maven-checkstyle-plugin-2.17.pom
(14 KB at 1629.5 KB/sec)
[INFO] Downloading: https://repo.maven.apache.org/maven2/org/apache/maven/plugins/maven-compiler-plugin/3.6.0/maven-compiler-plugin-3.6.0.pom
[INFO] Downloaded: https://repo.maven.apache.org/maven2/org/apache/maven/plugins/maven-compiler-plugin/3.6.0/maven-compiler-plugin-3.6.0.pom
(11 KB at 1297.1 KB/sec)
[INFO] Downloading: https://repo.maven.apache.org/maven2/org/apache/maven/plugins/maven-plugins/30/maven-plugins-30.pom
[INFO] Downloaded: https://repo.maven.apache.org/maven2/org/apache/maven/plugins/maven-plugins/30/maven-plugins-30.pom
(10 KB at 1419.1 KB/sec)
[INFO] Downloading: https://repo.maven.apache.org/maven2/org/apache/maven/plugins/maven-doap-plugin/1.2/maven-doap-plugin-1.2.pom
[INFO] Downloaded: https://repo.maven.apache.org/maven2/org/apache/maven/plugins/maven-doap-plugin/1.2/maven-doap-plugin-1.2.pom
(8 KB at 859.0 KB/sec)
[INFO] Downloading: https://repo.maven.apache.org/maven2/org/apache/maven/plugins/maven-ear-plugin/2.10.1/maven-ear-plugin-2.10.1.pom
[INFO] Downloaded: https://repo.maven.apache.org/maven2/org/apache/maven/plugins/maven-ear-plugin/2.10.1/maven-ear-plugin-2.10.1.pom
(10 KB at 1172.6 KB/sec)
[INFO] Downloading: https://repo.maven.apache.org/maven2/org/apache/maven/plugins/maven-ejb-plugin/2.5.1/maven-ejb-plugin-2.5.1.pom
[INFO] Downloaded: https://repo.maven.apache.org/maven2/org/apache/maven/plugins/maven-ejb-plugin/2.5.1/maven-ejb-plugin-2.5.1.pom
(6 KB at 670.0 KB/sec)
[INFO] Downloading: https://repo.maven.apache.org/maven2/org/apache/maven/plugins/maven-help-plugin/2.2/maven-help-plugin-2.2.pom
[INFO] Downloaded: https://repo.maven.apache.org/maven2/org/apache/maven/plugins/maven-help-plugin/2.2/maven-help-plugin-2.2.pom
(9 KB at 1216.7 KB/sec)
[INFO] Downloading: https://repo.maven.apache.org/maven2/org/apache/maven/plugins/maven-jar-plugin/3.0.2/maven-jar-plugin-3.0.2.pom
[INFO] Downloaded: https://repo.maven.apache.org/maven2/org/apache/maven/plugins/maven-jar-plugin/3.0.2/maven-jar-plugin-3.0.2.pom
(7 KB at 1005.5 KB/sec)
[INFO] Downloading: https://repo.maven.apache.org/maven2/org/apache/maven/plugins/maven-jarsigner-plugin/1.4/maven-jarsigner-plugin-1.4.pom
[INFO] Downloaded: https://repo.maven.apache.org/maven2/org/apache/maven/plugins/maven-jarsigner-plugin/1.4/maven-jarsigner-plugin-1.4.pom
(5 KB at 601.7 KB/sec)
[INFO] Downloading: https://repo.maven.apache.org/maven2/org/apache/maven/plugins/maven-javadoc-plugin/2.10.4/maven-javadoc-plugin-2.10.4.pom
[INFO] Downloaded: https://repo.maven.apache.org/maven2/org/apache/maven/plugins/maven-javadoc-plugin/2.10.4/maven-javadoc-plugin-2.10.4.pom
(16 KB at 1682.7 KB/sec)
[INFO] Downloading: https://repo.maven.apache.org/maven2/org/apache/maven/plugins/maven-jdeps-plugin/3.0.0/maven-jdeps-plugin-3.0.0.pom
[INFO] Downloaded: https://repo.maven.apache.org/maven2/org/apache/maven/plugins/maven-jdeps-plugin/3.0.0/maven-jdeps-plugin-3.0.0.pom
(4 KB at 391.4 KB/sec)
[INFO] Downloading: https://repo.maven.apache.org/maven2/org/apache/maven/plugins/maven-linkcheck-plugin/1.2/maven-linkcheck-plugin-1.2.pom
[INFO] Downloaded: https://repo.maven.apache.org/maven2/org/apache/maven/plugins/maven-linkcheck-plugin/1.2/maven-linkcheck-plugin-1.2.pom
(8 KB at 882.7 KB/sec)
[INFO] Downloading: https://repo.maven.apache.org/maven2/org/apache/maven/plugins/maven-patch-plugin/1.2/maven-patch-plugin-1.2.pom
[INFO] Downloaded: https://repo.maven.apache.org/maven2/org/apache/maven/plugins/maven-patch-plugin/1.2/maven-patch-plugin-1.2.pom
(5 KB at 525.3 KB/sec)
[INFO] Downloading: https://repo.maven.apache.org/maven2/org/apache/maven/plugins/maven-pdf-plugin/1.3/maven-pdf-plugin-1.3.pom
[INFO] Downloaded: https://repo.maven.apache.org/maven2/org/apache/maven/plugins/maven-pdf-plugin/1.3/maven-pdf-plugin-1.3.pom
(12 KB at 1144.6 KB/sec)
[INFO] Downloading: https://repo.maven.apache.org/maven2/org/apache/maven/plugins/maven-pmd-plugin/3.7/maven-pmd-plugin-3.7.pom
[INFO] Downloaded: https://repo.maven.apache.org/maven2/org/apache/maven/plugins/maven-pmd-plugin/3.7/maven-pmd-plugin-3.7.pom
(12 KB at 1377.1 KB/sec)
[INFO] Downloading: https://repo.maven.apache.org/maven2/org/apache/maven/plugins/maven-rar-plugin/2.4/maven-rar-plugin-2.4.pom
[INFO] Downloaded: https://repo.maven.apache.org/maven2/org/apache/maven/plugins/maven-rar-plugin/2.4/maven-rar-plugin-2.4.pom
(7 KB at 811.5 KB/sec)
[INFO] Downloading: https://repo.maven.apache.org/maven2/org/apache/maven/plugins/maven-repository-plugin/2.4/maven-repository-plugin-2.4.pom
[INFO] Downloaded: https://repo.maven.apache.org/maven2/org/apache/maven/plugins/maven-repository-plugin/2.4/maven-repository-plugin-2.4.pom
(10 KB at 942.1 KB/sec)
[INFO] Downloading: https://repo.maven.apache.org/maven2/org/apache/maven/plugins/maven-resources-plugin/3.0.1/maven-resources-plugin-3.0.1.pom
[INFO] Downloaded: https://repo.maven.apache.org/maven2/org/apache/maven/plugins/maven-resources-plugin/3.0.1/maven-resources-plugin-3.0.1.pom
(7 KB at 874.5 KB/sec)
[INFO] Downloading: https://repo.maven.apache.org/maven2/org/apache/maven/plugins/maven-shade-plugin/2.4.3/maven-shade-plugin-2.4.3.pom
[INFO] Downloaded: https://repo.maven.apache.org/maven2/org/apache/maven/plugins/maven-shade-plugin/2.4.3/maven-shade-plugin-2.4.3.pom
(9 KB at 1184.2 KB/sec)
[INFO] Downloading: https://repo.maven.apache.org/maven2/org/apache/maven/plugins/maven-source-plugin/3.0.1/maven-source-plugin-3.0.1.pom
[INFO] Downloaded: https://repo.maven.apache.org/maven2/org/apache/maven/plugins/maven-source-plugin/3.0.1/maven-source-plugin-3.0.1.pom
(6 KB at 694.1 KB/sec)
[INFO] Downloading: https://repo.maven.apache.org/maven2/org/apache/maven/plugins/maven-stage-plugin/1.0/maven-stage-plugin-1.0.pom
[INFO] Downloaded: https://repo.maven.apache.org/maven2/org/apache/maven/plugins/maven-stage-plugin/1.0/maven-stage-plugin-1.0.pom
(7 KB at 681.9 KB/sec)
[INFO] Downloading: https://repo.maven.apache.org/maven2/org/apache/maven/plugins/maven-verifier-plugin/1.1/maven-verifier-plugin-1.1.pom
[INFO] Downloaded: https://repo.maven.apache.org/maven2/org/apache/maven/plugins/maven-verifier-plugin/1.1/maven-verifier-plugin-1.1.pom
(5 KB at 610.5 KB/sec)
[INFO] Downloading: https://repo.maven.apache.org/maven2/org/apache/maven/plugins/maven-war-plugin/3.0.0/maven-war-plugin-3.0.0.pom
[INFO] Downloaded: https://repo.maven.apache.org/maven2/org/apache/maven/plugins/maven-war-plugin/3.0.0/maven-war-plugin-3.0.0.pom
(9 KB at 1101.7 KB/sec)
[INFO] Downloading: https://repo.maven.apache.org/maven2/org/apache/maven/reporting/maven-reporting-exec/1.3/maven-reporting-exec-1.3.pom
[INFO] Downloaded: https://repo.maven.apache.org/maven2/org/apache/maven/reporting/maven-reporting-exec/1.3/maven-reporting-exec-1.3.pom
(12 KB at 1230.0 KB/sec)
[INFO] Downloading: https://repo.maven.apache.org/maven2/org/apache/maven/shared/maven-shared-components/30/maven-shared-components-30.pom
[INFO] Downloaded: https://repo.maven.apache.org/maven2/org/apache/maven/shared/maven-shared-components/30/maven-shared-components-30.pom
(5 KB at 745.9 KB/sec)
[INFO] Downloading: https://repo.maven.apache.org/maven2/org/apache/apache/resources/apache-source-release-assembly-descriptor/1.0.6/apache-source-release-assembly-descriptor-1.0.6.pom
[INFO] Downloaded: https://repo.maven.apache.org/maven2/org/apache/apache/resources/apache-source-release-assembly-descriptor/1.0.6/apache-source-release-assembly-descriptor-1.0.6.pom
(8 KB at 783.5 KB/sec)
[INFO] Downloading: https://repo.maven.apache.org/maven2/org/apache/apache/resources/apache-resource-bundles/5/apache-resource-bundles-5.pom
[INFO] Downloaded: https://repo.maven.apache.org/maven2/org/apache/apache/resources/apache-resource-bundles/5/apache-resource-bundles-5.pom
(3 KB at 329.1 KB/sec)
[INFO] Downloading: https://repo.maven.apache.org/maven2/org/apache/apache-incubator-disclaimer-resource-bundle/1.1/apache-incubator-disclaimer-resource-bundle-1.1.pom
[WARNING] Checksum validation failed, expected da39a3ee5e6b4b0d3255bfef95601890afd80709 but
is 6e0b74ff3d2da9bfe1126608f7e937537e628a5f for https://repo.maven.apache.org/maven2/org/apache/apache-incubator-disclaimer-resource-bundle/1.1/apache-incubator-disclaimer-resource-bundle-1.1.pom
[WARNING] Could not validate integrity of download from https://repo.maven.apache.org/maven2/org/apache/apache-incubator-disclaimer-resource-bundle/1.1/apache-incubator-disclaimer-resource-bundle-1.1.pom:
Checksum validation failed, expected da39a3ee5e6b4b0d3255bfef95601890afd80709 but is 6e0b74ff3d2da9bfe1126608f7e937537e628a5f
[WARNING] Checksum validation failed, expected da39a3ee5e6b4b0d3255bfef95601890afd80709 but
is 6e0b74ff3d2da9bfe1126608f7e937537e628a5f for https://repo.maven.apache.org/maven2/org/apache/apache-incubator-disclaimer-resource-bundle/1.1/apache-incubator-disclaimer-resource-bundle-1.1.pom
[INFO] Downloaded: https://repo.maven.apache.org/maven2/org/apache/apache-incubator-disclaimer-resource-bundle/1.1/apache-incubator-disclaimer-resource-bundle-1.1.pom
(722 B at 50.4 KB/sec)
[INFO] Downloading: https://repo.maven.apache.org/maven2/org/apache/apache-resource-bundles/2/apache-resource-bundles-2.pom
[WARNING] Checksum validation failed, expected da39a3ee5e6b4b0d3255bfef95601890afd80709 but
is bfadc7db5b215805d531144732c80692de9780e1 for https://repo.maven.apache.org/maven2/org/apache/apache-resource-bundles/2/apache-resource-bundles-2.pom
[WARNING] Could not validate integrity of download from https://repo.maven.apache.org/maven2/org/apache/apache-resource-bundles/2/apache-resource-bundles-2.pom:
Checksum validation failed, expected da39a3ee5e6b4b0d3255bfef95601890afd80709 but is bfadc7db5b215805d531144732c80692de9780e1
[WARNING] Checksum validation failed, expected da39a3ee5e6b4b0d3255bfef95601890afd80709 but
is bfadc7db5b215805d531144732c80692de9780e1 for https://repo.maven.apache.org/maven2/org/apache/apache-resource-bundles/2/apache-resource-bundles-2.pom
[INFO] Downloaded: https://repo.maven.apache.org/maven2/org/apache/apache-resource-bundles/2/apache-resource-bundles-2.pom
(2 KB at 147.8 KB/sec)
[INFO] Downloading: https://repo.maven.apache.org/maven2/org/apache/apache-jar-resource-bundle/1.4/apache-jar-resource-bundle-1.4.pom
[INFO] Downloaded: https://repo.maven.apache.org/maven2/org/apache/apache-jar-resource-bundle/1.4/apache-jar-resource-bundle-1.4.pom
(2 KB at 136.2 KB/sec)
[INFO] Downloading: https://repo.maven.apache.org/maven2/org/apache/apache-license-header-resource-bundle/1.1/apache-license-header-resource-bundle-1.1.pom
[WARNING] Checksum validation failed, expected da39a3ee5e6b4b0d3255bfef95601890afd80709 but
is 923c05b225d7a5a8a614b5fca846b1776e18b98a for https://repo.maven.apache.org/maven2/org/apache/apache-license-header-resource-bundle/1.1/apache-license-header-resource-bundle-1.1.pom
[WARNING] Could not validate integrity of download from https://repo.maven.apache.org/maven2/org/apache/apache-license-header-resource-bundle/1.1/apache-license-header-resource-bundle-1.1.pom:
Checksum validation failed, expected da39a3ee5e6b4b0d3255bfef95601890afd80709 but is 923c05b225d7a5a8a614b5fca846b1776e18b98a
[WARNING] Checksum validation failed, expected da39a3ee5e6b4b0d3255bfef95601890afd80709 but
is 923c05b225d7a5a8a614b5fca846b1776e18b98a for https://repo.maven.apache.org/maven2/org/apache/apache-license-header-resource-bundle/1.1/apache-license-header-resource-bundle-1.1.pom
[INFO] Downloaded: https://repo.maven.apache.org/maven2/org/apache/apache-license-header-resource-bundle/1.1/apache-license-header-resource-bundle-1.1.pom
(694 B at 52.1 KB/sec)
[INFO] Downloading: https://repo.maven.apache.org/maven2/org/apache/maven/scm/maven-scm/1.9.5/maven-scm-1.9.5.pom
[INFO] Downloaded: https://repo.maven.apache.org/maven2/org/apache/maven/scm/maven-scm/1.9.5/maven-scm-1.9.5.pom
(25 KB at 2041.6 KB/sec)
[INFO] Downloading: https://repo.maven.apache.org/maven2/org/apache/maven/shared/file-management/3.0.0/file-management-3.0.0.pom
[INFO] Downloaded: https://repo.maven.apache.org/maven2/org/apache/maven/shared/file-management/3.0.0/file-management-3.0.0.pom
(5 KB at 572.3 KB/sec)
[INFO] Downloading: https://repo.maven.apache.org/maven2/org/apache/maven/shared/maven-common-artifact-filters/3.0.1/maven-common-artifact-filters-3.0.1.pom
[INFO] Downloaded: https://repo.maven.apache.org/maven2/org/apache/maven/shared/maven-common-artifact-filters/3.0.1/maven-common-artifact-filters-3.0.1.pom
(5 KB at 590.3 KB/sec)
[INFO] Downloading: https://repo.maven.apache.org/maven2/org/apache/maven/shared/maven-dependency-tree/3.0/maven-dependency-tree-3.0.pom
[INFO] Downloaded: https://repo.maven.apache.org/maven2/org/apache/maven/shared/maven-dependency-tree/3.0/maven-dependency-tree-3.0.pom
(8 KB at 899.5 KB/sec)
[INFO] Downloading: https://repo.maven.apache.org/maven2/org/apache/maven/shared/maven-filtering/3.1.1/maven-filtering-3.1.1.pom
[INFO] Downloaded: https://repo.maven.apache.org/maven2/org/apache/maven/shared/maven-filtering/3.1.1/maven-filtering-3.1.1.pom
(6 KB at 693.7 KB/sec)
[INFO] Downloading: https://repo.maven.apache.org/maven2/org/apache/maven/shared/maven-invoker/2.2/maven-invoker-2.2.pom
[INFO] Downloaded: https://repo.maven.apache.org/maven2/org/apache/maven/shared/maven-invoker/2.2/maven-invoker-2.2.pom
(6 KB at 635.1 KB/sec)
[INFO] Downloading: https://repo.maven.apache.org/maven2/org/apache/maven/shared/maven-jarsigner/1.4/maven-jarsigner-1.4.pom
[INFO] Downloaded: https://repo.maven.apache.org/maven2/org/apache/maven/shared/maven-jarsigner/1.4/maven-jarsigner-1.4.pom
(4 KB at 452.4 KB/sec)
[INFO] Downloading: https://repo.maven.apache.org/maven2/org/apache/maven/shared/maven-mapping/3.0.0/maven-mapping-3.0.0.pom
[INFO] Downloaded: https://repo.maven.apache.org/maven2/org/apache/maven/shared/maven-mapping/3.0.0/maven-mapping-3.0.0.pom
(5 KB at 505.0 KB/sec)
[INFO] Downloading: https://repo.maven.apache.org/maven2/org/apache/maven/shared/maven-repository-builder/1.0/maven-repository-builder-1.0.pom
[INFO] Downloaded: https://repo.maven.apache.org/maven2/org/apache/maven/shared/maven-repository-builder/1.0/maven-repository-builder-1.0.pom
(5 KB at 635.3 KB/sec)
[INFO] Downloading: https://repo.maven.apache.org/maven2/org/apache/maven/shared/maven-runtime/1.0-alpha-3/maven-runtime-1.0-alpha-3.pom
[INFO] Downloaded: https://repo.maven.apache.org/maven2/org/apache/maven/shared/maven-runtime/1.0-alpha-3/maven-runtime-1.0-alpha-3.pom
(6 KB at 432.5 KB/sec)
[INFO] Downloading: https://repo.maven.apache.org/maven2/org/apache/maven/shared/maven-script-interpreter/1.1/maven-script-interpreter-1.1.pom
[INFO] Downloaded: https://repo.maven.apache.org/maven2/org/apache/maven/shared/maven-script-interpreter/1.1/maven-script-interpreter-1.1.pom
(4 KB at 453.0 KB/sec)
[INFO] Downloading: https://repo.maven.apache.org/maven2/org/apache/maven/shared/maven-shared-utils/3.1.0/maven-shared-utils-3.1.0.pom
[INFO] Downloaded: https://repo.maven.apache.org/maven2/org/apache/maven/shared/maven-shared-utils/3.1.0/maven-shared-utils-3.1.0.pom
(5 KB at 607.8 KB/sec)
[INFO] Downloading: https://repo.maven.apache.org/maven2/org/apache/maven/shared/maven-shared-io/3.0.0/maven-shared-io-3.0.0.pom
[INFO] Downloaded: https://repo.maven.apache.org/maven2/org/apache/maven/shared/maven-shared-io/3.0.0/maven-shared-io-3.0.0.pom
(5 KB at 507.4 KB/sec)
[INFO] Downloading: https://repo.maven.apache.org/maven2/org/apache/maven/shared/maven-verifier/1.6/maven-verifier-1.6.pom
[INFO] Downloaded: https://repo.maven.apache.org/maven2/org/apache/maven/shared/maven-verifier/1.6/maven-verifier-1.6.pom
(4 KB at 472.1 KB/sec)
[INFO] Downloading: https://repo.maven.apache.org/maven2/org/apache/maven/maven-archiver/3.1.1/maven-archiver-3.1.1.pom
[INFO] Downloaded: https://repo.maven.apache.org/maven2/org/apache/maven/maven-archiver/3.1.1/maven-archiver-3.1.1.pom
(5 KB at 707.5 KB/sec)
[INFO] Downloading: https://repo.maven.apache.org/maven2/org/apache/maven/skins/maven-default-skin/1.2/maven-default-skin-1.2.pom
[INFO] Downloaded: https://repo.maven.apache.org/maven2/org/apache/maven/skins/maven-default-skin/1.2/maven-default-skin-1.2.pom
(5 KB at 612.7 KB/sec)
[INFO] Downloading: https://repo.maven.apache.org/maven2/org/apache/maven/skins/maven-skins/10/maven-skins-10.pom
[INFO] Downloaded: https://repo.maven.apache.org/maven2/org/apache/maven/skins/maven-skins/10/maven-skins-10.pom
(4 KB at 387.0 KB/sec)
[INFO] Downloading: https://repo.maven.apache.org/maven2/org/apache/maven/skins/maven-fluido-skin/1.5/maven-fluido-skin-1.5.pom
[INFO] Downloaded: https://repo.maven.apache.org/maven2/org/apache/maven/skins/maven-fluido-skin/1.5/maven-fluido-skin-1.5.pom
(28 KB at 2533.7 KB/sec)
[INFO] Downloading: https://repo.maven.apache.org/maven2/org/apache/maven/wagon/wagon/2.10/wagon-2.10.pom
[INFO] Downloaded: https://repo.maven.apache.org/maven2/org/apache/maven/wagon/wagon/2.10/wagon-2.10.pom
(21 KB at 2226.1 KB/sec)
[INFO] Generating "Dist Tool> Check Source Release" report --- dist-tool-plugin:1.0-SNAPSHOT:check-source-release
[WARNING] Missing file for doxia-linkcheck in https://repo.maven.apache.org/maven2/org/apache/maven/doxia/doxia-linkcheck/1.2/
[WARNING]  > doxia-linkcheck-1.2-source-release.zip <
[WARNING]  > doxia-linkcheck-1.2-source-release.zip.asc <
[WARNING]  > doxia-linkcheck-1.2-source-release.zip.md5 <
[WARNING] Missing file for doxia-linkcheck in http://www.apache.org/dist/maven/doxia
[WARNING]  > doxia-linkcheck-1.2-source-release.zip <
[WARNING]  > doxia-linkcheck-1.2-source-release.zip.asc <
[WARNING]  > doxia-linkcheck-1.2-source-release.zip.md5 <
[WARNING] Missing file for apache-incubator-disclaimer-resource-bundle in https://repo.maven.apache.org/maven2/org/apache/apache-incubator-disclaimer-resource-bundle/1.1/
[WARNING]  > apache-incubator-disclaimer-resource-bundle-1.1-source-release.zip <
[WARNING]  > apache-incubator-disclaimer-resource-bundle-1.1-source-release.zip.asc <
[WARNING]  > apache-incubator-disclaimer-resource-bundle-1.1-source-release.zip.md5 <
[WARNING] Missing file for apache-incubator-disclaimer-resource-bundle in http://www.apache.org/dist/maven/resources
[WARNING]  > apache-incubator-disclaimer-resource-bundle-1.1-source-release.zip <
[WARNING]  > apache-incubator-disclaimer-resource-bundle-1.1-source-release.zip.asc <
[WARNING]  > apache-incubator-disclaimer-resource-bundle-1.1-source-release.zip.md5 <
[WARNING] Missing file for apache-jar-resource-bundle in https://repo.maven.apache.org/maven2/org/apache/apache-jar-resource-bundle/1.4/
[WARNING]  > apache-jar-resource-bundle-1.4-source-release.zip <
[WARNING]  > apache-jar-resource-bundle-1.4-source-release.zip.asc <
[WARNING]  > apache-jar-resource-bundle-1.4-source-release.zip.md5 <
[WARNING] Missing file for apache-jar-resource-bundle in http://www.apache.org/dist/maven/resources
[WARNING]  > apache-jar-resource-bundle-1.4-source-release.zip <
[WARNING]  > apache-jar-resource-bundle-1.4-source-release.zip.asc <
[WARNING]  > apache-jar-resource-bundle-1.4-source-release.zip.md5 <
[WARNING] Missing file for apache-license-header-resource-bundle in https://repo.maven.apache.org/maven2/org/apache/apache-license-header-resource-bundle/1.1/
[WARNING]  > apache-license-header-resource-bundle-1.1-source-release.zip <
[WARNING]  > apache-license-header-resource-bundle-1.1-source-release.zip.asc <
[WARNING]  > apache-license-header-resource-bundle-1.1-source-release.zip.md5 <
[WARNING] Missing file for apache-license-header-resource-bundle in http://www.apache.org/dist/maven/resources
[WARNING]  > apache-license-header-resource-bundle-1.1-source-release.zip <
[WARNING]  > apache-license-header-resource-bundle-1.1-source-release.zip.asc <
[WARNING]  > apache-license-header-resource-bundle-1.1-source-release.zip.md5 <
[INFO] Generating "Dist Tool> Check Index Pages" report --- dist-tool-plugin:1.0-SNAPSHOT:check-index-page
[ERROR] maven-common-artifact-filters: found 3.0.0 instead of 3.0.1 in http://maven.apache.org/shared/
[INFO] Generating "Dist Tool> Check Errors" report --- dist-tool-plugin:1.0-SNAPSHOT:check-errors
[INFO] Generating "Dist Tool> List Plugins Prerequisites" report --- dist-tool-plugin:1.0-SNAPSHOT:list-plugins-prerequisites
[INFO] Generating "Dist Tool> Failure Hack" report --- dist-tool-plugin:1.0-SNAPSHOT:failure-report
[ERROR] check-index-page.log error log not empty:
maven-common-artifact-filters: found 3.0.0 instead of 3.0.1 in http://maven.apache.org/shared/

[JENKINS] Archiving site from <https://builds.apache.org/job/dist-tool-plugin/ws/target/site>
to /x1/jenkins/jenkins-home/jobs/dist-tool-plugin/site
[INFO] ------------------------------------------------------------------------
[INFO] BUILD FAILURE
[INFO] ------------------------------------------------------------------------
[INFO] Total time: 05:32 min
[INFO] Finished at: 2016-11-01T10:02:11+00:00
[INFO] Final Memory: 91M/847M
[INFO] ------------------------------------------------------------------------
[WARNING] The requested profile "apache.snapshots" could not be activated because it does
not exist.
Waiting for Jenkins to finish collecting data
[ERROR] Failed to execute goal org.apache.maven.plugins:maven-site-plugin:3.5.1:site (default-site)
on project dist-tool-plugin: Error generating dist-tool-plugin:1.0-SNAPSHOT:failure-report:
Dist Tool> Checks found inconsistencies in some released artifacts, see https://builds.apache.org/job/dist-tool-plugin/site/dist-tool-check-errors.html
for more information -> [Help 1]
org.apache.maven.lifecycle.LifecycleExecutionException: Failed to execute goal org.apache.maven.plugins:maven-site-plugin:3.5.1:site
(default-site) on project dist-tool-plugin: Error generating dist-tool-plugin:1.0-SNAPSHOT:failure-report:
Dist Tool> Checks found inconsistencies in some released artifacts, see https://builds.apache.org/job/dist-tool-plugin/site/dist-tool-check-errors.html
for more information
	at org.apache.maven.lifecycle.internal.MojoExecutor.execute(MojoExecutor.java:212)
	at org.apache.maven.lifecycle.internal.MojoExecutor.execute(MojoExecutor.java:153)
	at org.apache.maven.lifecycle.internal.MojoExecutor.execute(MojoExecutor.java:145)
	at org.apache.maven.lifecycle.internal.LifecycleModuleBuilder.buildProject(LifecycleModuleBuilder.java:116)
	at org.apache.maven.lifecycle.internal.LifecycleModuleBuilder.buildProject(LifecycleModuleBuilder.java:80)
	at org.apache.maven.lifecycle.internal.builder.singlethreaded.SingleThreadedBuilder.build(SingleThreadedBuilder.java:51)
	at org.apache.maven.lifecycle.internal.LifecycleStarter.execute(LifecycleStarter.java:128)
	at org.apache.maven.DefaultMaven.doExecute(DefaultMaven.java:307)
	at org.apache.maven.DefaultMaven.doExecute(DefaultMaven.java:193)
	at org.apache.maven.DefaultMaven.execute(DefaultMaven.java:106)
	at org.jvnet.hudson.maven3.launcher.Maven32Launcher.main(Maven32Launcher.java:132)
	at sun.reflect.NativeMethodAccessorImpl.invoke0(Native Method)
	at sun.reflect.NativeMethodAccessorImpl.invoke(NativeMethodAccessorImpl.java:57)
	at sun.reflect.DelegatingMethodAccessorImpl.invoke(DelegatingMethodAccessorImpl.java:43)
	at java.lang.reflect.Method.invoke(Method.java:606)
	at org.codehaus.plexus.classworlds.launcher.Launcher.launchStandard(Launcher.java:330)
	at org.codehaus.plexus.classworlds.launcher.Launcher.launch(Launcher.java:238)
	at jenkins.maven3.agent.Maven32Main.launch(Maven32Main.java:186)
	at sun.reflect.NativeMethodAccessorImpl.invoke0(Native Method)
	at sun.reflect.NativeMethodAccessorImpl.invoke(NativeMethodAccessorImpl.java:57)
	at sun.reflect.DelegatingMethodAccessorImpl.invoke(DelegatingMethodAccessorImpl.java:43)
	at java.lang.reflect.Method.invoke(Method.java:606)
	at hudson.maven.Maven3Builder.call(Maven3Builder.java:136)
	at hudson.maven.Maven3Builder.call(Maven3Builder.java:71)
	at hudson.remoting.UserRequest.perform(UserRequest.java:153)
	at hudson.remoting.UserRequest.perform(UserRequest.java:50)
	at hudson.remoting.Request$2.run(Request.java:332)
	at hudson.remoting.InterceptingExecutorService$1.call(InterceptingExecutorService.java:68)
	at java.util.concurrent.FutureTask.run(FutureTask.java:262)
	at java.util.concurrent.ThreadPoolExecutor.runWorker(ThreadPoolExecutor.java:1145)
	at java.util.concurrent.ThreadPoolExecutor$Worker.run(ThreadPoolExecutor.java:615)
	at java.lang.Thread.run(Thread.java:745)
Caused by: org.apache.maven.plugin.MojoExecutionException: Error generating dist-tool-plugin:1.0-SNAPSHOT:failure-report:
Dist Tool> Checks found inconsistencies in some released artifacts, see https://builds.apache.org/job/dist-tool-plugin/site/dist-tool-check-errors.html
for more information
	at org.apache.maven.plugins.site.render.SiteMojo.execute(SiteMojo.java:140)
	at org.apache.maven.plugin.DefaultBuildPluginManager.executeMojo(DefaultBuildPluginManager.java:134)
	at org.apache.maven.lifecycle.internal.MojoExecutor.execute(MojoExecutor.java:207)
	... 31 more
Caused by: org.apache.maven.doxia.siterenderer.RendererException: Error generating dist-tool-plugin:1.0-SNAPSHOT:failure-report:
Dist Tool> Checks found inconsistencies in some released artifacts, see https://builds.apache.org/job/dist-tool-plugin/site/dist-tool-check-errors.html
for more information
	at org.apache.maven.plugins.site.render.ReportDocumentRenderer.renderDocument(ReportDocumentRenderer.java:242)
	at org.apache.maven.doxia.siterenderer.DefaultSiteRenderer.render(DefaultSiteRenderer.java:329)
	at org.apache.maven.plugins.site.render.SiteMojo.renderLocale(SiteMojo.java:181)
	at org.apache.maven.plugins.site.render.SiteMojo.execute(SiteMojo.java:135)
	... 33 more
Caused by: org.apache.maven.reporting.MavenReportException: Dist Tool> Checks found inconsistencies
in some released artifacts, see https://builds.apache.org/job/dist-tool-plugin/site/dist-tool-check-errors.html
for more information
	at org.apache.maven.dist.tools.DistCheckErrorsMojo.executeReport(DistCheckErrorsMojo.java:112)
	at org.apache.maven.reporting.AbstractMavenReport.generate(AbstractMavenReport.java:255)
	at org.apache.maven.plugins.site.render.ReportDocumentRenderer.renderDocument(ReportDocumentRenderer.java:227)
	... 36 more
[ERROR] 
[ERROR] Re-run Maven using the -X switch to enable full debug logging.
[ERROR] 
[ERROR] For more information about the errors and possible solutions, please read the following
articles:
[ERROR] [Help 1] http://cwiki.apache.org/confluence/display/MAVEN/MojoExecutionException
[JENKINS] Archiving <https://builds.apache.org/job/dist-tool-plugin/ws/pom.xml> to org.apache.maven.dist.tools/dist-tool-plugin/1.0-SNAPSHOT/dist-tool-plugin-1.0-SNAPSHOT.pom
[JENKINS] Archiving <https://builds.apache.org/job/dist-tool-plugin/ws/target/dist-tool-plugin-1.0-SNAPSHOT.jar>
to org.apache.maven.dist.tools/dist-tool-plugin/1.0-SNAPSHOT/dist-tool-plugin-1.0-SNAPSHOT.jar
channel stopped

Mime
View raw message