maven-notifications mailing list archives

Site index · List index
Message view « Date » · « Thread »
Top « Date » · « Thread »
From Apache Jenkins Server <jenk...@builds.apache.org>
Subject Build failed in Jenkins: core-integration-testing-maven-3-embedded #7545
Date Sat, 11 Mar 2017 17:41:03 GMT
See <https://builds.apache.org/job/core-integration-testing-maven-3-embedded/7545/display/redirect?page=changes>

Changes:

[hboutemy] fixed typos

------------------------------------------
[...truncated 1.35 MB...]
[INFO] 
[INFO] --- maven-surefire-plugin:2.12.4:test (default-test) @ servlet ---
[INFO] No tests to run.
[INFO] 
[INFO] ------------------------------------------------------------------------
[INFO] Building enterprise java beans 1.0
[INFO] ------------------------------------------------------------------------
[INFO] 
[INFO] --- maven-resources-plugin:2.7:resources (default-resources) @ ejbs ---
[WARNING] Using platform encoding (UTF-8 actually) to copy filtered resources, i.e. build
is platform dependent!
[INFO] Copying 1 resource
[INFO] 
[INFO] --- maven-compiler-plugin:2.0.2:compile (default-compile) @ ejbs ---
[INFO] No sources to compile
[INFO] 
[INFO] --- maven-resources-plugin:2.7:testResources (default-testResources) @ ejbs ---
[WARNING] Using platform encoding (UTF-8 actually) to copy filtered resources, i.e. build
is platform dependent!
[INFO] skip non existing resourceDirectory <https://builds.apache.org/job/core-integration-testing-maven-3-embedded/ws/core-integration-testing-trunk/core-it-suite/target/test-classes/mng-5898/ejbs/src/test/resources>
[INFO] 
[INFO] --- maven-compiler-plugin:2.0.2:testCompile (default-testCompile) @ ejbs ---
[INFO] No sources to compile
[INFO] 
[INFO] --- maven-surefire-plugin:2.12.4:test (default-test) @ ejbs ---
[INFO] No tests to run.
[INFO] 
[INFO] ------------------------------------------------------------------------
[INFO] Building ear assembly 1.0
[INFO] ------------------------------------------------------------------------
[INFO] 
[INFO] --- maven-ear-plugin:2.8:generate-application-xml (default-generate-application-xml)
@ ear ---
[INFO] Downloading: file:target/null/org/codehaus/plexus/plexus-archiver/2.1.2/plexus-archiver-2.1.2.pom
[WARNING] The POM for org.codehaus.plexus:plexus-archiver:jar:2.1.2 is missing, no dependency
information available
[INFO] Downloading: file:target/null/org/apache/maven/shared/maven-filtering/1.0-beta-2/maven-filtering-1.0-beta-2.pom
[WARNING] The POM for org.apache.maven.shared:maven-filtering:jar:1.0-beta-2 is missing, no
dependency information available
[INFO] Downloading: file:target/null/org/apache/maven/maven-plugin-parameter-documenter/2.0.6/maven-plugin-parameter-documenter-2.0.6.jar
[INFO] Downloading: file:target/null/org/apache/maven/maven-error-diagnostics/2.0.6/maven-error-diagnostics-2.0.6.jar
[INFO] Downloading: file:target/null/org/apache/maven/maven-plugin-descriptor/2.0.6/maven-plugin-descriptor-2.0.6.jar
[INFO] ------------------------------------------------------------------------
[INFO] Reactor Summary:
[INFO] 
[INFO] project ............................................ SUCCESS [  0.000 s]
[INFO] sub projects ....................................... SUCCESS [  0.000 s]
[INFO] logging ............................................ SUCCESS [  0.465 s]
[INFO] core project classes ............................... SUCCESS [  0.037 s]
[INFO] servlets ........................................... SUCCESS [  0.000 s]
[INFO] servlet ............................................ SUCCESS [  0.021 s]
[INFO] enterprise java beans .............................. SUCCESS [  0.032 s]
[INFO] ear assembly ....................................... FAILURE [  0.060 s]
[INFO] ------------------------------------------------------------------------
[INFO] BUILD FAILURE
[INFO] ------------------------------------------------------------------------
[INFO] Total time: 0.647 s
[INFO] Finished at: 2017-03-11T17:33:22Z
[INFO] Final Memory: 14M/273M
[INFO] ------------------------------------------------------------------------
[ERROR] Failed to execute goal org.apache.maven.plugins:maven-ear-plugin:2.8:generate-application-xml
(default-generate-application-xml) on project ear: Execution default-generate-application-xml
of goal org.apache.maven.plugins:maven-ear-plugin:2.8:generate-application-xml failed: Plugin
org.apache.maven.plugins:maven-ear-plugin:2.8 or one of its dependencies could not be resolved:
The following artifacts could not be resolved: org.apache.maven:maven-plugin-parameter-documenter:jar:2.0.6,
org.apache.maven:maven-error-diagnostics:jar:2.0.6, org.apache.maven:maven-plugin-descriptor:jar:2.0.6:
Could not find artifact org.apache.maven:maven-plugin-parameter-documenter:jar:2.0.6 in central
(file:target/null) -> [Help 1]
org.apache.maven.lifecycle.LifecycleExecutionException: Failed to execute goal org.apache.maven.plugins:maven-ear-plugin:2.8:generate-application-xml
(default-generate-application-xml) on project ear: Execution default-generate-application-xml
of goal org.apache.maven.plugins:maven-ear-plugin:2.8:generate-application-xml failed: Plugin
org.apache.maven.plugins:maven-ear-plugin:2.8 or one of its dependencies could not be resolved:
The following artifacts could not be resolved: org.apache.maven:maven-plugin-parameter-documenter:jar:2.0.6,
org.apache.maven:maven-error-diagnostics:jar:2.0.6, org.apache.maven:maven-plugin-descriptor:jar:2.0.6:
Could not find artifact org.apache.maven:maven-plugin-parameter-documenter:jar:2.0.6 in central
(file:target/null)
	at org.apache.maven.lifecycle.internal.MojoExecutor.execute(MojoExecutor.java:213)
	at org.apache.maven.lifecycle.internal.MojoExecutor.execute(MojoExecutor.java:154)
	at org.apache.maven.lifecycle.internal.MojoExecutor.execute(MojoExecutor.java:146)
	at org.apache.maven.lifecycle.internal.LifecycleModuleBuilder.buildProject(LifecycleModuleBuilder.java:117)
	at org.apache.maven.lifecycle.internal.LifecycleModuleBuilder.buildProject(LifecycleModuleBuilder.java:81)
	at org.apache.maven.lifecycle.internal.builder.singlethreaded.SingleThreadedBuilder.build(SingleThreadedBuilder.java:51)
	at org.apache.maven.lifecycle.internal.LifecycleStarter.execute(LifecycleStarter.java:128)
	at org.apache.maven.DefaultMaven.doExecute(DefaultMaven.java:309)
	at org.apache.maven.DefaultMaven.doExecute(DefaultMaven.java:194)
	at org.apache.maven.DefaultMaven.execute(DefaultMaven.java:107)
	at org.apache.maven.cli.MavenCli.execute(MavenCli.java:907)
	at org.apache.maven.cli.MavenCli.doMain(MavenCli.java:298)
	at org.apache.maven.cli.MavenCli.doMain(MavenCli.java:253)
	at sun.reflect.NativeMethodAccessorImpl.invoke0(Native Method)
	at sun.reflect.NativeMethodAccessorImpl.invoke(NativeMethodAccessorImpl.java:57)
	at sun.reflect.DelegatingMethodAccessorImpl.invoke(DelegatingMethodAccessorImpl.java:43)
	at java.lang.reflect.Method.invoke(Method.java:606)
	at org.apache.maven.it.Embedded3xLauncher.run(Embedded3xLauncher.java:247)
	at org.apache.maven.it.Verifier.executeGoals(Verifier.java:1354)
	at org.apache.maven.it.Verifier.executeGoal(Verifier.java:1254)
	at org.apache.maven.it.Verifier.executeGoal(Verifier.java:1248)
	at org.apache.maven.it.MavenITmng5898BuildMultimoduleWithEARFailsToResolveWARTest.testit(MavenITmng5898BuildMultimoduleWithEARFailsToResolveWARTest.java:51)
	at sun.reflect.NativeMethodAccessorImpl.invoke0(Native Method)
	at sun.reflect.NativeMethodAccessorImpl.invoke(NativeMethodAccessorImpl.java:57)
	at sun.reflect.DelegatingMethodAccessorImpl.invoke(DelegatingMethodAccessorImpl.java:43)
	at java.lang.reflect.Method.invoke(Method.java:606)
	at junit.framework.TestCase.runTest(TestCase.java:168)
	at org.apache.maven.it.AbstractMavenIntegrationTestCase.runTest(AbstractMavenIntegrationTestCase.java:222)
	at junit.framework.TestCase.runBare(TestCase.java:134)
	at junit.framework.TestResult$1.protect(TestResult.java:110)
	at junit.framework.TestResult.runProtected(TestResult.java:128)
	at junit.framework.TestResult.run(TestResult.java:113)
	at junit.framework.TestCase.run(TestCase.java:124)
	at junit.framework.TestSuite.runTest(TestSuite.java:243)
	at junit.framework.TestSuite.run(TestSuite.java:238)
	at junit.framework.TestSuite.runTest(TestSuite.java:243)
	at junit.framework.TestSuite.run(TestSuite.java:238)
	at org.junit.internal.runners.JUnit38ClassRunner.run(JUnit38ClassRunner.java:83)
	at org.apache.maven.surefire.junit4.JUnit4Provider.execute(JUnit4Provider.java:264)
	at org.apache.maven.surefire.junit4.JUnit4Provider.executeTestSet(JUnit4Provider.java:153)
	at org.apache.maven.surefire.junit4.JUnit4Provider.invoke(JUnit4Provider.java:124)
	at org.apache.maven.surefire.booter.ForkedBooter.invokeProviderInSameClassLoader(ForkedBooter.java:200)
	at org.apache.maven.surefire.booter.ForkedBooter.runSuitesInProcess(ForkedBooter.java:153)
	at org.apache.maven.surefire.booter.ForkedBooter.main(ForkedBooter.java:103)
Caused by: org.apache.maven.plugin.PluginExecutionException: Execution default-generate-application-xml
of goal org.apache.maven.plugins:maven-ear-plugin:2.8:generate-application-xml failed: Plugin
org.apache.maven.plugins:maven-ear-plugin:2.8 or one of its dependencies could not be resolved:
The following artifacts could not be resolved: org.apache.maven:maven-plugin-parameter-documenter:jar:2.0.6,
org.apache.maven:maven-error-diagnostics:jar:2.0.6, org.apache.maven:maven-plugin-descriptor:jar:2.0.6:
Could not find artifact org.apache.maven:maven-plugin-parameter-documenter:jar:2.0.6 in central
(file:target/null)
	at org.apache.maven.plugin.DefaultBuildPluginManager.executeMojo(DefaultBuildPluginManager.java:106)
	at org.apache.maven.lifecycle.internal.MojoExecutor.execute(MojoExecutor.java:208)
	... 43 more
Caused by: org.apache.maven.plugin.PluginResolutionException: Plugin org.apache.maven.plugins:maven-ear-plugin:2.8
or one of its dependencies could not be resolved: The following artifacts could not be resolved:
org.apache.maven:maven-plugin-parameter-documenter:jar:2.0.6, org.apache.maven:maven-error-diagnostics:jar:2.0.6,
org.apache.maven:maven-plugin-descriptor:jar:2.0.6: Could not find artifact org.apache.maven:maven-plugin-parameter-documenter:jar:2.0.6
in central (file:target/null)
	at org.apache.maven.plugin.internal.DefaultPluginDependenciesResolver.resolveInternal(DefaultPluginDependenciesResolver.java:218)
	at org.apache.maven.plugin.internal.DefaultPluginDependenciesResolver.resolve(DefaultPluginDependenciesResolver.java:149)
	at org.apache.maven.plugin.internal.DefaultMavenPluginManager.createPluginRealm(DefaultMavenPluginManager.java:402)
	at org.apache.maven.plugin.internal.DefaultMavenPluginManager.setupPluginRealm(DefaultMavenPluginManager.java:374)
	at org.apache.maven.plugin.DefaultBuildPluginManager.getPluginRealm(DefaultBuildPluginManager.java:231)
	at org.apache.maven.plugin.DefaultBuildPluginManager.executeMojo(DefaultBuildPluginManager.java:102)
	... 44 more
Caused by: org.eclipse.aether.resolution.ArtifactResolutionException: The following artifacts
could not be resolved: org.apache.maven:maven-plugin-parameter-documenter:jar:2.0.6, org.apache.maven:maven-error-diagnostics:jar:2.0.6,
org.apache.maven:maven-plugin-descriptor:jar:2.0.6: Could not find artifact org.apache.maven:maven-plugin-parameter-documenter:jar:2.0.6
in central (file:target/null)
	at org.eclipse.aether.internal.impl.DefaultArtifactResolver.resolve(DefaultArtifactResolver.java:453)
	at org.eclipse.aether.internal.impl.DefaultArtifactResolver.resolveArtifacts(DefaultArtifactResolver.java:255)
	at org.eclipse.aether.internal.impl.DefaultRepositorySystem.resolveDependencies(DefaultRepositorySystem.java:376)
	at org.apache.maven.plugin.internal.DefaultPluginDependenciesResolver.resolveInternal(DefaultPluginDependenciesResolver.java:210)
	... 49 more
Caused by: org.eclipse.aether.transfer.ArtifactNotFoundException: Could not find artifact
org.apache.maven:maven-plugin-parameter-documenter:jar:2.0.6 in central (file:target/null)
	at org.eclipse.aether.connector.basic.ArtifactTransportListener.transferFailed(ArtifactTransportListener.java:48)
	at org.eclipse.aether.connector.basic.BasicRepositoryConnector$TaskRunner.run(BasicRepositoryConnector.java:364)
	at org.eclipse.aether.util.concurrency.RunnableErrorForwarder$1.run(RunnableErrorForwarder.java:76)
	at java.util.concurrent.ThreadPoolExecutor.runWorker(ThreadPoolExecutor.java:1145)
	at java.util.concurrent.ThreadPoolExecutor$Worker.run(ThreadPoolExecutor.java:615)
	at java.lang.Thread.run(Thread.java:745)
[ERROR] 
[ERROR] Re-run Maven using the -X switch to enable full debug logging.
[ERROR] 
[ERROR] For more information about the errors and possible solutions, please read the following
articles:
[ERROR] [Help 1] http://cwiki.apache.org/confluence/display/MAVEN/PluginResolutionException
[ERROR] 
[ERROR] After correcting the problems, you can resume the build with the command
[ERROR]   mvn <goals> -rf :ear

	at org.apache.maven.it.Verifier.executeGoals(Verifier.java:1369)
	at org.apache.maven.it.Verifier.executeGoal(Verifier.java:1254)
	at org.apache.maven.it.Verifier.executeGoal(Verifier.java:1248)
	at org.apache.maven.it.MavenITmng5898BuildMultimoduleWithEARFailsToResolveWARTest.testit(MavenITmng5898BuildMultimoduleWithEARFailsToResolveWARTest.java:51)


Results :

Tests in error: 
  MavenITmng5898BuildMultimoduleWithEARFailsToResolveWARTest>AbstractMavenIntegrationTestCase.runTest:222->testit:51
ยป Verification

Tests run: 784, Failures: 0, Errors: 1, Skipped: 0

[INFO] ------------------------------------------------------------------------
[INFO] Reactor Summary:
[INFO] 
[INFO] Maven Core ITs .................................... SUCCESS [17.788s]
[INFO] Maven IT Support .................................. SUCCESS [0.785s]
[INFO] Maven IT :: Plugins ............................... SUCCESS [0.484s]
[INFO] Maven IT Plugin :: Active Collection .............. SUCCESS [3.972s]
[INFO] Maven IT Plugin :: Ant-Based ...................... SUCCESS [1.917s]
[INFO] Maven IT Plugin :: Artifact ....................... SUCCESS [1.527s]
[INFO] Maven IT Plugin :: Class Loader :: Dependency A ... SUCCESS [0.396s]
[INFO] Maven IT Plugin :: Class Loader :: Dependency B ... SUCCESS [0.433s]
[INFO] Maven IT Plugin :: Class Loader :: Dependency C ... SUCCESS [0.384s]
[INFO] Maven IT Plugin :: Class Loader ................... SUCCESS [1.273s]
[INFO] Maven IT Plugin :: Class Loader :: Aggregator ..... SUCCESS [0.326s]
[INFO] Maven IT Plugin :: Configuration .................. SUCCESS [0.879s]
[INFO] Maven IT Plugin :: Context Passing ................ SUCCESS [0.405s]
[INFO] Maven ITs :: Core Plugin Stubs .................... SUCCESS [0.297s]
[INFO] Maven IT Clean Plugin Stub ........................ SUCCESS [0.544s]
[INFO] Maven IT Compiler Plugin Stub ..................... SUCCESS [0.580s]
[INFO] Maven IT Deploy Plugin Stub ....................... SUCCESS [0.778s]
[INFO] Maven IT EAR Plugin Stub .......................... SUCCESS [0.530s]
[INFO] Maven IT EJB Plugin Stub .......................... SUCCESS [0.510s]
[INFO] Maven IT Install Plugin Stub ...................... SUCCESS [0.534s]
[INFO] Maven IT JAR Plugin Stub .......................... SUCCESS [0.540s]
[INFO] Maven IT Javadoc Plugin Stub ...................... SUCCESS [0.497s]
[INFO] Maven IT Plugin Plugin Stub ....................... SUCCESS [0.555s]
[INFO] Maven IT RAR Plugin Stub .......................... SUCCESS [0.497s]
[INFO] Maven IT Resources Plugin Stub .................... SUCCESS [0.540s]
[INFO] Maven IT Site Plugin Stub ......................... SUCCESS [0.556s]
[INFO] Maven IT Source Plugin Stub ....................... SUCCESS [0.440s]
[INFO] Maven IT Surefire Plugin Stub ..................... SUCCESS [0.488s]
[INFO] Maven IT WAR Plugin Stub .......................... SUCCESS [0.424s]
[INFO] Maven IT Plugin :: Dependency Collection .......... SUCCESS [0.578s]
[INFO] Maven IT Plugin :: Dependency Resolution .......... SUCCESS [2.575s]
[INFO] Maven IT Plugin :: Expression ..................... SUCCESS [1.024s]
[INFO] Maven IT Plugin :: Error Mojos .................... SUCCESS [1.015s]
[INFO] Maven IT Component ................................ SUCCESS [0.569s]
[INFO] Maven IT Plugin :: Extension Consumer ............. SUCCESS [0.384s]
[INFO] Maven IT Plugin :: Extension Provider ............. SUCCESS [0.359s]
[INFO] Maven IT Plugin :: Fork ........................... SUCCESS [0.512s]
[INFO] Maven IT Plugin :: Invalid Descriptor ............. SUCCESS [0.361s]
[INFO] Maven IT Plugin :: Log File ....................... SUCCESS [0.356s]
[INFO] Maven IT Helper Library ........................... SUCCESS [1.376s]
[INFO] Maven IT Plugin :: Model Interpolation ............ SUCCESS [0.604s]
[INFO] Maven IT Plugin :: No Default Component ........... SUCCESS [0.363s]
[INFO] Maven IT Plugin :: No Project ..................... SUCCESS [0.353s]
[INFO] Maven IT Plugin :: Online ......................... SUCCESS [0.398s]
[INFO] Maven IT Plugin :: Optional Mojos ................. SUCCESS [0.430s]
[INFO] Maven IT Plugin :: Packaging ...................... SUCCESS [0.345s]
[INFO] Maven IT Plugin :: Parameter Implementation ....... SUCCESS [0.414s]
[INFO] Maven IT Plugin :: Plugin Dependency .............. SUCCESS [0.389s]
[INFO] Maven IT Plugin :: Project ........................ SUCCESS [0.596s]
[INFO] Maven IT Plugin :: Project Interpolation .......... SUCCESS [0.555s]
[INFO] Maven IT Plugin :: Setter ......................... SUCCESS [0.405s]
[INFO] Maven IT Plugin :: Singleton Component ............ SUCCESS [0.357s]
[INFO] Maven IT Plugin :: Site ........................... SUCCESS [1.441s]
[INFO] Maven IT Plugin :: Toolchain ...................... SUCCESS [1.953s]
[INFO] Maven IT Plugin :: Touch .......................... SUCCESS [0.627s]
[INFO] Maven IT Plugin :: Uses Properties Plugin ......... SUCCESS [0.373s]
[INFO] Maven IT Plugin :: Uses Wagon Plugin .............. SUCCESS [0.848s]
[INFO] Maven IT Plugin :: This plugin should contain the mojos needed by all tests.  SUCCESS
[0.330s]
[INFO] Maven IT Plugin :: Plexus Utils 1.1 ............... SUCCESS [0.391s]
[INFO] Maven IT Plugin :: Plexus Utils New ............... SUCCESS [0.469s]
[INFO] Maven IT Plugin :: Plexus Component API ........... SUCCESS [0.631s]
[INFO] Maven IT Plugin :: Log4J Client ................... SUCCESS [0.476s]
[INFO] Maven IT Plugin :: Extension 1 .................... SUCCESS [0.295s]
[INFO] Maven IT Plugin :: Extension 2 .................... SUCCESS [0.301s]
[INFO] Maven IT Plugin :: Plexus Lifecycle ............... SUCCESS [0.749s]
[INFO] Maven IT Plugin :: Settings ....................... SUCCESS [0.428s]
[INFO] Maven IT Plugin :: mng-5805 extension ............. SUCCESS [0.316s]
[INFO] Maven IT Plugin :: mng-5805 extension mk2 ......... SUCCESS [0.306s]
[INFO] Maven IT Plugin :: mng-5805 plugin ................ SUCCESS [0.408s]
[INFO] Maven IT Plugin :: mng-5805 plugin-dep ............ SUCCESS [0.305s]
[INFO] Maven IT Plugin :: mng-5958 extension ............. SUCCESS [2.038s]
[INFO] Maven IT Toolchain ................................ SUCCESS [0.599s]
[INFO] Maven IT Wagon .................................... SUCCESS [0.616s]
[INFO] Maven IT Support Artifacts ........................ SUCCESS [0.916s]
[INFO] Maven IT Extension ................................ SUCCESS [0.307s]
[INFO] Maven ITs ......................................... FAILURE [8:06.010s]
[INFO] ------------------------------------------------------------------------
[INFO] BUILD FAILURE
[INFO] ------------------------------------------------------------------------
[INFO] Total time: 9:16.795s
[INFO] Finished at: Sat Mar 11 17:41:02 UTC 2017
[INFO] Final Memory: 72M/739M
[INFO] ------------------------------------------------------------------------
[ERROR] Failed to execute goal org.apache.maven.plugins:maven-surefire-plugin:2.17:test (default-test)
on project core-it-suite: There are test failures.
[ERROR] 
[ERROR] Please refer to <https://builds.apache.org/job/core-integration-testing-maven-3-embedded/ws/core-integration-testing-trunk/core-it-suite/target/surefire-reports>
for the individual test results.
[ERROR] -> [Help 1]
[ERROR] 
[ERROR] To see the full stack trace of the errors, re-run Maven with the -e switch.
[ERROR] Re-run Maven using the -X switch to enable full debug logging.
[ERROR] 
[ERROR] For more information about the errors and possible solutions, please read the following
articles:
[ERROR] [Help 1] http://cwiki.apache.org/confluence/display/MAVEN/MojoFailureException
[ERROR] 
[ERROR] After correcting the problems, you can resume the build with the command
[ERROR]   mvn <goals> -rf :core-it-suite
Build step 'Invoke top-level Maven targets' marked build as failure
Recording test results

Mime
View raw message