maven-notifications mailing list archives

Site index · List index
Message view « Date » · « Thread »
Top « Date » · « Thread »
From Apache Jenkins Server <jenk...@builds.apache.org>
Subject Build failed in Jenkins: maven-plugins-ITs-m3-windows #1897
Date Sun, 04 Jun 2017 19:47:27 GMT
See <https://builds.apache.org/job/maven-plugins-ITs-m3-windows/1897/display/redirect?page=changes>

Changes:

[gboue] [MCHECKSTYLE-337] checkstyle:check only supports xml output format, but the docs say
it supports plain as well
Submitted by: Stig Rohde Døssing

Adding support for 'plain' output file format in the 'check' goal. It is still not possible
to use it in combination with 'skipExec' because the plain format does not interact fully
with 'violationIgnore' (which can contain fully qualified class name, when Checkstyle plain
format only has the class simple name).

------------------------------------------
[...truncated 3.24 MB...]
[INFO] --- mrm-maven-plugin:1.0.0:start (default) @ maven-dependency-plugin ---
[INFO] Configuring Mock Repository Manager...
[INFO]   Mock content (source: F:\jenkins\jenkins-slave\workspace\maven-plugins-ITs-m3-windows\maven-dependency-plugin\src\it\mrm\repository)
[INFO]   Proxy (source: this Maven session)
[INFO] Starting Mock Repository Manager
[INFO] Logging to org.slf4j.impl.SimpleLogger(org.mortbay.log) via org.mortbay.log.Slf4jLog
[INFO] jetty-6.1.5
[INFO] Started SocketConnector@0.0.0.0:60251
[INFO] Mock Repository Manager http://localhost:60251 is started.
[INFO] Setting property 'repository.proxy.url' to 'http://localhost:60251'.
[INFO] 
[INFO] --- maven-invoker-plugin:2.0.0:integration-test (integration-test) @ maven-dependency-plugin
---
[INFO] Building: setup-custom-ear-lifecycle\pom.xml
[INFO] ..SUCCESS (13.3 s)
[INFO] Building: analyze\pom.xml
[INFO] run script verify.bsh
[INFO] ..SUCCESS (9.9 s)
[INFO] Building: analyze-dep-mgt\pom.xml
[INFO] ..SUCCESS (7.3 s)
[INFO] Building: analyze-ignore-dependency\pom.xml
[INFO] ..SUCCESS (8.4 s)
[INFO] Building: analyze-ignore-unused-declared-dependency\pom.xml
[INFO] ..SUCCESS (8.4 s)
[INFO] Building: analyze-ignore-used-undeclared-dependency\pom.xml
[INFO] ..SUCCESS (8.4 s)
[INFO] Building: analyze-multimodule-project\pom.xml
[INFO] ..SUCCESS (9.2 s)
[INFO] Building: analyze-report\pom.xml
[INFO] run script verify.bsh
[INFO] ..SUCCESS (9.5 s)
[INFO] Building: build-classpath\pom.xml
[INFO] run script verify.bsh
[INFO] ..SUCCESS (6.5 s)
[INFO] Building: build-classpath-output-file-and-property\pom.xml
[INFO] run script verify.bsh
[INFO] ..SUCCESS (8.9 s)
[INFO] Building: collect\pom.xml
[INFO] ..SUCCESS (6.7 s)
[INFO] Building: copy\pom.xml
[INFO] run script verify.bsh
[INFO] ..SUCCESS (6.5 s)
[INFO] Building: copy-and-unpack-with-alternate-local-repo\pom.xml
[INFO] run script verify.bsh
[INFO] ..SUCCESS (8.0 s)
[INFO] Building: copy-cli\pom.xml
[INFO] run script verify.bsh
[INFO] ..SUCCESS (6.6 s)
[INFO] Building: copy-dependencies\pom.xml
[INFO] run script verify.bsh
[INFO] ..SUCCESS (7.4 s)
[INFO] Building: copy-from-reactor\pom.xml
[INFO] run script verify.bsh
[INFO] ..SUCCESS (8.0 s)
[INFO] Building: copy-from-remote-repository\pom.xml
[INFO] run script setup.bsh
[INFO] run script verify.bsh
[INFO] ..SUCCESS (8.2 s)
[INFO] Building: dependency-properties\pom.xml
[INFO] run script verify.bsh
[INFO] ..SUCCESS (6.5 s)
[INFO] Building: filterunpack\pom.xml
[INFO] run script verify.groovy
[INFO] ..SUCCESS (6.6 s)
[INFO] Building: get-artifact\pom.xml
[INFO] run script setup.bsh
[INFO] run script verify.bsh
[INFO] ..SUCCESS (6.5 s)
[INFO] Building: get-artifact-maven-plugin\pom.xml
[INFO] run script setup.bsh
[INFO] run script verify.bsh
[INFO] ..SUCCESS (6.3 s)
[INFO] Building: get-artifact-no-transitive\pom.xml
[INFO] run script setup.bsh
[INFO] run script verify.bsh
[INFO] ..SUCCESS (6.4 s)
[INFO] Building: get-gav\pom.xml
[INFO] run script setup.bsh
[INFO] run script verify.bsh
[INFO] ..SUCCESS (6.6 s)
[INFO] Building: go-offline\pom.xml
[INFO] ..SUCCESS (7.9 s)
[INFO] Building: list-repositories\pom.xml
[INFO] ..SUCCESS (6.5 s)
[INFO] Building: mdep-439-analyze-java8\pom.xml
[INFO] ..SKIPPED due to JRE version
[INFO] Building: mdep-450-project-with-ancestor\pom.xml
[INFO] run script verify.groovy
[INFO] ..SUCCESS (6.5 s)
[INFO] Building: mdep-450-project-without-ancestor\pom.xml
[INFO] run script verify.groovy
[INFO] ..SUCCESS (6.4 s)
[INFO] Building: mdep-506-dependency-without-version-in-depmgt\pom.xml
[INFO] ..SUCCESS (7.2 s)
[INFO] Building: purge-local-repository\pom.xml
[INFO] run script setup.bsh
[INFO] run script verify.bsh
[INFO] ..SUCCESS (7.1 s)
[INFO] Building: purge-local-repository-non-transitive\pom.xml
[INFO] run script verify.bsh
[INFO] ..SUCCESS (7.1 s)
[INFO] Building: purge-local-repository-reresolve\pom.xml
[INFO] run script verify.bsh
[INFO] ..SUCCESS (7.3 s)
[INFO] Building: purge-local-repository-snapshots-only\pom.xml
[INFO] run script setup.bsh
[INFO] run script verify.bsh
[INFO] ..SUCCESS (7.7 s)
[INFO] Building: purge-local-repository-version-range\pom.xml
[INFO] run script verify.bsh
[INFO] ..SUCCESS (7.2 s)
[INFO] Building: resolve\pom.xml
[INFO] ..SUCCESS (6.5 s)
[INFO] Building: resolve-plugins\pom.xml
[INFO] ..SUCCESS (7.2 s)
[INFO] Building: resolve-plugins-exclude-reactor\pom.xml
[INFO] run script verify.groovy
[INFO] ..SUCCESS (8.3 s)
[INFO] Building: resolve-plugins-with-exclude\pom.xml
[INFO] run script verify.groovy
[INFO] ..SUCCESS (7.3 s)
[INFO] Building: sources\pom.xml
[INFO] ..SUCCESS (7.0 s)
[INFO] Building: tree\pom.xml
[INFO] run script verify.bsh
[INFO] ..SUCCESS (6.5 s)
[INFO] Building: tree-includes\pom.xml
[INFO] run script verify.bsh
[INFO] ..SUCCESS (6.9 s)
[INFO] Building: tree-multimodule\pom.xml
[INFO] run script verify.bsh
[INFO] ..SUCCESS (7.2 s)
[INFO] Building: unpack\pom.xml
[INFO] run script verify.bsh
[INFO] ..SUCCESS (7.9 s)
[INFO] Building: unpack-cli\pom.xml
[INFO] run script verify.bsh
[INFO] ..SUCCESS (6.5 s)
[INFO] Building: unpack-custom-ear\pom.xml
[INFO] run script verify.groovy
[INFO] ..SUCCESS (7.0 s)
[INFO] Building: unpack-dependencies\pom.xml
[INFO] run script verify.groovy
[INFO] ..SUCCESS (8.4 s)
[INFO] Building: unpack-from-remote-repository\pom.xml
[INFO] run script setup.bsh
[INFO] run script verify.bsh
[INFO] ..SUCCESS (8.2 s)
[INFO] Building: purge-local-repository-without-pom
[INFO] run script setup.bsh
[INFO] run script verify.bsh
[INFO] ..SUCCESS (6.8 s)
[INFO] 
[INFO] --- mrm-maven-plugin:1.0.0:stop (default) @ maven-dependency-plugin ---
[INFO] Stopping Mock Repository Manager on http://localhost:60251
[INFO] Mock Repository Manager http://localhost:60251 is stopped.
[INFO] 
[INFO] --- maven-checkstyle-plugin:2.15:check (checkstyle-check) @ maven-dependency-plugin
---
[INFO] There is 1 error reported by Checkstyle 6.1.1 with config/maven_checks.xml ruleset.
[INFO] Ignored 1 error, 0 violation remaining.
[INFO] 
[INFO] --- maven-invoker-plugin:2.0.0:verify (integration-test) @ maven-dependency-plugin
---
[INFO] -------------------------------------------------
[INFO] Build Summary:
[INFO]   Passed: 47, Failed: 0, Errors: 0, Skipped: 1
[INFO] -------------------------------------------------
[INFO] 
[INFO] --- maven-install-plugin:2.5.2:install (default-install) @ maven-dependency-plugin
---
[INFO] Installing F:\jenkins\jenkins-slave\workspace\maven-plugins-ITs-m3-windows\maven-dependency-plugin\target\maven-dependency-plugin-3.0.2-SNAPSHOT.jar
to C:\Users\jenkins\.m2\repository\org\apache\maven\plugins\maven-dependency-plugin\3.0.2-SNAPSHOT\maven-dependency-plugin-3.0.2-SNAPSHOT.jar
[INFO] Installing F:\jenkins\jenkins-slave\workspace\maven-plugins-ITs-m3-windows\maven-dependency-plugin\pom.xml
to C:\Users\jenkins\.m2\repository\org\apache\maven\plugins\maven-dependency-plugin\3.0.2-SNAPSHOT\maven-dependency-plugin-3.0.2-SNAPSHOT.pom
[INFO]                                                                         
[INFO] ------------------------------------------------------------------------
[INFO] Building Apache Maven Plugins Aggregator 1-SNAPSHOT
[INFO] ------------------------------------------------------------------------
[INFO] 
[INFO] --- maven-clean-plugin:2.5:clean (default-clean) @ maven-plugins-aggregator ---
[INFO] 
[INFO] --- maven-enforcer-plugin:1.3.1:enforce (enforce-bytecode-version) @ maven-plugins-aggregator
---
[INFO] 
[INFO] --- maven-enforcer-plugin:1.3.1:enforce (ban-known-bad-maven-versions) @ maven-plugins-aggregator
---
[INFO] 
[INFO] --- maven-remote-resources-plugin:1.5:process (default) @ maven-plugins-aggregator
---
[INFO] 
[INFO] --- maven-site-plugin:3.3:attach-descriptor (attach-descriptor) @ maven-plugins-aggregator
---
[INFO] 
[INFO] --- maven-install-plugin:2.5.1:install (default-install) @ maven-plugins-aggregator
---
[INFO] Installing <https://builds.apache.org/job/maven-plugins-ITs-m3-windows/ws/pom.xml>
to C:\Users\jenkins\.m2\repository\org\apache\maven\plugins\maven-plugins-aggregator\1-SNAPSHOT\maven-plugins-aggregator-1-SNAPSHOT.pom
[INFO] ------------------------------------------------------------------------
[INFO] Reactor Summary:
[INFO] 
[INFO] Apache Maven ACR Plugin ............................ SUCCESS [ 43.675 s]
[INFO] Apache Maven AntRun Plugin ......................... SUCCESS [02:01 min]
[INFO] Apache Maven Changelog Plugin ...................... SUCCESS [01:15 min]
[INFO] Apache Maven Changes Plugin ........................ SUCCESS [02:03 min]
[INFO] Apache Maven Clean Plugin .......................... SUCCESS [ 50.551 s]
[INFO] Apache Maven Compiler Plugin ....................... SUCCESS [03:51 min]
[INFO] Apache Maven Deploy Plugin ......................... SUCCESS [03:31 min]
[INFO] Apache Maven Documentation Checker Plugin .......... SUCCESS [  9.620 s]
[INFO] Apache Maven EAR Plugin ............................ SUCCESS [09:51 min]
[INFO] Apache Maven EJB Plugin ............................ SUCCESS [01:09 min]
[INFO] Apache Maven Help Plugin ........................... SUCCESS [03:22 min]
[INFO] Apache Maven Install Plugin ........................ SUCCESS [03:27 min]
[INFO] Apache Maven Jarsigner Plugin ...................... SUCCESS [01:14 min]
[INFO] Apache Maven Javadoc Plugin ........................ SUCCESS [10:37 min]
[INFO] Apache Maven JDeps Plugin .......................... SUCCESS [  3.794 s]
[INFO] Apache Maven Linkcheck Plugin ...................... SUCCESS [  5.236 s]
[INFO] Apache Maven Patch Plugin .......................... SUCCESS [ 10.603 s]
[INFO] Apache Maven PDF Plugin ............................ SUCCESS [ 51.828 s]
[INFO] Apache Maven RAR Plugin ............................ SUCCESS [ 24.179 s]
[INFO] Apache Maven Repository Plugin ..................... SUCCESS [ 50.719 s]
[INFO] Apache Maven Resources Plugin ...................... SUCCESS [02:38 min]
[INFO] Apache Maven Site Plugin ........................... SUCCESS [12:26 min]
[INFO] Apache Maven Source Plugin ......................... SUCCESS [01:43 min]
[INFO] Apache Maven Stage Plugin .......................... SUCCESS [  4.504 s]
[INFO] Apache Maven Toolchains Plugin ..................... SUCCESS [ 25.469 s]
[INFO] Apache Maven Verifier Plugin ....................... SUCCESS [ 15.905 s]
[INFO] Apache Maven WAR Plugin ............................ SUCCESS [03:10 min]
[INFO] Apache Maven DOAP Plugin ........................... SUCCESS [ 33.975 s]
[INFO] Apache Maven Invoker Plugin ........................ SUCCESS [11:01 min]
[INFO] Apache Maven JAR Plugin ............................ SUCCESS [03:02 min]
[INFO] Apache Maven Checkstyle Plugin ..................... SUCCESS [07:33 min]
[INFO] Apache Maven PMD Plugin ............................ SUCCESS [03:41 min]
[INFO] Apache Maven Project Info Reports Plugin ........... SUCCESS [03:27 min]
[INFO] Apache Maven Remote Resources Plugin ............... SUCCESS [01:39 min]
[INFO] Apache Maven Shade Plugin .......................... SUCCESS [06:47 min]
[INFO] Apache Maven SCM Publish Plugin .................... SUCCESS [01:16 min]
[INFO] Apache Maven Assembly Plugin ....................... FAILURE [19:36 min]
[INFO] Apache Maven Dependency Plugin ..................... SUCCESS [07:00 min]
[INFO] Apache Maven Plugins Aggregator .................... SUCCESS [  1.013 s]
[INFO] ------------------------------------------------------------------------
[INFO] BUILD FAILURE
[INFO] ------------------------------------------------------------------------
[INFO] Total time: 02:13 h
[INFO] Finished at: 2017-06-04T19:46:22+00:00
[INFO] Final Memory: 153M/567M
[INFO] ------------------------------------------------------------------------
[WARNING] The requested profile "apache.snapshots" could not be activated because it does
not exist.
[ERROR] Failed to execute goal org.apache.maven.plugins:maven-invoker-plugin:3.0.0:verify
(integration-test) on project maven-assembly-plugin: 1 build failed. See console output above
for details. -> [Help 1]
[ERROR] 
[ERROR] To see the full stack trace of the errors, re-run Maven with the -e switch.
[ERROR] Re-run Maven using the -X switch to enable full debug logging.
[ERROR] 
[ERROR] For more information about the errors and possible solutions, please read the following
articles:
[ERROR] [Help 1] http://cwiki.apache.org/confluence/display/MAVEN/MojoFailureException
[ERROR] 
[ERROR] After correcting the problems, you can resume the build with the command
[ERROR]   mvn <goals> -rf :maven-assembly-plugin
Build step 'Invoke top-level Maven targets' marked build as failure
Deleting 1 temporary files
Recording test results

Mime
View raw message