maven-notifications mailing list archives

Site index · List index
Message view « Date » · « Thread »
Top « Date » · « Thread »
From Apache Jenkins Server <jenk...@builds.apache.org>
Subject Build failed in Jenkins: core-integration-testing-maven-3-embedded #7727
Date Tue, 17 Oct 2017 18:29:55 GMT
See <https://builds.apache.org/job/core-integration-testing-maven-3-embedded/7727/display/redirect?page=changes>

Changes:

[stephen.alan.connolly] Revert "[MNG-6275] Maven Embedder compatible fix"

[stephen.alan.connolly] Revert "MNG-6209 better executeMojo thread context classloader"

------------------------------------------
[...truncated 1.41 MB...]
mng1995InterpolateBooleanModelElements(itMNG1995)...........OK (0.3 s)
mng1992SystemPropOverridesPomProp(itMNG1992)................OK (0.3 s)
mng1957JdkActivationWithVersionRange(itMNG1957).............OK (0.3 s)
mng1908LegacySnapshotUpdate(itMNG1908)......................SKIPPED - Maven version 3.5.2-SNAPSHOT
not in range [2.0,3.0-alpha-3)
mng1895ScopeConflictResolution(itDirectVsIndirect)..........OK (0.5 s)
mng1895ScopeConflictResolution(itCompileVsRuntime)..........OK (0.3 s)
mng1895ScopeConflictResolution(itCompileVsTest).............OK (0.3 s)
mng1895ScopeConflictResolution(itCompileVsProvided).........OK (0.3 s)
mng1895ScopeConflictResolution(itRuntimeVsTest).............OK (0.3 s)
mng1895ScopeConflictResolution(itRuntimeVsProvided).........OK (0.3 s)
mng1895ScopeConflictResolution(itProvidedVsTest)............OK (0.4 s)
mng1830ShowVersion(Version).................................SKIPPED - Maven version 3.5.2-SNAPSHOT
not in range (2.0.10,2.1.0-M1),(2.1.0-M1,3.0-alpha-1),[3.0-alpha-3,3.2)
mng1803PomValidationErrorIncludesLineNumber(it).............OK (0.1 s)
mng1751ForcedMetadataUpdateDuringDeployment(it).............OK (0.7 s)
mng1703PluginMgmtDepInheritance(itMNG1703)..................OK (0.4 s)
mng1701DuplicatePlugin(it)..................................OK (0.3 s)
mng1493NonStandardModulePomNames(itMNG1493).................OK (0.3 s)
mng1491ReactorArtifactIdCollision(itMNG1491)................OK (0.1 s)
mng1415QuotedSystemProperties(itMNG1415)....................OK (0.5 s)
mng1412DependenciesOrder(itMNG1412).........................OK (0.5 s)
mng1349ChecksumFormats(itMNG1349)...........................OK (0.6 s)
mng1323AntrunDependencies(itMNG1323)........................OK (0.4 s)
mng1233WarDepWithProvidedScope(itMNG1233)...................OK (0.4 s)
mng1144MultipleDefaultGoals(it).............................OK (0.4 s)
mng1142VersionRangeIntersection(itAB).......................OK (0.4 s)
mng1142VersionRangeIntersection(itBA).......................OK (0.3 s)
mng1088ReactorPluginResolution(itMNG1088)...................OK (0.4 s)
mng1073AggregatorForksReactor(itForkLifecycle)..............OK (0.4 s)
mng1073AggregatorForksReactor(itForkGoal)...................OK (0.3 s)
mng1052PluginMngtConfig(itMNG1052)..........................OK (0.4 s)
mng1021EqualAttachmentBuildNumber(itMNG1021)................OK (0.4 s)
mng0985NonExecutedPluginMngtGoals(itMNG0985)................OK (0.3 s)
mng0956ComponentInjectionViaProjectLevelPluginDep(itMNG0956)OK (0.3 s)
mng0947OptionalDependency(it)...............................OK (0.4 s)
mng0870ReactorAwarePluginDiscovery(itMNG0870)...............OK (0.4 s)
mng0866EvaluateDefaultValue(itMNG866).......................OK (0.4 s)
mng0848SystemPropOverridesDefaultValue(itMNG848)............OK (0.4 s)
mng0836PluginParentResolution(itMNG836).....................OK (0.4 s)
mng0823MojoContextPassing(itMNG0823)........................OK (0.3 s)
mng0820ConflictResolution(itMNG0820)........................OK (0.4 s)
mng0818WarDepsNotTransitive(itMNG0818)......................OK (0.4 s)
mng0814ExplicitProfileActivation(itMNG814)..................OK (0.4 s)
mng0786ProfileAwareReactor(itMNG0786).......................OK (0.5 s)
mng0781PluginConfigVsExecConfig(itMNG0781)..................OK (0.4 s)
mng0773SettingsProfileReactorPollution(itMNG773)............OK (0.3 s)
mng0768OfflineMode(itMNG768)................................OK (1.2 s)
mng0761MissingSnapshotDistRepo(itMNG761)....................OK (0.3 s)
mng0731LegacyRepoLayout(itMNG731)...........................SKIPPED - Maven version 3.5.2-SNAPSHOT
not in range [2.0,3.0-alpha-3)
mng0680ParentBasedir(itMNG680)..............................OK (0.3 s)
mng0674PluginParameterAlias(itLifecycle)....................OK (0.3 s)
mng0674PluginParameterAlias(itCli)..........................OK (0.2 s)
mng0666IgnoreLegacyPom(itMNG666)............................OK (0.4 s)
mng0557UserSettingsCliOption(itMNG557)......................OK (0.4 s)
mng0553SettingsAuthzEncryption(itBasic).....................OK (3.7 s)
mng0553SettingsAuthzEncryption(itRelocation)................OK (3.4 s)
mng0553SettingsAuthzEncryption(itEncryption)................OK (4.4 s)
mng0522InheritedPluginMgmtConfig(itMNG522)..................OK (0.4 s)
mng0507ArtifactRelocation(itMNG507).........................OK (0.6 s)
mng0505VersionRange(itMNG505)...............................OK (0.4 s)
mng0496IgnoreUnknownPluginParameters(itMNG496)..............OK (0.3 s)
mng0479OverrideCentralRepo(itModel).........................OK (0.6 s)
mng0479OverrideCentralRepo(itResolution)....................OK (0.8 s)
mng0471CustomLifecycle(itMNG471)............................OK (0.3 s)
mng0469ReportConfig(itReportConfigOverridesBuildDefaults)...SKIPPED - Maven version 3.5.2-SNAPSHOT
not in range [2.0.0,3.0-alpha-1)
mng0469ReportConfig(itBuildConfigDominantDuringBuild).......OK (0.3 s)
mng0469ReportConfig(itBuildConfigIrrelevantForReports)......OK (0.2 s)
mng0461TolerateMissingDependencyPom(it).....................OK (0.3 s)
mng0449PluginVersionResolution(itLifecycleInvocation).......OK (0.4 s)
mng0449PluginVersionResolution(itCliInvocation).............OK (0.3 s)
mng0377PluginLookupFromPrefix(itMNG377).....................OK (0.4 s)
mng0294MergeGlobalAndUserSettings(itMNG294).................OK (0.3 s)
mng0282NonReactorExecWhenProjectIndependent(itMNG282).......OK (0.3 s)
mng0249ResolveDepsFromReactor(itMNG0249)....................OK (0.4 s)
mng0187CollectedProjects(it)................................OK (0.3 s)
mng0095ReactorFailureBehavior(itFailFast)...................OK (0.3 s)
mng0095ReactorFailureBehavior(itFailNever)..................OK (0.3 s)
mng0095ReactorFailureBehavior(itFailAtEnd)..................OK (0.3 s)
0145ReactorWithIncludesExcludes(itDefaultIncludesExcludes)..SKIPPED - Maven version 3.5.2-SNAPSHOT
not in range [2.0,3.0-alpha-1)
0145ReactorWithIncludesExcludes(itCustomIncludes)...........SKIPPED - Maven version 3.5.2-SNAPSHOT
not in range [2.0,3.0-alpha-1)
0145ReactorWithIncludesExcludes(itCustomExcludes)...........SKIPPED - Maven version 3.5.2-SNAPSHOT
not in range [2.0,3.0-alpha-1)
0144LifecycleExecutionOrder(it0144).........................OK (0.4 s)
0143TransitiveDependencyScopes(itCompileScope)..............OK (0.4 s)
0143TransitiveDependencyScopes(itProvidedScope).............OK (0.3 s)
0143TransitiveDependencyScopes(itRuntimeScope)..............OK (0.3 s)
0143TransitiveDependencyScopes(itTestScope).................OK (0.3 s)
0142DirectDependencyScopes(it0142)..........................OK (0.4 s)
0140InterpolationWithPomPrefix(it0140)......................OK (0.4 s)
0139InterpolationWithProjectPrefix(it0139)..................OK (0.3 s)
0138PluginLifecycle(it0138).................................OK (0.4 s)
0137EarLifecycle(it0137)....................................OK (0.3 s)
0136RarLifecycle(it0136)....................................OK (0.3 s)
0135EjbLifecycle(it0135)....................................OK (0.4 s)
0134WarLifecycle(it0134)....................................OK (0.4 s)
0133JarLifecycle(it0133)....................................OK (0.4 s)
0132PomLifecycle(it0132)....................................OK (0.3 s)
0131SiteLifecycle(it0131)...................................OK (0.3 s)
0130CleanLifecycle(it0130)..................................OK (0.3 s)
0113ServerAuthzAvailableToWagonMgrInPlugin(it0113)..........OK (0.3 s)
0090EnvVarInterpolation(it0090).............................OK (2.5 s)
0087PluginRealmWithProjectLevelDeps(it0087).................OK (0.3 s)
0086PluginRealm(it0086).....................................OK (0.3 s)
0085TransitiveSystemScope(it0085)...........................OK (0.3 s)
0072InterpolationWithDottedProperty(it0072).................OK (0.3 s)
0071PluginConfigWithDottedProperty(it0071)..................OK (0.3 s)
0064MojoConfigViaSetters(it0064)............................OK (0.3 s)
0063SystemScopeDependency(it0063)...........................OK (0.3 s)
0056MultipleGoalExecutions(it0056)..........................OK (0.3 s)
0052ReleaseProfile(it0052)..................................OK (0.3 s)
0051ReleaseProfile(it0051)..................................OK (0.4 s)
0041ArtifactTypeFromPluginExtension(it0041).................OK (0.4 s)
0040PackagingFromPluginExtension(it0040)....................OK (0.3 s)
0039ReleasePomInReactor(it0039).............................SKIPPED - Maven version 3.5.2-SNAPSHOT
not in range [2.0,3.0-alpha-1)
0038AlternatePomFileDifferentDir(it0038)....................OK (0.4 s)
0037AlternatePomFileSameDir(it0037).........................OK (0.3 s)
0036ReleasePom(it0036)......................................SKIPPED - Maven version 3.5.2-SNAPSHOT
not in range (2.0,3.0-alpha-1)
0032MavenPrerequisite(it0032)...............................OK (0.3 s)
0030DepPomDepMngtInheritance(it0030)........................OK (1.5 s)
0025MultipleExecutionLevelConfigs(it0025)...................OK (0.5 s)
0024MultipleGoalExecutions(it0024)..........................OK (0.5 s)
0023SettingsProfile(it0023).................................OK (0.4 s)
0021PomProfile(it0021)......................................OK (0.4 s)
0019PluginVersionMngtBySuperPom(it0019).....................OK (0.4 s)
0018DependencyManagement(it0018)............................OK (0.4 s)
0012PomInterpolation(it0012)................................OK (0.4 s)
0011DefaultVersionByDependencyManagement(it0011)............OK (0.4 s)
0010DependencyClosureResolution(it0010).....................OK (0.4 s)
0009GoalConfiguration(it0009)...............................OK (0.4 s)
0008SimplePlugin(it0008)....................................OK (0.4 s)
mng6209MultipleBuildExtensions(BuildExtensionClassloader)...FAILURE (3.1 s)
mng6210CoreExtensionsCustomScopes(CoreExtensionCustomScopes)OK (0.5 s)
Tests run: 804, Failures: 1, Errors: 0, Skipped: 0, Time elapsed: 441.021 sec <<<
FAILURE! - in org.apache.maven.it.IntegrationTestSuite
testBuildExtensionClassloader(org.apache.maven.it.MavenITmng6209MultipleBuildExtensions) 
Time elapsed: 3.105 sec  <<< FAILURE!
junit.framework.AssertionFailedError: expected:<2> but was:<1>
	at junit.framework.Assert.fail(Assert.java:47)
	at junit.framework.Assert.failNotEquals(Assert.java:283)
	at junit.framework.Assert.assertEquals(Assert.java:64)
	at junit.framework.Assert.assertEquals(Assert.java:195)
	at junit.framework.Assert.assertEquals(Assert.java:201)
	at org.apache.maven.it.MavenITmng6209MultipleBuildExtensions.testBuildExtensionClassloader(MavenITmng6209MultipleBuildExtensions.java:57)


Results :

Failed tests: 
  MavenITmng6209MultipleBuildExtensions>AbstractMavenIntegrationTestCase.runTest:222->testBuildExtensionClassloader:57
expected:<2> but was:<1>

Tests run: 804, Failures: 1, Errors: 0, Skipped: 0

[INFO] ------------------------------------------------------------------------
[INFO] Reactor Summary:
[INFO] 
[INFO] Maven Core ITs .................................... SUCCESS [19.931s]
[INFO] Maven IT Support .................................. SUCCESS [0.877s]
[INFO] Maven IT :: Plugins ............................... SUCCESS [0.575s]
[INFO] Maven IT Plugin :: Active Collection .............. SUCCESS [4.420s]
[INFO] Maven IT Plugin :: Ant-Based ...................... SUCCESS [3.188s]
[INFO] Maven IT Plugin :: Artifact ....................... SUCCESS [1.699s]
[INFO] Maven IT Plugin :: Class Loader :: Dependency A ... SUCCESS [0.446s]
[INFO] Maven IT Plugin :: Class Loader :: Dependency B ... SUCCESS [0.466s]
[INFO] Maven IT Plugin :: Class Loader :: Dependency C ... SUCCESS [0.363s]
[INFO] Maven IT Plugin :: Class Loader ................... SUCCESS [1.275s]
[INFO] Maven IT Plugin :: Class Loader :: Aggregator ..... SUCCESS [0.358s]
[INFO] Maven IT Plugin :: Configuration .................. SUCCESS [0.802s]
[INFO] Maven IT Plugin :: Context Passing ................ SUCCESS [0.430s]
[INFO] Maven ITs :: Core Plugin Stubs .................... SUCCESS [0.364s]
[INFO] Maven IT Clean Plugin Stub ........................ SUCCESS [0.599s]
[INFO] Maven IT Compiler Plugin Stub ..................... SUCCESS [0.674s]
[INFO] Maven IT Deploy Plugin Stub ....................... SUCCESS [0.598s]
[INFO] Maven IT EAR Plugin Stub .......................... SUCCESS [0.531s]
[INFO] Maven IT EJB Plugin Stub .......................... SUCCESS [0.541s]
[INFO] Maven IT Install Plugin Stub ...................... SUCCESS [0.510s]
[INFO] Maven IT JAR Plugin Stub .......................... SUCCESS [0.533s]
[INFO] Maven IT Javadoc Plugin Stub ...................... SUCCESS [0.512s]
[INFO] Maven IT Plugin Plugin Stub ....................... SUCCESS [0.575s]
[INFO] Maven IT RAR Plugin Stub .......................... SUCCESS [0.561s]
[INFO] Maven IT Resources Plugin Stub .................... SUCCESS [0.563s]
[INFO] Maven IT Site Plugin Stub ......................... SUCCESS [0.550s]
[INFO] Maven IT Source Plugin Stub ....................... SUCCESS [0.518s]
[INFO] Maven IT Surefire Plugin Stub ..................... SUCCESS [0.560s]
[INFO] Maven IT WAR Plugin Stub .......................... SUCCESS [0.543s]
[INFO] Maven IT Plugin :: Dependency Collection .......... SUCCESS [0.562s]
[INFO] Maven IT Plugin :: Dependency Resolution .......... SUCCESS [2.995s]
[INFO] Maven IT Plugin :: Expression ..................... SUCCESS [0.787s]
[INFO] Maven IT Plugin :: Error Mojos .................... SUCCESS [1.075s]
[INFO] Maven IT Component ................................ SUCCESS [0.392s]
[INFO] Maven IT Plugin :: Extension Consumer ............. SUCCESS [0.393s]
[INFO] Maven IT Plugin :: Extension Provider ............. SUCCESS [0.396s]
[INFO] Maven IT Plugin :: Fork ........................... SUCCESS [0.530s]
[INFO] Maven IT Plugin :: Invalid Descriptor ............. SUCCESS [0.386s]
[INFO] Maven IT Plugin :: Log File ....................... SUCCESS [0.403s]
[INFO] Maven IT Helper Library ........................... SUCCESS [0.828s]
[INFO] Maven IT Plugin :: Model Interpolation ............ SUCCESS [0.593s]
[INFO] Maven IT Plugin :: No Default Component ........... SUCCESS [0.427s]
[INFO] Maven IT Plugin :: No Project ..................... SUCCESS [0.399s]
[INFO] Maven IT Plugin :: Online ......................... SUCCESS [0.392s]
[INFO] Maven IT Plugin :: Optional Mojos ................. SUCCESS [0.602s]
[INFO] Maven IT Plugin :: Packaging ...................... SUCCESS [0.405s]
[INFO] Maven IT Plugin :: Parameter Implementation ....... SUCCESS [0.387s]
[INFO] Maven IT Plugin :: Plugin Dependency .............. SUCCESS [0.421s]
[INFO] Maven IT Plugin :: Project ........................ SUCCESS [0.577s]
[INFO] Maven IT Plugin :: Project Interpolation .......... SUCCESS [0.660s]
[INFO] Maven IT Plugin :: Setter ......................... SUCCESS [0.397s]
[INFO] Maven IT Plugin :: Singleton Component ............ SUCCESS [0.407s]
[INFO] Maven IT Plugin :: Site ........................... SUCCESS [1.612s]
[INFO] Maven IT Plugin :: Toolchain ...................... SUCCESS [2.377s]
[INFO] Maven IT Plugin :: Touch .......................... SUCCESS [0.577s]
[INFO] Maven IT Plugin :: Uses Properties Plugin ......... SUCCESS [0.381s]
[INFO] Maven IT Plugin :: Uses Wagon Plugin .............. SUCCESS [0.898s]
[INFO] Maven IT Plugin :: This plugin should contain the mojos needed by all tests.  SUCCESS
[0.447s]
[INFO] Maven IT Plugin :: Plexus Utils 1.1 ............... SUCCESS [0.434s]
[INFO] Maven IT Plugin :: Plexus Utils New ............... SUCCESS [0.419s]
[INFO] Maven IT Plugin :: Plexus Component API ........... SUCCESS [0.916s]
[INFO] Maven IT Plugin :: Log4J Client ................... SUCCESS [0.483s]
[INFO] Maven IT Plugin :: Extension 1 .................... SUCCESS [0.369s]
[INFO] Maven IT Plugin :: Extension 2 .................... SUCCESS [0.351s]
[INFO] Maven IT Plugin :: Plexus Lifecycle ............... SUCCESS [0.830s]
[INFO] Maven IT Plugin :: Settings ....................... SUCCESS [0.462s]
[INFO] Maven IT Plugin :: mng-5805 extension ............. SUCCESS [0.331s]
[INFO] Maven IT Plugin :: mng-5805 extension mk2 ......... SUCCESS [0.335s]
[INFO] Maven IT Plugin :: mng-5805 plugin ................ SUCCESS [0.449s]
[INFO] Maven IT Plugin :: mng-5805 plugin-dep ............ SUCCESS [0.335s]
[INFO] Maven IT Plugin :: mng-5958 extension ............. SUCCESS [2.530s]
[INFO] Maven IT Toolchain ................................ SUCCESS [0.798s]
[INFO] Maven IT Wagon .................................... SUCCESS [0.580s]
[INFO] Maven IT Support Artifacts ........................ SUCCESS [1.279s]
[INFO] Maven IT Extension ................................ SUCCESS [0.439s]
[INFO] Maven ITs ......................................... FAILURE [7:38.887s]
[INFO] ------------------------------------------------------------------------
[INFO] BUILD FAILURE
[INFO] ------------------------------------------------------------------------
[INFO] Total time: 8:56.769s
[INFO] Finished at: Tue Oct 17 18:29:52 UTC 2017
[INFO] Final Memory: 72M/729M
[INFO] ------------------------------------------------------------------------
[ERROR] Failed to execute goal org.apache.maven.plugins:maven-surefire-plugin:2.18.1:test
(default-test) on project core-it-suite: There are test failures.
[ERROR] 
[ERROR] Please refer to <https://builds.apache.org/job/core-integration-testing-maven-3-embedded/ws/core-integration-testing-trunk/core-it-suite/target/surefire-reports>
for the individual test results.
[ERROR] -> [Help 1]
[ERROR] 
[ERROR] To see the full stack trace of the errors, re-run Maven with the -e switch.
[ERROR] Re-run Maven using the -X switch to enable full debug logging.
[ERROR] 
[ERROR] For more information about the errors and possible solutions, please read the following
articles:
[ERROR] [Help 1] http://cwiki.apache.org/confluence/display/MAVEN/MojoFailureException
[ERROR] 
[ERROR] After correcting the problems, you can resume the build with the command
[ERROR]   mvn <goals> -rf :core-it-suite
Build step 'Invoke top-level Maven targets' marked build as failure
Recording test results

Mime
View raw message