maven-notifications mailing list archives

Site index · List index
Message view « Date » · « Thread »
Top « Date » · « Thread »
From Apache Jenkins Server <jenk...@builds.apache.org>
Subject Build unstable in Jenkins: Maven TLP (wip) » maven-scm » master #1
Date Wed, 29 Nov 2017 23:04:38 GMT
See https://builds.apache.org/job/maven-wip/job/maven-scm/job/master/1/

No changes.

36 tests failed.
FAILED:  org.apache.maven.scm.provider.git.gitexe.command.checkin.GitCheckInCommandNoBranchTest.testCheckinNoBranch

Error Message:
The check out result success flag was false.

Stack Trace:
junit.framework.AssertionFailedError: The check out result success flag was false.
	at org.apache.maven.scm.provider.git.gitexe.command.checkin.GitCheckInCommandNoBranchTest.checkoutRepo(GitCheckInCommandNoBranchTest.java:93)
	at org.apache.maven.scm.provider.git.gitexe.command.checkin.GitCheckInCommandNoBranchTest.testCheckinNoBranch(GitCheckInCommandNoBranchTest.java:79)


FAILED:  org.apache.maven.scm.provider.git.gitexe.command.checkin.GitCheckInCommandNoBranchTest.testCheckinNoBranch

Error Message:
The check out result success flag was false.

Stack Trace:
junit.framework.AssertionFailedError: The check out result success flag was false.
	at org.apache.maven.scm.provider.git.gitexe.command.checkin.GitCheckInCommandNoBranchTest.checkoutRepo(GitCheckInCommandNoBranchTest.java:93)
	at org.apache.maven.scm.provider.git.gitexe.command.checkin.GitCheckInCommandNoBranchTest.testCheckinNoBranch(GitCheckInCommandNoBranchTest.java:79)


FAILED:  org.apache.maven.scm.provider.git.gitexe.command.checkin.GitCheckInCommandNoBranchTest.testCheckinNoBranch

Error Message:
The check out result success flag was false.

Stack Trace:
junit.framework.AssertionFailedError: The check out result success flag was false.
	at org.apache.maven.scm.provider.git.gitexe.command.checkin.GitCheckInCommandNoBranchTest.testCheckinNoBranch(GitCheckInCommandNoBranchTest.java:75)


FAILED:  org.apache.maven.scm.provider.git.gitexe.command.checkin.GitCheckInCommandNoBranchTest.testCheckinNoBranch

Error Message:
The check out result success flag was false.

Stack Trace:
junit.framework.AssertionFailedError: The check out result success flag was false.
	at org.apache.maven.scm.provider.git.gitexe.command.checkin.GitCheckInCommandNoBranchTest.checkoutRepo(GitCheckInCommandNoBranchTest.java:93)
	at org.apache.maven.scm.provider.git.gitexe.command.checkin.GitCheckInCommandNoBranchTest.testCheckinNoBranch(GitCheckInCommandNoBranchTest.java:64)


FAILED:  org.apache.maven.scm.provider.git.gitexe.command.checkin.GitCheckInCommandNoBranchTest.testCheckinNoBranch

Error Message:
The check out result success flag was false.

Stack Trace:
junit.framework.AssertionFailedError: The check out result success flag was false.
	at org.apache.maven.scm.provider.git.gitexe.command.checkin.GitCheckInCommandNoBranchTest.testCheckinNoBranch(GitCheckInCommandNoBranchTest.java:75)


FAILED:  org.apache.maven.scm.provider.git.gitexe.command.checkin.GitCheckInCommandNoBranchTest.testCheckinNoBranch

Error Message:
The check out result success flag was false.

Stack Trace:
junit.framework.AssertionFailedError: The check out result success flag was false.
	at org.apache.maven.scm.provider.git.gitexe.command.checkin.GitCheckInCommandNoBranchTest.testCheckinNoBranch(GitCheckInCommandNoBranchTest.java:75)


FAILED:  org.apache.maven.scm.provider.git.gitexe.command.checkin.GitCheckInCommandTest.testCheckinAfterRename

Error Message:
The check out result success flag was false.

Stack Trace:
junit.framework.AssertionFailedError: The check out result success flag was false.
	at org.apache.maven.scm.provider.git.gitexe.command.checkin.GitCheckInCommandTest.checkoutRepoInto(GitCheckInCommandTest.java:143)
	at org.apache.maven.scm.provider.git.gitexe.command.checkin.GitCheckInCommandTest.testCheckinAfterRename(GitCheckInCommandTest.java:99)


FAILED:  org.apache.maven.scm.provider.git.gitexe.command.checkin.GitCheckInCommandTest.testCheckinAfterRename

Error Message:
The check out result success flag was false.

Stack Trace:
junit.framework.AssertionFailedError: The check out result success flag was false.
	at org.apache.maven.scm.provider.git.gitexe.command.checkin.GitCheckInCommandTest.checkoutRepoInto(GitCheckInCommandTest.java:143)
	at org.apache.maven.scm.provider.git.gitexe.command.checkin.GitCheckInCommandTest.testCheckinAfterRename(GitCheckInCommandTest.java:99)


FAILED:  org.apache.maven.scm.provider.git.gitexe.command.checkin.GitCheckInCommandTest.testCheckinAfterRename

Error Message:
The check out result success flag was false.

Stack Trace:
junit.framework.AssertionFailedError: The check out result success flag was false.
	at org.apache.maven.scm.provider.git.gitexe.command.checkin.GitCheckInCommandTest.testCheckinAfterRename(GitCheckInCommandTest.java:113)


FAILED:  org.apache.maven.scm.provider.git.gitexe.command.checkin.GitCheckInCommandTest.testCheckinAfterRename

Error Message:
The check out result success flag was false.

Stack Trace:
junit.framework.AssertionFailedError: The check out result success flag was false.
	at org.apache.maven.scm.provider.git.gitexe.command.checkin.GitCheckInCommandTest.checkoutRepoInto(GitCheckInCommandTest.java:143)
	at org.apache.maven.scm.provider.git.gitexe.command.checkin.GitCheckInCommandTest.testCheckinAfterRename(GitCheckInCommandTest.java:99)


FAILED:  org.apache.maven.scm.provider.git.gitexe.command.checkin.GitCheckInCommandTest.testCheckinAfterRename

Error Message:
The check out result success flag was false.

Stack Trace:
junit.framework.AssertionFailedError: The check out result success flag was false.
	at org.apache.maven.scm.provider.git.gitexe.command.checkin.GitCheckInCommandTest.testCheckinAfterRename(GitCheckInCommandTest.java:113)


FAILED:  org.apache.maven.scm.provider.git.gitexe.command.checkin.GitCheckInCommandTest.testCheckinAfterRename

Error Message:
The check out result success flag was false.

Stack Trace:
junit.framework.AssertionFailedError: The check out result success flag was false.
	at org.apache.maven.scm.provider.git.gitexe.command.checkin.GitCheckInCommandTest.testCheckinAfterRename(GitCheckInCommandTest.java:113)


FAILED:  org.apache.maven.scm.provider.git.gitexe.command.checkout.GitExeCheckOutCommandNoBranchTest.testCheckoutNoBranch

Error Message:
The check out result success flag was false.

Stack Trace:
junit.framework.AssertionFailedError: The check out result success flag was false.
	at org.apache.maven.scm.provider.git.gitexe.command.checkout.GitExeCheckOutCommandNoBranchTest.checkoutRepo(GitExeCheckOutCommandNoBranchTest.java:89)
	at org.apache.maven.scm.provider.git.gitexe.command.checkout.GitExeCheckOutCommandNoBranchTest.testCheckoutNoBranch(GitExeCheckOutCommandNoBranchTest.java:65)


FAILED:  org.apache.maven.scm.provider.git.gitexe.command.checkout.GitExeCheckOutCommandNoBranchTest.testDoubleCheckoutNoBranch

Error Message:
The check out result success flag was false.

Stack Trace:
junit.framework.AssertionFailedError: The check out result success flag was false.
	at org.apache.maven.scm.provider.git.gitexe.command.checkout.GitExeCheckOutCommandNoBranchTest.checkoutRepo(GitExeCheckOutCommandNoBranchTest.java:89)
	at org.apache.maven.scm.provider.git.gitexe.command.checkout.GitExeCheckOutCommandNoBranchTest.testDoubleCheckoutNoBranch(GitExeCheckOutCommandNoBranchTest.java:77)


FAILED:  org.apache.maven.scm.provider.git.jgit.command.branch.JGitBranchCommandTckTest.testBranchCommandTest

Error Message:
Exception while executing SCM command.

Stack Trace:
org.apache.maven.scm.ScmException: Exception while executing SCM command.
Caused by: org.apache.maven.scm.ScmException: JGit checkout failure!
Caused by: org.eclipse.jgit.api.errors.JGitInternalException: Exception caught during execution of fetch command
Caused by: org.eclipse.jgit.errors.NotSupportedException: URI not supported: file://2/m/maven-scm-providers/maven-scm-providers-git/maven-scm-provider-jgit/target/scm-test/repository


FAILED:  org.apache.maven.scm.provider.git.jgit.command.changelog.JGitChangeLogCommandTckTest.testChangeLogCommand

Error Message:
Exception while executing SCM command.

Stack Trace:
org.apache.maven.scm.ScmException: Exception while executing SCM command.
Caused by: org.apache.maven.scm.ScmException: JGit checkout failure!
Caused by: org.eclipse.jgit.api.errors.JGitInternalException: Exception caught during execution of fetch command
Caused by: org.eclipse.jgit.errors.NotSupportedException: URI not supported: file://2/m/maven-scm-providers/maven-scm-providers-git/maven-scm-provider-jgit/target/scm-test/repository


FAILED:  org.apache.maven.scm.provider.git.jgit.command.checkin.JGitCheckInCommandCommitterAuthorTckTest.testCheckInCommandTest

Error Message:
Exception while executing SCM command.

Stack Trace:
org.apache.maven.scm.ScmException: Exception while executing SCM command.
	at org.apache.maven.scm.provider.git.jgit.command.checkin.JGitCheckInCommandCommitterAuthorTckTest.setUp(JGitCheckInCommandCommitterAuthorTckTest.java:60)
Caused by: org.apache.maven.scm.ScmException: JGit checkout failure!
	at org.apache.maven.scm.provider.git.jgit.command.checkin.JGitCheckInCommandCommitterAuthorTckTest.setUp(JGitCheckInCommandCommitterAuthorTckTest.java:60)
Caused by: org.eclipse.jgit.api.errors.JGitInternalException: Exception caught during execution of fetch command
	at org.apache.maven.scm.provider.git.jgit.command.checkin.JGitCheckInCommandCommitterAuthorTckTest.setUp(JGitCheckInCommandCommitterAuthorTckTest.java:60)
Caused by: org.eclipse.jgit.errors.NotSupportedException: URI not supported: file://2/m/maven-scm-providers/maven-scm-providers-git/maven-scm-provider-jgit/target/scm-test/repository
	at org.apache.maven.scm.provider.git.jgit.command.checkin.JGitCheckInCommandCommitterAuthorTckTest.setUp(JGitCheckInCommandCommitterAuthorTckTest.java:60)


FAILED:  org.apache.maven.scm.provider.git.jgit.command.checkin.JGitCheckInCommandCommitterAuthorTckTest.testCheckInCommandPartialFileset

Error Message:
Exception while executing SCM command.

Stack Trace:
org.apache.maven.scm.ScmException: Exception while executing SCM command.
	at org.apache.maven.scm.provider.git.jgit.command.checkin.JGitCheckInCommandCommitterAuthorTckTest.setUp(JGitCheckInCommandCommitterAuthorTckTest.java:60)
Caused by: org.apache.maven.scm.ScmException: JGit checkout failure!
	at org.apache.maven.scm.provider.git.jgit.command.checkin.JGitCheckInCommandCommitterAuthorTckTest.setUp(JGitCheckInCommandCommitterAuthorTckTest.java:60)
Caused by: org.eclipse.jgit.api.errors.JGitInternalException: Exception caught during execution of fetch command
	at org.apache.maven.scm.provider.git.jgit.command.checkin.JGitCheckInCommandCommitterAuthorTckTest.setUp(JGitCheckInCommandCommitterAuthorTckTest.java:60)
Caused by: org.eclipse.jgit.errors.NotSupportedException: URI not supported: file://2/m/maven-scm-providers/maven-scm-providers-git/maven-scm-provider-jgit/target/scm-test/repository
	at org.apache.maven.scm.provider.git.jgit.command.checkin.JGitCheckInCommandCommitterAuthorTckTest.setUp(JGitCheckInCommandCommitterAuthorTckTest.java:60)


FAILED:  org.apache.maven.scm.provider.git.jgit.command.checkin.JGitCheckInCommandTckTest.testCheckInCommandTest

Error Message:
Exception while executing SCM command.

Stack Trace:
org.apache.maven.scm.ScmException: Exception while executing SCM command.
Caused by: org.apache.maven.scm.ScmException: JGit checkout failure!
Caused by: org.eclipse.jgit.api.errors.JGitInternalException: Exception caught during execution of fetch command
Caused by: org.eclipse.jgit.errors.NotSupportedException: URI not supported: file://2/m/maven-scm-providers/maven-scm-providers-git/maven-scm-provider-jgit/target/scm-test/repository


FAILED:  org.apache.maven.scm.provider.git.jgit.command.checkin.JGitCheckInCommandTckTest.testCheckInCommandPartialFileset

Error Message:
Exception while executing SCM command.

Stack Trace:
org.apache.maven.scm.ScmException: Exception while executing SCM command.
Caused by: org.apache.maven.scm.ScmException: JGit checkout failure!
Caused by: org.eclipse.jgit.api.errors.JGitInternalException: Exception caught during execution of fetch command
Caused by: org.eclipse.jgit.errors.NotSupportedException: URI not supported: file://2/m/maven-scm-providers/maven-scm-providers-git/maven-scm-provider-jgit/target/scm-test/repository


FAILED:  org.apache.maven.scm.provider.git.jgit.command.checkout.JGitCheckOutCommandTckTest.testCheckOutCommandTest

Error Message:
Exception while executing SCM command.

Stack Trace:
org.apache.maven.scm.ScmException: Exception while executing SCM command.
Caused by: org.apache.maven.scm.ScmException: JGit checkout failure!
Caused by: org.eclipse.jgit.api.errors.JGitInternalException: Exception caught during execution of fetch command
Caused by: org.eclipse.jgit.errors.NotSupportedException: URI not supported: file://2/m/maven-scm-providers/maven-scm-providers-git/maven-scm-provider-jgit/target/scm-test/repository


FAILED:  org.apache.maven.scm.provider.git.jgit.command.diff.JGitDiffCommandTckTest.testDiffCommand

Error Message:
Exception while executing SCM command.

Stack Trace:
org.apache.maven.scm.ScmException: Exception while executing SCM command.
Caused by: org.apache.maven.scm.ScmException: JGit checkout failure!
Caused by: org.eclipse.jgit.api.errors.JGitInternalException: Exception caught during execution of fetch command
Caused by: org.eclipse.jgit.errors.NotSupportedException: URI not supported: file://2/m/maven-scm-providers/maven-scm-providers-git/maven-scm-provider-jgit/target/scm-test/repository


FAILED:  org.apache.maven.scm.provider.git.jgit.command.remoteinfo.JGitRemoteInfoCommandTckTest.testRemoteInfoCommand

Error Message:
Exception while executing SCM command.

Stack Trace:
org.apache.maven.scm.ScmException: Exception while executing SCM command.
Caused by: org.apache.maven.scm.ScmException: JGit checkout failure!
Caused by: org.eclipse.jgit.api.errors.JGitInternalException: Exception caught during execution of fetch command
Caused by: org.eclipse.jgit.errors.NotSupportedException: URI not supported: file://2/m/maven-scm-providers/maven-scm-providers-git/maven-scm-provider-jgit/target/scm-test/repository


FAILED:  org.apache.maven.scm.provider.git.jgit.command.status.JGitStatusCommandTckTest.testStatusCommand

Error Message:
Exception while executing SCM command.

Stack Trace:
org.apache.maven.scm.ScmException: Exception while executing SCM command.
Caused by: org.apache.maven.scm.ScmException: JGit checkout failure!
Caused by: org.eclipse.jgit.api.errors.JGitInternalException: Exception caught during execution of fetch command
Caused by: org.eclipse.jgit.errors.NotSupportedException: URI not supported: file://2/m/maven-scm-providers/maven-scm-providers-git/maven-scm-provider-jgit/target/scm-test/repository


FAILED:  org.apache.maven.scm.provider.git.jgit.command.tag.JGitTagCommandTckTest.testTagCommandTest

Error Message:
Exception while executing SCM command.

Stack Trace:
org.apache.maven.scm.ScmException: Exception while executing SCM command.
Caused by: org.apache.maven.scm.ScmException: JGit checkout failure!
Caused by: org.eclipse.jgit.api.errors.JGitInternalException: Exception caught during execution of fetch command
Caused by: org.eclipse.jgit.errors.NotSupportedException: URI not supported: file://2/m/maven-scm-providers/maven-scm-providers-git/maven-scm-provider-jgit/target/scm-test/repository


FAILED:  org.apache.maven.scm.plugin.BranchMojoTest.testBranch

Error Message:
Command failed.The svn command failed.

Stack Trace:
org.apache.maven.plugin.MojoExecutionException: Command failed.The svn command failed.
	at org.apache.maven.scm.plugin.BranchMojoTest.setUp(BranchMojoTest.java:74)


FAILED:  org.apache.maven.scm.plugin.ChangeLogMojoTest.testChangeLogWithParameters

Error Message:
Command failed.The svn command failed.

Stack Trace:
org.apache.maven.plugin.MojoExecutionException: Command failed.The svn command failed.
	at org.apache.maven.scm.plugin.ChangeLogMojoTest.testChangeLogWithParameters(ChangeLogMojoTest.java:102)


FAILED:  org.apache.maven.scm.plugin.ChangeLogMojoTest.testChangeLog

Error Message:
Command failed.The svn command failed.

Stack Trace:
org.apache.maven.plugin.MojoExecutionException: Command failed.The svn command failed.
	at org.apache.maven.scm.plugin.ChangeLogMojoTest.testChangeLog(ChangeLogMojoTest.java:79)


FAILED:  org.apache.maven.scm.plugin.CheckoutMojoTest.testExcludeInclude

Error Message:
Command failed.The svn command failed.

Stack Trace:
org.apache.maven.plugin.MojoExecutionException: Command failed.The svn command failed.
	at org.apache.maven.scm.plugin.CheckoutMojoTest.testExcludeInclude(CheckoutMojoTest.java:153)


FAILED:  org.apache.maven.scm.plugin.CheckoutMojoTest.testUseExport

Error Message:
Command failed.The svn command failed.

Stack Trace:
org.apache.maven.plugin.MojoExecutionException: Command failed.The svn command failed.
	at org.apache.maven.scm.plugin.CheckoutMojoTest.testUseExport(CheckoutMojoTest.java:132)


FAILED:  org.apache.maven.scm.plugin.CheckoutMojoTest.testSkipCheckoutWithConnectionUrl

Error Message:
Command failed.The svn command failed.

Stack Trace:
org.apache.maven.plugin.MojoExecutionException: Command failed.The svn command failed.
	at org.apache.maven.scm.plugin.CheckoutMojoTest.testSkipCheckoutWithConnectionUrl(CheckoutMojoTest.java:96)


FAILED:  org.apache.maven.scm.plugin.ExportMojoTest.testExcludeInclude

Error Message:
Command failed.The svn command failed.

Stack Trace:
org.apache.maven.plugin.MojoExecutionException: Command failed.The svn command failed.
	at org.apache.maven.scm.plugin.ExportMojoTest.testExcludeInclude(ExportMojoTest.java:90)


FAILED:  org.apache.maven.scm.plugin.ExportMojoTest.testExport

Error Message:
Command failed.The svn command failed.

Stack Trace:
org.apache.maven.plugin.MojoExecutionException: Command failed.The svn command failed.
	at org.apache.maven.scm.plugin.ExportMojoTest.testExport(ExportMojoTest.java:55)


FAILED:  org.apache.maven.scm.plugin.TagMojoTest.testTag

Error Message:
Command failed.The svn command failed.

Stack Trace:
org.apache.maven.plugin.MojoExecutionException: Command failed.The svn command failed.
	at org.apache.maven.scm.plugin.TagMojoTest.setUp(TagMojoTest.java:74)


FAILED:  org.apache.maven.scm.plugin.TagMojoTest.testTagWithTimestamp

Error Message:
Command failed.The svn command failed.

Stack Trace:
org.apache.maven.plugin.MojoExecutionException: Command failed.The svn command failed.
	at org.apache.maven.scm.plugin.TagMojoTest.setUp(TagMojoTest.java:74)


FAILED:  org.apache.maven.scm.plugin.UpdateMojoTest.testSkipCheckoutWithConnectionUrl

Error Message:
Command failed.The svn command failed.

Stack Trace:
org.apache.maven.plugin.MojoExecutionException: Command failed.The svn command failed.
	at org.apache.maven.scm.plugin.UpdateMojoTest.testSkipCheckoutWithConnectionUrl(UpdateMojoTest.java:73)




Build log:
[...truncated 5.65 MB...]
[linux-jdk9] [INFO] Installing /home/jenkins/jenkins-slave/workspace/maven-wip_maven-scm_master-ADXNUB4JTUUV5E57KMRFZSZVGMFJJBVMKSOJS62JASEIC2763EUQ/m/maven-scm-client/pom.xml to /home/jenkins/jenkins-slave/workspace/maven-wip_maven-scm_master-ADXNUB4JTUUV5E57KMRFZSZVGMFJJBVMKSOJS62JASEIC2763EUQ/m/maven-scm-plugin/target/local-repo/org/apache/maven/scm/maven-scm-client/1.9.6-SNAPSHOT/maven-scm-client-1.9.6-SNAPSHOT.pom
[linux-jdk9] [INFO] Installing /home/jenkins/jenkins-slave/workspace/maven-wip_maven-scm_master-ADXNUB4JTUUV5E57KMRFZSZVGMFJJBVMKSOJS62JASEIC2763EUQ/m/maven-scm-client/target/maven-scm-client-1.9.6-SNAPSHOT.jar to /home/jenkins/jenkins-slave/workspace/maven-wip_maven-scm_master-ADXNUB4JTUUV5E57KMRFZSZVGMFJJBVMKSOJS62JASEIC2763EUQ/m/maven-scm-plugin/target/local-repo/org/apache/maven/scm/maven-scm-client/1.9.6-SNAPSHOT/maven-scm-client-1.9.6-SNAPSHOT.jar
[linux-jdk9] [INFO] Installing /home/jenkins/jenkins-slave/workspace/maven-wip_maven-scm_master-ADXNUB4JTUUV5E57KMRFZSZVGMFJJBVMKSOJS62JASEIC2763EUQ/m/maven-scm-client/target/maven-scm-client-1.9.6-SNAPSHOT-jar-with-dependencies.jar to /home/jenkins/jenkins-slave/workspace/maven-wip_maven-scm_master-ADXNUB4JTUUV5E57KMRFZSZVGMFJJBVMKSOJS62JASEIC2763EUQ/m/maven-scm-plugin/target/local-repo/org/apache/maven/scm/maven-scm-client/1.9.6-SNAPSHOT/maven-scm-client-1.9.6-SNAPSHOT-jar-with-dependencies.jar
[linux-jdk9] [INFO] Installing /home/jenkins/jenkins-slave/workspace/maven-wip_maven-scm_master-ADXNUB4JTUUV5E57KMRFZSZVGMFJJBVMKSOJS62JASEIC2763EUQ/m/maven-scm-plugin/pom.xml to /home/jenkins/jenkins-slave/workspace/maven-wip_maven-scm_master-ADXNUB4JTUUV5E57KMRFZSZVGMFJJBVMKSOJS62JASEIC2763EUQ/m/maven-scm-plugin/target/local-repo/org/apache/maven/plugins/maven-scm-plugin/1.9.6-SNAPSHOT/maven-scm-plugin-1.9.6-SNAPSHOT.pom
[linux-jdk9] [INFO] Installing /home/jenkins/jenkins-slave/workspace/maven-wip_maven-scm_master-ADXNUB4JTUUV5E57KMRFZSZVGMFJJBVMKSOJS62JASEIC2763EUQ/m/maven-scm-plugin/target/maven-scm-plugin-1.9.6-SNAPSHOT.jar to /home/jenkins/jenkins-slave/workspace/maven-wip_maven-scm_master-ADXNUB4JTUUV5E57KMRFZSZVGMFJJBVMKSOJS62JASEIC2763EUQ/m/maven-scm-plugin/target/local-repo/org/apache/maven/plugins/maven-scm-plugin/1.9.6-SNAPSHOT/maven-scm-plugin-1.9.6-SNAPSHOT.jar
[linux-jdk9] [jenkins-maven-event-spy] INFO start of goal org.apache.maven.plugins:maven-invoker-plugin:run, disabling spy in IT tests.
[linux-jdk9] [INFO] 
[linux-jdk9] [INFO] --- maven-invoker-plugin:2.0.0:run (integration-test) @ maven-scm-plugin ---
[linux-jdk9] [INFO] No projects were selected for execution.
[linux-jdk9] [INFO] 
[linux-jdk9] [INFO] --- maven-checkstyle-plugin:2.15:check (checkstyle-check) @ maven-scm-plugin ---
[linux-jdk9] [INFO] There are 5 errors reported by Checkstyle 6.1.1 with config/maven_checks.xml ruleset.
[linux-jdk9] [ERROR] src/main/java/org/apache/maven/scm/plugin/BootstrapMojo.java[3] (header) RegexpHeader: Line does not match expected header line of '^/\*\s*$'.
[linux-jdk9] [ERROR] src/main/java/org/apache/maven/scm/plugin/BootstrapMojo.java[72:53] (whitespace) WhitespaceAround: '=' is not preceded with whitespace.
[linux-jdk9] [ERROR] src/main/java/org/apache/maven/scm/plugin/BootstrapMojo.java[72:54] (whitespace) WhitespaceAround: '=' is not followed by whitespace.
[linux-jdk9] [ERROR] src/main/java/org/apache/maven/scm/plugin/BootstrapMojo.java[72:69] (whitespace) ParenPad: ')' is not preceded with whitespace.
[linux-jdk9] [ERROR] src/main/java/org/apache/maven/scm/plugin/BootstrapMojo.java[120:39] (whitespace) WhitespaceAfter: ';' is not followed by whitespace.
[linux-jdk9] [WARNING] checkstyle:check violations detected but failOnViolation set to false
[linux-jdk9] [INFO] ------------------------------------------------------------------------
[linux-jdk9] [INFO] Reactor Summary:
[linux-jdk9] [INFO] 
[linux-jdk9] [INFO] Maven SCM .......................................... SUCCESS [ 13.971 s]
[linux-jdk9] [INFO] Maven SCM API ...................................... SUCCESS [  6.985 s]
[linux-jdk9] [INFO] Maven SCM Managers ................................. SUCCESS [  0.685 s]
[linux-jdk9] [INFO] Maven SCM Manager for Plexus ....................... SUCCESS [  1.701 s]
[linux-jdk9] [INFO] Maven SCM Test ..................................... SUCCESS [  2.704 s]
[linux-jdk9] [INFO] Maven SCM Providers ................................ SUCCESS [  0.901 s]
[linux-jdk9] [INFO] Maven SCM AccuRev Provider ......................... SUCCESS [  6.095 s]
[linux-jdk9] [INFO] Maven SCM Bazaar Provider .......................... SUCCESS [  2.781 s]
[linux-jdk9] [INFO] Maven SCM Clearcase Provider ....................... SUCCESS [  4.552 s]
[linux-jdk9] [INFO] Maven SCM CVS Provider - Parent .................... SUCCESS [  0.640 s]
[linux-jdk9] [INFO] Maven SCM CVS Provider TCK tests ................... SUCCESS [  1.109 s]
[linux-jdk9] [INFO] Maven SCM CVS Provider - Common library ............ SUCCESS [  3.029 s]
[linux-jdk9] [INFO] Maven SCM CVS Provider - CVS Executable Impl. ...... SUCCESS [  2.367 s]
[linux-jdk9] [INFO] Maven SCM CVS Provider - CVS Java Impl. ............ SUCCESS [  2.532 s]
[linux-jdk9] [INFO] Maven SCM Mercurial (Hg) Provider .................. SUCCESS [  2.189 s]
[linux-jdk9] [INFO] Maven SCM Git Provider - Parent .................... SUCCESS [  0.654 s]
[linux-jdk9] [INFO] Maven SCM Git Provider - Common library ............ SUCCESS [  2.488 s]
[linux-jdk9] [INFO] Maven SCM Git Provider TCK Tests ................... SUCCESS [  0.860 s]
[linux-jdk9] [INFO] Maven SCM Git Provider - Git Executable Impl. ...... SUCCESS [  4.323 s]
[linux-jdk9] [INFO] Maven SCM Git Provider - JGit Impl. ................ SUCCESS [ 29.407 s]
[linux-jdk9] [INFO] Maven SCM Local Provider ........................... SUCCESS [  2.289 s]
[linux-jdk9] [INFO] Maven SCM Perforce Provider ........................ SUCCESS [  3.231 s]
[linux-jdk9] [INFO] Maven SCM Starteam Provider ........................ SUCCESS [  4.790 s]
[linux-jdk9] [INFO] Maven SCM Subversion Provider - Parent ............. SUCCESS [  0.591 s]
[linux-jdk9] [INFO] Maven SCM Subversion Provider - Common library ..... SUCCESS [  2.486 s]
[linux-jdk9] [INFO] Maven SCM Subversion Provider TCK Tests ............ SUCCESS [  0.867 s]
[linux-jdk9] [INFO] Maven SCM Subversion Provider - SVN Executable Impl. SUCCESS [  4.109 s]
[linux-jdk9] [INFO] Maven SCM Synergy Provider ......................... SUCCESS [  2.966 s]
[linux-jdk9] [INFO] Maven SCM Visual Source Safe Provider .............. SUCCESS [  3.479 s]
[linux-jdk9] [INFO] Maven SCM TFS Provider ............................. SUCCESS [  2.508 s]
[linux-jdk9] [INFO] Maven SCM MKS Integrity Provider ................... SUCCESS [  3.086 s]
[linux-jdk9] [INFO] Maven SCM Jazz/Rational Team Concert Provider ...... SUCCESS [  3.382 s]
[linux-jdk9] [INFO] Maven SCM Standard Providers ....................... SUCCESS [  1.817 s]
[linux-jdk9] [INFO] Maven SCM Client ................................... SUCCESS [  3.749 s]
[linux-jdk9] [INFO] Maven SCM Plugin ................................... SUCCESS [ 50.038 s]
[linux-jdk9] [INFO] ------------------------------------------------------------------------
[linux-jdk9] [INFO] BUILD SUCCESS
[linux-jdk9] [INFO] ------------------------------------------------------------------------
[linux-jdk9] [INFO] Total time: 03:01 min
[linux-jdk9] [INFO] Finished at: 2017-11-29T23:03:18Z
[linux-jdk9] [INFO] Final Memory: 69M/224M
[linux-jdk9] [INFO] ------------------------------------------------------------------------
[linux-jdk9] [jenkins-maven-event-spy] INFO generated /home/jenkins/jenkins-slave/workspace/maven-wip_maven-scm_master-ADXNUB4JTUUV5E57KMRFZSZVGMFJJBVMKSOJS62JASEIC2763EUQ@tmp/withMaven131b54e5/maven-spy-20171129-230017-151023795365099003980.log
[Pipeline] [linux-jdk9] }
[Pipeline] [linux-jdk9] // dir
[Pipeline] [linux-jdk9] }
[linux-jdk9] [withMaven] artifactsPublisher - Archive artifact m/pom.xml under org/apache/maven/scm/maven-scm/1.9.6-SNAPSHOT/maven-scm-1.9.6-SNAPSHOT.pom
[linux-jdk9] [withMaven] artifactsPublisher - Archive artifact m/maven-scm-api/pom.xml under org/apache/maven/scm/maven-scm-api/1.9.6-SNAPSHOT/maven-scm-api-1.9.6-SNAPSHOT.pom
[linux-jdk9] [withMaven] artifactsPublisher - Archive artifact m/maven-scm-api/target/maven-scm-api-1.9.6-SNAPSHOT.jar under org/apache/maven/scm/maven-scm-api/1.9.6-SNAPSHOT/maven-scm-api-1.9.6-SNAPSHOT.jar
[linux-jdk9] [withMaven] artifactsPublisher - Archive artifact m/maven-scm-managers/pom.xml under org/apache/maven/scm/maven-scm-managers/1.9.6-SNAPSHOT/maven-scm-managers-1.9.6-SNAPSHOT.pom
[linux-jdk9] [withMaven] artifactsPublisher - Archive artifact m/maven-scm-managers/maven-scm-manager-plexus/pom.xml under org/apache/maven/scm/maven-scm-manager-plexus/1.9.6-SNAPSHOT/maven-scm-manager-plexus-1.9.6-SNAPSHOT.pom
[linux-jdk9] [withMaven] artifactsPublisher - Archive artifact m/maven-scm-managers/maven-scm-manager-plexus/target/maven-scm-manager-plexus-1.9.6-SNAPSHOT.jar under org/apache/maven/scm/maven-scm-manager-plexus/1.9.6-SNAPSHOT/maven-scm-manager-plexus-1.9.6-SNAPSHOT.jar
[linux-jdk9] [withMaven] artifactsPublisher - Archive artifact m/maven-scm-test/pom.xml under org/apache/maven/scm/maven-scm-test/1.9.6-SNAPSHOT/maven-scm-test-1.9.6-SNAPSHOT.pom
[linux-jdk9] [withMaven] artifactsPublisher - Archive artifact m/maven-scm-test/target/maven-scm-test-1.9.6-SNAPSHOT.jar under org/apache/maven/scm/maven-scm-test/1.9.6-SNAPSHOT/maven-scm-test-1.9.6-SNAPSHOT.jar
[linux-jdk9] [withMaven] artifactsPublisher - Archive artifact m/maven-scm-providers/pom.xml under org/apache/maven/scm/maven-scm-providers/1.9.6-SNAPSHOT/maven-scm-providers-1.9.6-SNAPSHOT.pom
[linux-jdk9] [withMaven] artifactsPublisher - Archive artifact m/maven-scm-providers/maven-scm-provider-accurev/pom.xml under org/apache/maven/scm/maven-scm-provider-accurev/1.9.6-SNAPSHOT/maven-scm-provider-accurev-1.9.6-SNAPSHOT.pom
[linux-jdk9] [withMaven] artifactsPublisher - Archive artifact m/maven-scm-providers/maven-scm-provider-accurev/target/maven-scm-provider-accurev-1.9.6-SNAPSHOT.jar under org/apache/maven/scm/maven-scm-provider-accurev/1.9.6-SNAPSHOT/maven-scm-provider-accurev-1.9.6-SNAPSHOT.jar
[linux-jdk9] [withMaven] artifactsPublisher - Archive artifact m/maven-scm-providers/maven-scm-provider-bazaar/pom.xml under org/apache/maven/scm/maven-scm-provider-bazaar/1.9.6-SNAPSHOT/maven-scm-provider-bazaar-1.9.6-SNAPSHOT.pom
[linux-jdk9] [withMaven] artifactsPublisher - Archive artifact m/maven-scm-providers/maven-scm-provider-bazaar/target/maven-scm-provider-bazaar-1.9.6-SNAPSHOT.jar under org/apache/maven/scm/maven-scm-provider-bazaar/1.9.6-SNAPSHOT/maven-scm-provider-bazaar-1.9.6-SNAPSHOT.jar
[linux-jdk9] [withMaven] artifactsPublisher - Archive artifact m/maven-scm-providers/maven-scm-provider-clearcase/pom.xml under org/apache/maven/scm/maven-scm-provider-clearcase/1.9.6-SNAPSHOT/maven-scm-provider-clearcase-1.9.6-SNAPSHOT.pom
[linux-jdk9] [withMaven] artifactsPublisher - Archive artifact m/maven-scm-providers/maven-scm-provider-clearcase/target/maven-scm-provider-clearcase-1.9.6-SNAPSHOT.jar under org/apache/maven/scm/maven-scm-provider-clearcase/1.9.6-SNAPSHOT/maven-scm-provider-clearcase-1.9.6-SNAPSHOT.jar
[linux-jdk9] [withMaven] artifactsPublisher - Archive artifact m/maven-scm-providers/maven-scm-providers-cvs/pom.xml under org/apache/maven/scm/maven-scm-providers-cvs/1.9.6-SNAPSHOT/maven-scm-providers-cvs-1.9.6-SNAPSHOT.pom
[linux-jdk9] [withMaven] artifactsPublisher - Archive artifact m/maven-scm-providers/maven-scm-providers-cvs/maven-scm-provider-cvstest/pom.xml under org/apache/maven/scm/maven-scm-provider-cvstest/1.9.6-SNAPSHOT/maven-scm-provider-cvstest-1.9.6-SNAPSHOT.pom
[linux-jdk9] [withMaven] artifactsPublisher - Archive artifact m/maven-scm-providers/maven-scm-providers-cvs/maven-scm-provider-cvstest/target/maven-scm-provider-cvstest-1.9.6-SNAPSHOT.jar under org/apache/maven/scm/maven-scm-provider-cvstest/1.9.6-SNAPSHOT/maven-scm-provider-cvstest-1.9.6-SNAPSHOT.jar
[linux-jdk9] [withMaven] artifactsPublisher - Archive artifact m/maven-scm-providers/maven-scm-providers-cvs/maven-scm-provider-cvs-commons/pom.xml under org/apache/maven/scm/maven-scm-provider-cvs-commons/1.9.6-SNAPSHOT/maven-scm-provider-cvs-commons-1.9.6-SNAPSHOT.pom
[linux-jdk9] [withMaven] artifactsPublisher - Archive artifact m/maven-scm-providers/maven-scm-providers-cvs/maven-scm-provider-cvs-commons/target/maven-scm-provider-cvs-commons-1.9.6-SNAPSHOT.jar under org/apache/maven/scm/maven-scm-provider-cvs-commons/1.9.6-SNAPSHOT/maven-scm-provider-cvs-commons-1.9.6-SNAPSHOT.jar
[linux-jdk9] [withMaven] artifactsPublisher - Archive artifact m/maven-scm-providers/maven-scm-providers-cvs/maven-scm-provider-cvsexe/pom.xml under org/apache/maven/scm/maven-scm-provider-cvsexe/1.9.6-SNAPSHOT/maven-scm-provider-cvsexe-1.9.6-SNAPSHOT.pom
[linux-jdk9] [withMaven] artifactsPublisher - Archive artifact m/maven-scm-providers/maven-scm-providers-cvs/maven-scm-provider-cvsexe/target/maven-scm-provider-cvsexe-1.9.6-SNAPSHOT.jar under org/apache/maven/scm/maven-scm-provider-cvsexe/1.9.6-SNAPSHOT/maven-scm-provider-cvsexe-1.9.6-SNAPSHOT.jar
[linux-jdk9] [withMaven] artifactsPublisher - Archive artifact m/maven-scm-providers/maven-scm-providers-cvs/maven-scm-provider-cvsjava/pom.xml under org/apache/maven/scm/maven-scm-provider-cvsjava/1.9.6-SNAPSHOT/maven-scm-provider-cvsjava-1.9.6-SNAPSHOT.pom
[linux-jdk9] [withMaven] artifactsPublisher - Archive artifact m/maven-scm-providers/maven-scm-providers-cvs/maven-scm-provider-cvsjava/target/maven-scm-provider-cvsjava-1.9.6-SNAPSHOT.jar under org/apache/maven/scm/maven-scm-provider-cvsjava/1.9.6-SNAPSHOT/maven-scm-provider-cvsjava-1.9.6-SNAPSHOT.jar
[linux-jdk9] [withMaven] artifactsPublisher - Archive artifact m/maven-scm-providers/maven-scm-provider-hg/pom.xml under org/apache/maven/scm/maven-scm-provider-hg/1.9.6-SNAPSHOT/maven-scm-provider-hg-1.9.6-SNAPSHOT.pom
[linux-jdk9] [withMaven] artifactsPublisher - Archive artifact m/maven-scm-providers/maven-scm-provider-hg/target/maven-scm-provider-hg-1.9.6-SNAPSHOT.jar under org/apache/maven/scm/maven-scm-provider-hg/1.9.6-SNAPSHOT/maven-scm-provider-hg-1.9.6-SNAPSHOT.jar
[linux-jdk9] [withMaven] artifactsPublisher - Archive artifact m/maven-scm-providers/maven-scm-providers-git/pom.xml under org/apache/maven/scm/maven-scm-providers-git/1.9.6-SNAPSHOT/maven-scm-providers-git-1.9.6-SNAPSHOT.pom
[linux-jdk9] [withMaven] artifactsPublisher - Archive artifact m/maven-scm-providers/maven-scm-providers-git/maven-scm-provider-git-commons/pom.xml under org/apache/maven/scm/maven-scm-provider-git-commons/1.9.6-SNAPSHOT/maven-scm-provider-git-commons-1.9.6-SNAPSHOT.pom
[linux-jdk9] [withMaven] artifactsPublisher - Archive artifact m/maven-scm-providers/maven-scm-providers-git/maven-scm-provider-git-commons/target/maven-scm-provider-git-commons-1.9.6-SNAPSHOT.jar under org/apache/maven/scm/maven-scm-provider-git-commons/1.9.6-SNAPSHOT/maven-scm-provider-git-commons-1.9.6-SNAPSHOT.jar
[linux-jdk9] [withMaven] artifactsPublisher - Archive artifact m/maven-scm-providers/maven-scm-providers-git/maven-scm-provider-gittest/pom.xml under org/apache/maven/scm/maven-scm-provider-gittest/1.9.6-SNAPSHOT/maven-scm-provider-gittest-1.9.6-SNAPSHOT.pom
[linux-jdk9] [withMaven] artifactsPublisher - Archive artifact m/maven-scm-providers/maven-scm-providers-git/maven-scm-provider-gittest/target/maven-scm-provider-gittest-1.9.6-SNAPSHOT.jar under org/apache/maven/scm/maven-scm-provider-gittest/1.9.6-SNAPSHOT/maven-scm-provider-gittest-1.9.6-SNAPSHOT.jar
[linux-jdk9] [withMaven] artifactsPublisher - Archive artifact m/maven-scm-providers/maven-scm-providers-git/maven-scm-provider-gitexe/pom.xml under org/apache/maven/scm/maven-scm-provider-gitexe/1.9.6-SNAPSHOT/maven-scm-provider-gitexe-1.9.6-SNAPSHOT.pom
[linux-jdk9] [withMaven] artifactsPublisher - Archive artifact m/maven-scm-providers/maven-scm-providers-git/maven-scm-provider-gitexe/target/maven-scm-provider-gitexe-1.9.6-SNAPSHOT.jar under org/apache/maven/scm/maven-scm-provider-gitexe/1.9.6-SNAPSHOT/maven-scm-provider-gitexe-1.9.6-SNAPSHOT.jar
[linux-jdk9] [withMaven] artifactsPublisher - Archive artifact m/maven-scm-providers/maven-scm-providers-git/maven-scm-provider-jgit/pom.xml under org/apache/maven/scm/maven-scm-provider-jgit/1.9.6-SNAPSHOT/maven-scm-provider-jgit-1.9.6-SNAPSHOT.pom
[linux-jdk9] [withMaven] artifactsPublisher - Archive artifact m/maven-scm-providers/maven-scm-providers-git/maven-scm-provider-jgit/target/maven-scm-provider-jgit-1.9.6-SNAPSHOT.jar under org/apache/maven/scm/maven-scm-provider-jgit/1.9.6-SNAPSHOT/maven-scm-provider-jgit-1.9.6-SNAPSHOT.jar
[linux-jdk9] [withMaven] artifactsPublisher - Archive artifact m/maven-scm-providers/maven-scm-provider-local/pom.xml under org/apache/maven/scm/maven-scm-provider-local/1.9.6-SNAPSHOT/maven-scm-provider-local-1.9.6-SNAPSHOT.pom
[linux-jdk9] [withMaven] artifactsPublisher - Archive artifact m/maven-scm-providers/maven-scm-provider-local/target/maven-scm-provider-local-1.9.6-SNAPSHOT.jar under org/apache/maven/scm/maven-scm-provider-local/1.9.6-SNAPSHOT/maven-scm-provider-local-1.9.6-SNAPSHOT.jar
[linux-jdk9] [withMaven] artifactsPublisher - Archive artifact m/maven-scm-providers/maven-scm-provider-perforce/pom.xml under org/apache/maven/scm/maven-scm-provider-perforce/1.9.6-SNAPSHOT/maven-scm-provider-perforce-1.9.6-SNAPSHOT.pom
[linux-jdk9] [withMaven] artifactsPublisher - Archive artifact m/maven-scm-providers/maven-scm-provider-perforce/target/maven-scm-provider-perforce-1.9.6-SNAPSHOT.jar under org/apache/maven/scm/maven-scm-provider-perforce/1.9.6-SNAPSHOT/maven-scm-provider-perforce-1.9.6-SNAPSHOT.jar
[linux-jdk9] [withMaven] artifactsPublisher - Archive artifact m/maven-scm-providers/maven-scm-provider-starteam/pom.xml under org/apache/maven/scm/maven-scm-provider-starteam/1.9.6-SNAPSHOT/maven-scm-provider-starteam-1.9.6-SNAPSHOT.pom
[linux-jdk9] [withMaven] artifactsPublisher - Archive artifact m/maven-scm-providers/maven-scm-provider-starteam/target/maven-scm-provider-starteam-1.9.6-SNAPSHOT.jar under org/apache/maven/scm/maven-scm-provider-starteam/1.9.6-SNAPSHOT/maven-scm-provider-starteam-1.9.6-SNAPSHOT.jar
[linux-jdk9] [withMaven] artifactsPublisher - Archive artifact m/maven-scm-providers/maven-scm-providers-svn/pom.xml under org/apache/maven/scm/maven-scm-providers-svn/1.9.6-SNAPSHOT/maven-scm-providers-svn-1.9.6-SNAPSHOT.pom
[linux-jdk9] [withMaven] artifactsPublisher - Archive artifact m/maven-scm-providers/maven-scm-providers-svn/maven-scm-provider-svn-commons/pom.xml under org/apache/maven/scm/maven-scm-provider-svn-commons/1.9.6-SNAPSHOT/maven-scm-provider-svn-commons-1.9.6-SNAPSHOT.pom
[linux-jdk9] [withMaven] artifactsPublisher - Archive artifact m/maven-scm-providers/maven-scm-providers-svn/maven-scm-provider-svn-commons/target/maven-scm-provider-svn-commons-1.9.6-SNAPSHOT.jar under org/apache/maven/scm/maven-scm-provider-svn-commons/1.9.6-SNAPSHOT/maven-scm-provider-svn-commons-1.9.6-SNAPSHOT.jar
[linux-jdk9] [withMaven] artifactsPublisher - Archive artifact m/maven-scm-providers/maven-scm-providers-svn/maven-scm-provider-svntest/pom.xml under org/apache/maven/scm/maven-scm-provider-svntest/1.9.6-SNAPSHOT/maven-scm-provider-svntest-1.9.6-SNAPSHOT.pom
[linux-jdk9] [withMaven] artifactsPublisher - Archive artifact m/maven-scm-providers/maven-scm-providers-svn/maven-scm-provider-svntest/target/maven-scm-provider-svntest-1.9.6-SNAPSHOT.jar under org/apache/maven/scm/maven-scm-provider-svntest/1.9.6-SNAPSHOT/maven-scm-provider-svntest-1.9.6-SNAPSHOT.jar
[linux-jdk9] [withMaven] artifactsPublisher - Archive artifact m/maven-scm-providers/maven-scm-providers-svn/maven-scm-provider-svnexe/pom.xml under org/apache/maven/scm/maven-scm-provider-svnexe/1.9.6-SNAPSHOT/maven-scm-provider-svnexe-1.9.6-SNAPSHOT.pom
[linux-jdk9] [withMaven] artifactsPublisher - Archive artifact m/maven-scm-providers/maven-scm-providers-svn/maven-scm-provider-svnexe/target/maven-scm-provider-svnexe-1.9.6-SNAPSHOT.jar under org/apache/maven/scm/maven-scm-provider-svnexe/1.9.6-SNAPSHOT/maven-scm-provider-svnexe-1.9.6-SNAPSHOT.jar
[linux-jdk9] [withMaven] artifactsPublisher - Archive artifact m/maven-scm-providers/maven-scm-provider-synergy/pom.xml under org/apache/maven/scm/maven-scm-provider-synergy/1.9.6-SNAPSHOT/maven-scm-provider-synergy-1.9.6-SNAPSHOT.pom
[linux-jdk9] [withMaven] artifactsPublisher - Archive artifact m/maven-scm-providers/maven-scm-provider-synergy/target/maven-scm-provider-synergy-1.9.6-SNAPSHOT.jar under org/apache/maven/scm/maven-scm-provider-synergy/1.9.6-SNAPSHOT/maven-scm-provider-synergy-1.9.6-SNAPSHOT.jar
[linux-jdk9] [withMaven] artifactsPublisher - Archive artifact m/maven-scm-providers/maven-scm-provider-vss/pom.xml under org/apache/maven/scm/maven-scm-provider-vss/1.9.6-SNAPSHOT/maven-scm-provider-vss-1.9.6-SNAPSHOT.pom
[linux-jdk9] [withMaven] artifactsPublisher - Archive artifact m/maven-scm-providers/maven-scm-provider-vss/target/maven-scm-provider-vss-1.9.6-SNAPSHOT.jar under org/apache/maven/scm/maven-scm-provider-vss/1.9.6-SNAPSHOT/maven-scm-provider-vss-1.9.6-SNAPSHOT.jar
[linux-jdk9] [withMaven] artifactsPublisher - Archive artifact m/maven-scm-providers/maven-scm-provider-tfs/pom.xml under org/apache/maven/scm/maven-scm-provider-tfs/1.9.6-SNAPSHOT/maven-scm-provider-tfs-1.9.6-SNAPSHOT.pom
[linux-jdk9] [withMaven] artifactsPublisher - Archive artifact m/maven-scm-providers/maven-scm-provider-tfs/target/maven-scm-provider-tfs-1.9.6-SNAPSHOT.jar under org/apache/maven/scm/maven-scm-provider-tfs/1.9.6-SNAPSHOT/maven-scm-provider-tfs-1.9.6-SNAPSHOT.jar
[linux-jdk9] [withMaven] artifactsPublisher - Archive artifact m/maven-scm-providers/maven-scm-provider-integrity/pom.xml under org/apache/maven/scm/maven-scm-provider-integrity/1.9.6-SNAPSHOT/maven-scm-provider-integrity-1.9.6-SNAPSHOT.pom
[linux-jdk9] [withMaven] artifactsPublisher - Archive artifact m/maven-scm-providers/maven-scm-provider-integrity/target/maven-scm-provider-integrity-1.9.6-SNAPSHOT.jar under org/apache/maven/scm/maven-scm-provider-integrity/1.9.6-SNAPSHOT/maven-scm-provider-integrity-1.9.6-SNAPSHOT.jar
[linux-jdk9] [withMaven] artifactsPublisher - Archive artifact m/maven-scm-providers/maven-scm-provider-jazz/pom.xml under org/apache/maven/scm/maven-scm-provider-jazz/1.9.6-SNAPSHOT/maven-scm-provider-jazz-1.9.6-SNAPSHOT.pom
[linux-jdk9] [withMaven] artifactsPublisher - Archive artifact m/maven-scm-providers/maven-scm-provider-jazz/target/maven-scm-provider-jazz-1.9.6-SNAPSHOT.jar under org/apache/maven/scm/maven-scm-provider-jazz/1.9.6-SNAPSHOT/maven-scm-provider-jazz-1.9.6-SNAPSHOT.jar
[linux-jdk9] [withMaven] artifactsPublisher - Archive artifact m/maven-scm-providers/maven-scm-providers-standard/pom.xml under org/apache/maven/scm/maven-scm-providers-standard/1.9.6-SNAPSHOT/maven-scm-providers-standard-1.9.6-SNAPSHOT.pom
[linux-jdk9] [withMaven] artifactsPublisher - Archive artifact m/maven-scm-client/pom.xml under org/apache/maven/scm/maven-scm-client/1.9.6-SNAPSHOT/maven-scm-client-1.9.6-SNAPSHOT.pom
[linux-jdk9] [withMaven] artifactsPublisher - Archive artifact m/maven-scm-client/target/maven-scm-client-1.9.6-SNAPSHOT.jar under org/apache/maven/scm/maven-scm-client/1.9.6-SNAPSHOT/maven-scm-client-1.9.6-SNAPSHOT.jar
[linux-jdk9] [withMaven] artifactsPublisher - Archive artifact m/maven-scm-plugin/pom.xml under org/apache/maven/plugins/maven-scm-plugin/1.9.6-SNAPSHOT/maven-scm-plugin-1.9.6-SNAPSHOT.pom
[linux-jdk9] [withMaven] artifactsPublisher - Archive artifact m/maven-scm-plugin/target/maven-scm-plugin-1.9.6-SNAPSHOT.jar under org/apache/maven/plugins/maven-scm-plugin/1.9.6-SNAPSHOT/maven-scm-plugin-1.9.6-SNAPSHOT.jar
[linux-jdk9] [withMaven] artifactsPublisher - Archive artifact m/target/maven-scm-1.9.6-SNAPSHOT-site.xml under org/apache/maven/scm/maven-scm/1.9.6-SNAPSHOT/maven-scm-1.9.6-SNAPSHOT-site.xml
[linux-jdk9] [withMaven] artifactsPublisher - Archive artifact m/maven-scm-managers/target/maven-scm-managers-1.9.6-SNAPSHOT-site.xml under org/apache/maven/scm/maven-scm-managers/1.9.6-SNAPSHOT/maven-scm-managers-1.9.6-SNAPSHOT-site.xml
[linux-jdk9] [withMaven] artifactsPublisher - Archive artifact m/maven-scm-providers/target/maven-scm-providers-1.9.6-SNAPSHOT-site.xml under org/apache/maven/scm/maven-scm-providers/1.9.6-SNAPSHOT/maven-scm-providers-1.9.6-SNAPSHOT-site.xml
[linux-jdk9] [withMaven] artifactsPublisher - Archive artifact m/maven-scm-providers/maven-scm-providers-cvs/target/maven-scm-providers-cvs-1.9.6-SNAPSHOT-site.xml under org/apache/maven/scm/maven-scm-providers-cvs/1.9.6-SNAPSHOT/maven-scm-providers-cvs-1.9.6-SNAPSHOT-site.xml
[linux-jdk9] [withMaven] artifactsPublisher - Archive artifact m/maven-scm-providers/maven-scm-providers-git/target/maven-scm-providers-git-1.9.6-SNAPSHOT-site.xml under org/apache/maven/scm/maven-scm-providers-git/1.9.6-SNAPSHOT/maven-scm-providers-git-1.9.6-SNAPSHOT-site.xml
[linux-jdk9] [withMaven] artifactsPublisher - Archive artifact m/maven-scm-providers/maven-scm-providers-svn/target/maven-scm-providers-svn-1.9.6-SNAPSHOT-site.xml under org/apache/maven/scm/maven-scm-providers-svn/1.9.6-SNAPSHOT/maven-scm-providers-svn-1.9.6-SNAPSHOT-site.xml
[linux-jdk9] [withMaven] artifactsPublisher - Archive artifact m/maven-scm-client/target/maven-scm-client-1.9.6-SNAPSHOT-jar-with-dependencies.jar under org/apache/maven/scm/maven-scm-client/1.9.6-SNAPSHOT/maven-scm-client-1.9.6-SNAPSHOT-jar-with-dependencies.jar
[linux-jdk9] [Fast Archiver] No prior successful build to compare, so performing full copy of artifacts
[linux-jdk9] [withMaven] invokerPublisher - Archive invoker results for Maven artifact MavenArtifact{org.apache.maven.plugins:maven-scm-plugin::1.9.6-SNAPSHOT(version: 1.9.6-SNAPSHOT, snapshot:false) } generated by PluginInvocation{org.apache.maven.plugins:maven-invoker-plugin:2.0.0@run  integration-test}: m/maven-scm-plugin/target/invoker-reports/*.xml
[linux-jdk9] performing MavenInvokerRecorder, reportsFilenamePattern:'**/m/maven-scm-plugin/target/invoker-reports/BUILD*.xml', invokerBuildDir:'**/m/maven-scm-plugin/target/it'
[linux-jdk9] Found reports:[]
[linux-jdk9] Found logs:[]
[linux-jdk9] Finished parsing Maven Invoker results (found 0)
[linux-jdk9] [withMaven] junitPublisher - Archive test results for Maven artifact org.apache.maven.scm:maven-scm-api:1.9.6-SNAPSHOT generated by maven-surefire-plugin:test (default-test): m/maven-scm-api/target/surefire-reports/*.xml
[linux-jdk9] [withMaven] junitPublisher - Jenkins JUnit Attachments Plugin not found, can't publish test attachments.Recording test results
[linux-jdk9] [withMaven] junitPublisher - Archive test results for Maven artifact org.apache.maven.scm:maven-scm-manager-plexus:1.9.6-SNAPSHOT generated by maven-surefire-plugin:test (default-test): m/maven-scm-managers/maven-scm-manager-plexus/target/surefire-reports/*.xml
[linux-jdk9] [withMaven] junitPublisher - Jenkins JUnit Attachments Plugin not found, can't publish test attachments.Recording test results
[linux-jdk9] None of the test reports contained any result
[linux-jdk9] [withMaven] junitPublisher - Archive test results for Maven artifact org.apache.maven.scm:maven-scm-test:1.9.6-SNAPSHOT generated by maven-surefire-plugin:test (default-test): m/maven-scm-test/target/surefire-reports/*.xml
[linux-jdk9] [withMaven] junitPublisher - Jenkins JUnit Attachments Plugin not found, can't publish test attachments.Recording test results
[linux-jdk9] [withMaven] junitPublisher - Archive test results for Maven artifact org.apache.maven.scm:maven-scm-provider-accurev:1.9.6-SNAPSHOT generated by maven-surefire-plugin:test (default-test): m/maven-scm-providers/maven-scm-provider-accurev/target/surefire-reports/*.xml
[linux-jdk9] [withMaven] junitPublisher - Jenkins JUnit Attachments Plugin not found, can't publish test attachments.Recording test results
[linux-jdk9] [withMaven] junitPublisher - Archive test results for Maven artifact org.apache.maven.scm:maven-scm-provider-bazaar:1.9.6-SNAPSHOT generated by maven-surefire-plugin:test (default-test): m/maven-scm-providers/maven-scm-provider-bazaar/target/surefire-reports/*.xml
[linux-jdk9] [withMaven] junitPublisher - Jenkins JUnit Attachments Plugin not found, can't publish test attachments.Recording test results
[linux-jdk9] [withMaven] junitPublisher - Archive test results for Maven artifact org.apache.maven.scm:maven-scm-provider-clearcase:1.9.6-SNAPSHOT generated by maven-surefire-plugin:test (default-test): m/maven-scm-providers/maven-scm-provider-clearcase/target/surefire-reports/*.xml
[linux-jdk9] [withMaven] junitPublisher - Jenkins JUnit Attachments Plugin not found, can't publish test attachments.Recording test results
[linux-jdk9] [withMaven] junitPublisher - Archive test results for Maven artifact org.apache.maven.scm:maven-scm-provider-cvstest:1.9.6-SNAPSHOT generated by maven-surefire-plugin:test (default-test): m/maven-scm-providers/maven-scm-providers-cvs/maven-scm-provider-cvstest/target/surefire-reports/*.xml
[linux-jdk9] [withMaven] junitPublisher - Jenkins JUnit Attachments Plugin not found, can't publish test attachments.Recording test results
[linux-jdk9] None of the test reports contained any result
[linux-jdk9] [withMaven] junitPublisher - Archive test results for Maven artifact org.apache.maven.scm:maven-scm-provider-cvs-commons:1.9.6-SNAPSHOT generated by maven-surefire-plugin:test (default-test): m/maven-scm-providers/maven-scm-providers-cvs/maven-scm-provider-cvs-commons/target/surefire-reports/*.xml
[linux-jdk9] [withMaven] junitPublisher - Jenkins JUnit Attachments Plugin not found, can't publish test attachments.Recording test results
[linux-jdk9] [withMaven] junitPublisher - Archive test results for Maven artifact org.apache.maven.scm:maven-scm-provider-cvsexe:1.9.6-SNAPSHOT generated by maven-surefire-plugin:test (default-test): m/maven-scm-providers/maven-scm-providers-cvs/maven-scm-provider-cvsexe/target/surefire-reports/*.xml
[linux-jdk9] [withMaven] junitPublisher - Jenkins JUnit Attachments Plugin not found, can't publish test attachments.Recording test results
[linux-jdk9] [withMaven] junitPublisher - Archive test results for Maven artifact org.apache.maven.scm:maven-scm-provider-cvsjava:1.9.6-SNAPSHOT generated by maven-surefire-plugin:test (default-test): m/maven-scm-providers/maven-scm-providers-cvs/maven-scm-provider-cvsjava/target/surefire-reports/*.xml
[linux-jdk9] [withMaven] junitPublisher - Jenkins JUnit Attachments Plugin not found, can't publish test attachments.Recording test results
[linux-jdk9] [withMaven] junitPublisher - Archive test results for Maven artifact org.apache.maven.scm:maven-scm-provider-hg:1.9.6-SNAPSHOT generated by maven-surefire-plugin:test (default-test): m/maven-scm-providers/maven-scm-provider-hg/target/surefire-reports/*.xml
[linux-jdk9] [withMaven] junitPublisher - Jenkins JUnit Attachments Plugin not found, can't publish test attachments.Recording test results
[linux-jdk9] [withMaven] junitPublisher - Archive test results for Maven artifact org.apache.maven.scm:maven-scm-provider-git-commons:1.9.6-SNAPSHOT generated by maven-surefire-plugin:test (default-test): m/maven-scm-providers/maven-scm-providers-git/maven-scm-provider-git-commons/target/surefire-reports/*.xml
[linux-jdk9] [withMaven] junitPublisher - Jenkins JUnit Attachments Plugin not found, can't publish test attachments.Recording test results
[linux-jdk9] [withMaven] junitPublisher - Archive test results for Maven artifact org.apache.maven.scm:maven-scm-provider-gittest:1.9.6-SNAPSHOT generated by maven-surefire-plugin:test (default-test): m/maven-scm-providers/maven-scm-providers-git/maven-scm-provider-gittest/target/surefire-reports/*.xml
[linux-jdk9] [withMaven] junitPublisher - Jenkins JUnit Attachments Plugin not found, can't publish test attachments.Recording test results
[linux-jdk9] None of the test reports contained any result
[linux-jdk9] [withMaven] junitPublisher - Archive test results for Maven artifact org.apache.maven.scm:maven-scm-provider-gitexe:1.9.6-SNAPSHOT generated by maven-surefire-plugin:test (default-test): m/maven-scm-providers/maven-scm-providers-git/maven-scm-provider-gitexe/target/surefire-reports/*.xml
[linux-jdk9] [withMaven] junitPublisher - Jenkins JUnit Attachments Plugin not found, can't publish test attachments.Recording test results
[linux-jdk9] [withMaven] junitPublisher - Archive test results for Maven artifact org.apache.maven.scm:maven-scm-provider-jgit:1.9.6-SNAPSHOT generated by maven-surefire-plugin:test (default-test): m/maven-scm-providers/maven-scm-providers-git/maven-scm-provider-jgit/target/surefire-reports/*.xml
[linux-jdk9] [withMaven] junitPublisher - Jenkins JUnit Attachments Plugin not found, can't publish test attachments.Recording test results
[linux-jdk9] [withMaven] junitPublisher - Archive test results for Maven artifact org.apache.maven.scm:maven-scm-provider-local:1.9.6-SNAPSHOT generated by maven-surefire-plugin:test (default-test): m/maven-scm-providers/maven-scm-provider-local/target/surefire-reports/*.xml
[linux-jdk9] [withMaven] junitPublisher - Jenkins JUnit Attachments Plugin not found, can't publish test attachments.Recording test results
[linux-jdk9] [withMaven] junitPublisher - Archive test results for Maven artifact org.apache.maven.scm:maven-scm-provider-perforce:1.9.6-SNAPSHOT generated by maven-surefire-plugin:test (default-test): m/maven-scm-providers/maven-scm-provider-perforce/target/surefire-reports/*.xml
[linux-jdk9] [withMaven] junitPublisher - Jenkins JUnit Attachments Plugin not found, can't publish test attachments.Recording test results
[linux-jdk9] [withMaven] junitPublisher - Archive test results for Maven artifact org.apache.maven.scm:maven-scm-provider-starteam:1.9.6-SNAPSHOT generated by maven-surefire-plugin:test (default-test): m/maven-scm-providers/maven-scm-provider-starteam/target/surefire-reports/*.xml
[linux-jdk9] [withMaven] junitPublisher - Jenkins JUnit Attachments Plugin not found, can't publish test attachments.Recording test results
[linux-jdk9] [withMaven] junitPublisher - Archive test results for Maven artifact org.apache.maven.scm:maven-scm-provider-svn-commons:1.9.6-SNAPSHOT generated by maven-surefire-plugin:test (default-test): m/maven-scm-providers/maven-scm-providers-svn/maven-scm-provider-svn-commons/target/surefire-reports/*.xml
[linux-jdk9] [withMaven] junitPublisher - Jenkins JUnit Attachments Plugin not found, can't publish test attachments.Recording test results
[linux-jdk9] [withMaven] junitPublisher - Archive test results for Maven artifact org.apache.maven.scm:maven-scm-provider-svntest:1.9.6-SNAPSHOT generated by maven-surefire-plugin:test (default-test): m/maven-scm-providers/maven-scm-providers-svn/maven-scm-provider-svntest/target/surefire-reports/*.xml
[linux-jdk9] [withMaven] junitPublisher - Jenkins JUnit Attachments Plugin not found, can't publish test attachments.Recording test results
[linux-jdk9] None of the test reports contained any result
[linux-jdk9] [withMaven] junitPublisher - Archive test results for Maven artifact org.apache.maven.scm:maven-scm-provider-svnexe:1.9.6-SNAPSHOT generated by maven-surefire-plugin:test (default-test): m/maven-scm-providers/maven-scm-providers-svn/maven-scm-provider-svnexe/target/surefire-reports/*.xml
[linux-jdk9] [withMaven] junitPublisher - Jenkins JUnit Attachments Plugin not found, can't publish test attachments.Recording test results
[linux-jdk9] [withMaven] junitPublisher - Archive test results for Maven artifact org.apache.maven.scm:maven-scm-provider-synergy:1.9.6-SNAPSHOT generated by maven-surefire-plugin:test (default-test): m/maven-scm-providers/maven-scm-provider-synergy/target/surefire-reports/*.xml
[linux-jdk9] [withMaven] junitPublisher - Jenkins JUnit Attachments Plugin not found, can't publish test attachments.Recording test results
[linux-jdk9] [withMaven] junitPublisher - Archive test results for Maven artifact org.apache.maven.scm:maven-scm-provider-vss:1.9.6-SNAPSHOT generated by maven-surefire-plugin:test (default-test): m/maven-scm-providers/maven-scm-provider-vss/target/surefire-reports/*.xml
[linux-jdk9] [withMaven] junitPublisher - Jenkins JUnit Attachments Plugin not found, can't publish test attachments.Recording test results
[linux-jdk9] [withMaven] junitPublisher - Archive test results for Maven artifact org.apache.maven.scm:maven-scm-provider-tfs:1.9.6-SNAPSHOT generated by maven-surefire-plugin:test (default-test): m/maven-scm-providers/maven-scm-provider-tfs/target/surefire-reports/*.xml
[linux-jdk9] [withMaven] junitPublisher - Jenkins JUnit Attachments Plugin not found, can't publish test attachments.Recording test results
[linux-jdk9] [withMaven] junitPublisher - Archive test results for Maven artifact org.apache.maven.scm:maven-scm-provider-integrity:1.9.6-SNAPSHOT generated by maven-surefire-plugin:test (default-test): m/maven-scm-providers/maven-scm-provider-integrity/target/surefire-reports/*.xml
[linux-jdk9] [withMaven] junitPublisher - Jenkins JUnit Attachments Plugin not found, can't publish test attachments.Recording test results
[linux-jdk9] [withMaven] junitPublisher - Archive test results for Maven artifact org.apache.maven.scm:maven-scm-provider-jazz:1.9.6-SNAPSHOT generated by maven-surefire-plugin:test (default-test): m/maven-scm-providers/maven-scm-provider-jazz/target/surefire-reports/*.xml
[linux-jdk9] [withMaven] junitPublisher - Jenkins JUnit Attachments Plugin not found, can't publish test attachments.Recording test results
[linux-jdk9] [withMaven] junitPublisher - Archive test results for Maven artifact org.apache.maven.scm:maven-scm-client:1.9.6-SNAPSHOT generated by maven-surefire-plugin:test (default-test): m/maven-scm-client/target/surefire-reports/*.xml
[linux-jdk9] [withMaven] junitPublisher - Jenkins JUnit Attachments Plugin not found, can't publish test attachments.Recording test results
[linux-jdk9] None of the test reports contained any result
[linux-jdk9] [withMaven] junitPublisher - Archive test results for Maven artifact org.apache.maven.plugins:maven-scm-plugin:1.9.6-SNAPSHOT generated by maven-surefire-plugin:test (default-test): m/maven-scm-plugin/target/surefire-reports/*.xml
[linux-jdk9] [withMaven] junitPublisher - Jenkins JUnit Attachments Plugin not found, can't publish test attachments.Recording test results
[linux-jdk9] [withMaven] openTasksPublisher - Scan Tasks for Maven artifact org.apache.maven.scm:maven-scm-api:1.9.6-SNAPSHOT in source directory m/maven-scm-api/src/main/java
[linux-jdk9] [withMaven] openTasksPublisher - Scan Tasks for Maven artifact org.apache.maven.scm:maven-scm-manager-plexus:1.9.6-SNAPSHOT in source directory m/maven-scm-managers/maven-scm-manager-plexus/src/main/java
[linux-jdk9] [withMaven] openTasksPublisher - Scan Tasks for Maven artifact org.apache.maven.scm:maven-scm-test:1.9.6-SNAPSHOT in source directory m/maven-scm-test/src/main/java
[linux-jdk9] [withMaven] openTasksPublisher - Scan Tasks for Maven artifact org.apache.maven.scm:maven-scm-provider-accurev:1.9.6-SNAPSHOT in source directory m/maven-scm-providers/maven-scm-provider-accurev/src/main/java
[linux-jdk9] [withMaven] openTasksPublisher - Scan Tasks for Maven artifact org.apache.maven.scm:maven-scm-provider-bazaar:1.9.6-SNAPSHOT in source directory m/maven-scm-providers/maven-scm-provider-bazaar/src/main/java
[linux-jdk9] [withMaven] openTasksPublisher - Scan Tasks for Maven artifact org.apache.maven.scm:maven-scm-provider-clearcase:1.9.6-SNAPSHOT in source directory m/maven-scm-providers/maven-scm-provider-clearcase/src/main/java
[linux-jdk9] [withMaven] openTasksPublisher - Scan Tasks for Maven artifact org.apache.maven.scm:maven-scm-provider-cvstest:1.9.6-SNAPSHOT in source directory m/maven-scm-providers/maven-scm-providers-cvs/maven-scm-provider-cvstest/src/main/java
[linux-jdk9] [withMaven] openTasksPublisher - Scan Tasks for Maven artifact org.apache.maven.scm:maven-scm-provider-cvs-commons:1.9.6-SNAPSHOT in source directory m/maven-scm-providers/maven-scm-providers-cvs/maven-scm-provider-cvs-commons/src/main/java
[linux-jdk9] [withMaven] openTasksPublisher - Scan Tasks for Maven artifact org.apache.maven.scm:maven-scm-provider-cvsexe:1.9.6-SNAPSHOT in source directory m/maven-scm-providers/maven-scm-providers-cvs/maven-scm-provider-cvsexe/src/main/java
[linux-jdk9] [withMaven] openTasksPublisher - Scan Tasks for Maven artifact org.apache.maven.scm:maven-scm-provider-cvsjava:1.9.6-SNAPSHOT in source directory m/maven-scm-providers/maven-scm-providers-cvs/maven-scm-provider-cvsjava/src/main/java
[linux-jdk9] [withMaven] openTasksPublisher - Scan Tasks for Maven artifact org.apache.maven.scm:maven-scm-provider-hg:1.9.6-SNAPSHOT in source directory m/maven-scm-providers/maven-scm-provider-hg/src/main/java
[linux-jdk9] [withMaven] openTasksPublisher - Scan Tasks for Maven artifact org.apache.maven.scm:maven-scm-provider-git-commons:1.9.6-SNAPSHOT in source directory m/maven-scm-providers/maven-scm-providers-git/maven-scm-provider-git-commons/src/main/java
[linux-jdk9] [withMaven] openTasksPublisher - Scan Tasks for Maven artifact org.apache.maven.scm:maven-scm-provider-gittest:1.9.6-SNAPSHOT in source directory m/maven-scm-providers/maven-scm-providers-git/maven-scm-provider-gittest/src/main/java
[linux-jdk9] [withMaven] openTasksPublisher - Scan Tasks for Maven artifact org.apache.maven.scm:maven-scm-provider-gitexe:1.9.6-SNAPSHOT in source directory m/maven-scm-providers/maven-scm-providers-git/maven-scm-provider-gitexe/src/main/java
[linux-jdk9] [withMaven] openTasksPublisher - Scan Tasks for Maven artifact org.apache.maven.scm:maven-scm-provider-jgit:1.9.6-SNAPSHOT in source directory m/maven-scm-providers/maven-scm-providers-git/maven-scm-provider-jgit/src/main/java
[linux-jdk9] [withMaven] openTasksPublisher - Scan Tasks for Maven artifact org.apache.maven.scm:maven-scm-provider-local:1.9.6-SNAPSHOT in source directory m/maven-scm-providers/maven-scm-provider-local/src/main/java
[linux-jdk9] [withMaven] openTasksPublisher - Scan Tasks for Maven artifact org.apache.maven.scm:maven-scm-provider-perforce:1.9.6-SNAPSHOT in source directory m/maven-scm-providers/maven-scm-provider-perforce/src/main/java
[linux-jdk9] [withMaven] openTasksPublisher - Scan Tasks for Maven artifact org.apache.maven.scm:maven-scm-provider-starteam:1.9.6-SNAPSHOT in source directory m/maven-scm-providers/maven-scm-provider-starteam/src/main/java
[linux-jdk9] [withMaven] openTasksPublisher - Scan Tasks for Maven artifact org.apache.maven.scm:maven-scm-provider-svn-commons:1.9.6-SNAPSHOT in source directory m/maven-scm-providers/maven-scm-providers-svn/maven-scm-provider-svn-commons/src/main/java
[linux-jdk9] [withMaven] openTasksPublisher - Scan Tasks for Maven artifact org.apache.maven.scm:maven-scm-provider-svntest:1.9.6-SNAPSHOT in source directory m/maven-scm-providers/maven-scm-providers-svn/maven-scm-provider-svntest/src/main/java
[linux-jdk9] [withMaven] openTasksPublisher - Scan Tasks for Maven artifact org.apache.maven.scm:maven-scm-provider-svnexe:1.9.6-SNAPSHOT in source directory m/maven-scm-providers/maven-scm-providers-svn/maven-scm-provider-svnexe/src/main/java
[linux-jdk9] [withMaven] openTasksPublisher - Scan Tasks for Maven artifact org.apache.maven.scm:maven-scm-provider-synergy:1.9.6-SNAPSHOT in source directory m/maven-scm-providers/maven-scm-provider-synergy/src/main/java
[linux-jdk9] [withMaven] openTasksPublisher - Scan Tasks for Maven artifact org.apache.maven.scm:maven-scm-provider-vss:1.9.6-SNAPSHOT in source directory m/maven-scm-providers/maven-scm-provider-vss/src/main/java
[linux-jdk9] [withMaven] openTasksPublisher - Scan Tasks for Maven artifact org.apache.maven.scm:maven-scm-provider-tfs:1.9.6-SNAPSHOT in source directory m/maven-scm-providers/maven-scm-provider-tfs/src/main/java
[linux-jdk9] [withMaven] openTasksPublisher - Scan Tasks for Maven artifact org.apache.maven.scm:maven-scm-provider-integrity:1.9.6-SNAPSHOT in source directory m/maven-scm-providers/maven-scm-provider-integrity/src/main/java
[linux-jdk9] [withMaven] openTasksPublisher - Scan Tasks for Maven artifact org.apache.maven.scm:maven-scm-provider-jazz:1.9.6-SNAPSHOT in source directory m/maven-scm-providers/maven-scm-provider-jazz/src/main/java
[linux-jdk9] [withMaven] openTasksPublisher - Scan Tasks for Maven artifact org.apache.maven.scm:maven-scm-client:1.9.6-SNAPSHOT in source directory m/maven-scm-client/src/main/java
[linux-jdk9] [withMaven] openTasksPublisher - Scan Tasks for Maven artifact org.apache.maven.plugins:maven-scm-plugin:1.9.6-SNAPSHOT in source directory m/maven-scm-plugin/src/main/java
[linux-jdk9] [TASKS] Scanning folder '/home/jenkins/jenkins-slave/workspace/maven-wip_maven-scm_master-ADXNUB4JTUUV5E57KMRFZSZVGMFJJBVMKSOJS62JASEIC2763EUQ' for files matching the pattern 'm/maven-scm-api/src/main/java/**/*,m/maven-scm-managers/maven-scm-manager-plexus/src/main/java/**/*,m/maven-scm-test/src/main/java/**/*,m/maven-scm-providers/maven-scm-provider-accurev/src/main/java/**/*,m/maven-scm-providers/maven-scm-provider-bazaar/src/main/java/**/*,m/maven-scm-providers/maven-scm-provider-clearcase/src/main/java/**/*,m/maven-scm-providers/maven-scm-providers-cvs/maven-scm-provider-cvstest/src/main/java/**/*,m/maven-scm-providers/maven-scm-providers-cvs/maven-scm-provider-cvs-commons/src/main/java/**/*,m/maven-scm-providers/maven-scm-providers-cvs/maven-scm-provider-cvsexe/src/main/java/**/*,m/maven-scm-providers/maven-scm-providers-cvs/maven-scm-provider-cvsjava/src/main/java/**/*,m/maven-scm-providers/maven-scm-provider-hg/src/main/java/**/*,m/maven-scm-providers/maven-scm-providers-git/maven-scm-provider-git-commons/src/main/java/**/*,m/maven-scm-providers/maven-scm-providers-git/maven-scm-provider-gittest/src/main/java/**/*,m/maven-scm-providers/maven-scm-providers-git/maven-scm-provider-gitexe/src/main/java/**/*,m/maven-scm-providers/maven-scm-providers-git/maven-scm-provider-jgit/src/main/java/**/*,m/maven-scm-providers/maven-scm-provider-local/src/main/java/**/*,m/maven-scm-providers/maven-scm-provider-perforce/src/main/java/**/*,m/maven-scm-providers/maven-scm-provider-starteam/src/main/java/**/*,m/maven-scm-providers/maven-scm-providers-svn/maven-scm-provider-svn-commons/src/main/java/**/*,m/maven-scm-providers/maven-scm-providers-svn/maven-scm-provider-svntest/src/main/java/**/*,m/maven-scm-providers/maven-scm-providers-svn/maven-scm-provider-svnexe/src/main/java/**/*,m/maven-scm-providers/maven-scm-provider-synergy/src/main/java/**/*,m/maven-scm-providers/maven-scm-provider-vss/src/main/java/**/*,m/maven-scm-providers/maven-scm-provider-tfs/src/main/java/**/*,m/maven-scm-providers/maven-scm-provider-integrity/src/main/java/**/*,m/maven-scm-providers/maven-scm-provider-jazz/src/main/java/**/*,m/maven-scm-client/src/main/java/**/*,m/maven-scm-plugin/src/main/java/**/*' - excludes: null
[linux-jdk9] [TASKS] Found 655 files to scan for tasks
[linux-jdk9] [TASKS] Found 95 open tasks.
[linux-jdk9] Skipping warnings blame since pipelines do not have an SCM link.%n
[Pipeline] [linux-jdk9] // withMaven
[Pipeline] [linux-jdk9] }
[Pipeline] [linux-jdk9] // stage
[Pipeline] [linux-jdk9] }
[Pipeline] [linux-jdk9] // node
[Pipeline] [linux-jdk9] }
[Pipeline] // parallel
[Pipeline] stage
[Pipeline] { (Notifications)
[Pipeline] echo
Build result: UNSTABLE
[Pipeline] jiraIssueSelector
[Pipeline] emailext
Mime
  • Unnamed multipart/mixed (inline, None, 0 bytes)
View raw message