maven-notifications mailing list archives

Site index · List index
Message view « Date » · « Thread »
Top « Date » · « Thread »
From Apache Jenkins Server <jenk...@builds.apache.org>
Subject Build failed in Jenkins: Maven TLP » maven-project-info-reports-plugin » master #2
Date Thu, 28 Dec 2017 15:30:08 GMT
See https://builds.apache.org/job/maven-box/job/maven-project-info-reports-plugin/job/master/2/

Changes:

* Noting INFRA-15651
* Typowq

No tests ran.

Build log:
[...truncated 719.77 KB...]
[linux-jdk7] [INFO] Downloaded from central: https://repo.maven.apache.org/maven2/org/apache/maven/maven-plugin-api/2.0.6/maven-plugin-api-2.0.6.jar
(13 kB at 476 kB/s)
[linux-jdk7] [INFO] Downloaded from central: https://repo.maven.apache.org/maven2/org/apache/maven/maven-plugin-registry/2.0.6/maven-plugin-registry-2.0.6.jar
(29 kB at 997 kB/s)
[linux-jdk7] [INFO] Downloaded from central: https://repo.maven.apache.org/maven2/org/apache/maven/maven-artifact/2.0.6/maven-artifact-2.0.6.jar
(87 kB at 2.8 MB/s)
[linux-jdk7] [INFO] Downloaded from central: https://repo.maven.apache.org/maven2/org/codehaus/plexus/plexus-utils/1.4.9/plexus-utils-1.4.9.jar
(204 kB at 5.7 MB/s)
[linux-jdk7] [WARNING] Keystore file '/home/jenkins/jenkins-slave/workspace/-info-reports-plugin_master-32Y3P743XLZN3V3HHV4NR6ZSZMFDM7Z5PXO3RSN6SA3U6NVU4ZTA/m/target/jetty.jks'
doesn't exist.
[linux-jdk7] [INFO] 
[linux-jdk7] [INFO] --- keytool-maven-plugin:1.0:genkey (init) @ maven-project-info-reports-plugin
---
[linux-jdk7] [WARNING] Picked up JAVA_TOOL_OPTIONS: -Dmaven.ext.class.path="/home/jenkins/jenkins-slave/workspace/-info-reports-plugin_master-32Y3P743XLZN3V3HHV4NR6ZSZMFDM7Z5PXO3RSN6SA3U6NVU4ZTA@tmp/withMavenb4490a55/pipeline-maven-spy.jar"
-Dorg.jenkinsci.plugins.pipeline.maven.reportsFolder="/home/jenkins/jenkins-slave/workspace/-info-reports-plugin_master-32Y3P743XLZN3V3HHV4NR6ZSZMFDM7Z5PXO3RSN6SA3U6NVU4ZTA@tmp/withMavenb4490a55"

[linux-jdk7] [INFO] 
[linux-jdk7] [INFO] --- maven-plugin-plugin:3.4:helpmojo (generate-helpmojo) @ maven-project-info-reports-plugin
---
[linux-jdk7] [INFO] Downloading from central: https://repo.maven.apache.org/maven2/org/apache/maven/plugin-tools/maven-plugin-tools-api/3.4/maven-plugin-tools-api-3.4.pom
[linux-jdk7] [INFO] Downloaded from central: https://repo.maven.apache.org/maven2/org/apache/maven/plugin-tools/maven-plugin-tools-api/3.4/maven-plugin-tools-api-3.4.pom
(2.9 kB at 224 kB/s)
[linux-jdk7] [INFO] Downloading from central: https://repo.maven.apache.org/maven2/org/codehaus/plexus/plexus-utils/3.0.20/plexus-utils-3.0.20.pom
[linux-jdk7] [INFO] Downloaded from central: https://repo.maven.apache.org/maven2/org/codehaus/plexus/plexus-utils/3.0.20/plexus-utils-3.0.20.pom
(3.8 kB at 293 kB/s)
[linux-jdk7] [INFO] Downloading from central: https://repo.maven.apache.org/maven2/org/apache/maven/plugin-tools/maven-plugin-tools-generators/3.4/maven-plugin-tools-generators-3.4.pom
[linux-jdk7] [INFO] Downloaded from central: https://repo.maven.apache.org/maven2/org/apache/maven/plugin-tools/maven-plugin-tools-generators/3.4/maven-plugin-tools-generators-3.4.pom
(4.2 kB at 381 kB/s)
[linux-jdk7] [INFO] Downloading from central: https://repo.maven.apache.org/maven2/org/codehaus/plexus/plexus-velocity/1.1.8/plexus-velocity-1.1.8.pom
[linux-jdk7] [INFO] Downloaded from central: https://repo.maven.apache.org/maven2/org/codehaus/plexus/plexus-velocity/1.1.8/plexus-velocity-1.1.8.pom
(1.9 kB at 192 kB/s)
[linux-jdk7] [INFO] Downloading from central: https://repo.maven.apache.org/maven2/org/codehaus/plexus/plexus-components/1.1.15/plexus-components-1.1.15.pom
[linux-jdk7] [INFO] Downloaded from central: https://repo.maven.apache.org/maven2/org/codehaus/plexus/plexus-components/1.1.15/plexus-components-1.1.15.pom
(2.8 kB at 259 kB/s)
[linux-jdk7] [INFO] Downloading from central: https://repo.maven.apache.org/maven2/org/apache/velocity/velocity/1.7/velocity-1.7.pom
[linux-jdk7] [INFO] Downloaded from central: https://repo.maven.apache.org/maven2/org/apache/velocity/velocity/1.7/velocity-1.7.pom
(11 kB at 905 kB/s)
[linux-jdk7] [INFO] Downloading from central: https://repo.maven.apache.org/maven2/org/ow2/asm/asm/5.0.2/asm-5.0.2.pom
[linux-jdk7] [INFO] Downloaded from central: https://repo.maven.apache.org/maven2/org/ow2/asm/asm/5.0.2/asm-5.0.2.pom
(1.9 kB at 176 kB/s)
[linux-jdk7] [INFO] Downloading from central: https://repo.maven.apache.org/maven2/org/ow2/asm/asm-parent/5.0.2/asm-parent-5.0.2.pom
[linux-jdk7] [INFO] Downloaded from central: https://repo.maven.apache.org/maven2/org/ow2/asm/asm-parent/5.0.2/asm-parent-5.0.2.pom
(5.5 kB at 458 kB/s)
[linux-jdk7] [INFO] Downloading from central: https://repo.maven.apache.org/maven2/org/ow2/ow2/1.3/ow2-1.3.pom
[linux-jdk7] [INFO] Downloaded from central: https://repo.maven.apache.org/maven2/org/ow2/ow2/1.3/ow2-1.3.pom
(9.5 kB at 792 kB/s)
[linux-jdk7] [INFO] Downloading from central: https://repo.maven.apache.org/maven2/org/ow2/asm/asm-commons/5.0.2/asm-commons-5.0.2.pom
[linux-jdk7] [INFO] Downloaded from central: https://repo.maven.apache.org/maven2/org/ow2/asm/asm-commons/5.0.2/asm-commons-5.0.2.pom
(2.1 kB at 190 kB/s)
[linux-jdk7] [INFO] Downloading from central: https://repo.maven.apache.org/maven2/org/ow2/asm/asm-tree/5.0.2/asm-tree-5.0.2.pom
[linux-jdk7] [INFO] Downloaded from central: https://repo.maven.apache.org/maven2/org/ow2/asm/asm-tree/5.0.2/asm-tree-5.0.2.pom
(2.1 kB at 189 kB/s)
[linux-jdk7] [INFO] Downloading from central: https://repo.maven.apache.org/maven2/net/sf/jtidy/jtidy/r938/jtidy-r938.pom
[Pipeline] [linux-jdk9] }
[linux-jdk9] [withMaven] Skip 'Generated Artifacts Publisher' disabled by configuration
[linux-jdk9] [withMaven] Skip 'Findbugs Publisher' disabled by configuration
[linux-jdk9] [withMaven] Skip 'Open Task Scanner Publisher' disabled by configuration
[Pipeline] [linux-jdk9] // withMaven
[Pipeline] [linux-jdk9] }
[Pipeline] [linux-jdk9] // stage
[Pipeline] [linux-jdk9] }
[Pipeline] [linux-jdk9] // node
[Pipeline] [linux-jdk9] }
[linux-jdk7] [INFO] Downloaded from central: https://repo.maven.apache.org/maven2/net/sf/jtidy/jtidy/r938/jtidy-r938.pom
(9.2 kB at 768 kB/s)
[linux-jdk7] [INFO] Downloading from central: https://repo.maven.apache.org/maven2/org/apache/maven/plugin-tools/maven-plugin-tools-java/3.4/maven-plugin-tools-java-3.4.pom
[linux-jdk7] [INFO] Downloaded from central: https://repo.maven.apache.org/maven2/org/apache/maven/plugin-tools/maven-plugin-tools-java/3.4/maven-plugin-tools-java-3.4.pom
(3.2 kB at 265 kB/s)
[linux-jdk7] [INFO] Downloading from central: https://repo.maven.apache.org/maven2/com/thoughtworks/qdox/qdox/2.0-M3/qdox-2.0-M3.pom
[linux-jdk7] [INFO] Downloaded from central: https://repo.maven.apache.org/maven2/com/thoughtworks/qdox/qdox/2.0-M3/qdox-2.0-M3.pom
(18 kB at 1.5 MB/s)
[linux-jdk7] [INFO] Downloading from central: https://repo.maven.apache.org/maven2/org/apache/maven/plugin-tools/maven-plugin-tools-annotations/3.4/maven-plugin-tools-annotations-3.4.pom
[linux-jdk7] [INFO] Downloaded from central: https://repo.maven.apache.org/maven2/org/apache/maven/plugin-tools/maven-plugin-tools-annotations/3.4/maven-plugin-tools-annotations-3.4.pom
(4.2 kB at 347 kB/s)
[linux-jdk7] [INFO] Downloading from central: https://repo.maven.apache.org/maven2/org/codehaus/plexus/plexus-archiver/2.1.1/plexus-archiver-2.1.1.pom
[linux-jdk7] [INFO] Downloaded from central: https://repo.maven.apache.org/maven2/org/codehaus/plexus/plexus-archiver/2.1.1/plexus-archiver-2.1.1.pom
(2.8 kB at 234 kB/s)
[linux-jdk7] [INFO] Downloading from central: https://repo.maven.apache.org/maven2/org/codehaus/plexus/plexus-io/2.0.3/plexus-io-2.0.3.pom
[linux-jdk7] [INFO] Downloaded from central: https://repo.maven.apache.org/maven2/org/codehaus/plexus/plexus-io/2.0.3/plexus-io-2.0.3.pom
(1.7 kB at 158 kB/s)
[linux-jdk7] [INFO] Downloading from central: https://repo.maven.apache.org/maven2/org/apache/maven/doxia/doxia-sink-api/1.4/doxia-sink-api-1.4.pom
[linux-jdk7] [INFO] Downloaded from central: https://repo.maven.apache.org/maven2/org/apache/maven/doxia/doxia-sink-api/1.4/doxia-sink-api-1.4.pom
(1.5 kB at 128 kB/s)
[linux-jdk7] [INFO] Downloading from central: https://repo.maven.apache.org/maven2/org/apache/maven/doxia/doxia/1.4/doxia-1.4.pom
[linux-jdk7] [INFO] Downloaded from central: https://repo.maven.apache.org/maven2/org/apache/maven/doxia/doxia/1.4/doxia-1.4.pom
(18 kB at 1.4 MB/s)
[linux-jdk7] [INFO] Downloading from central: https://repo.maven.apache.org/maven2/org/apache/maven/doxia/doxia-logging-api/1.4/doxia-logging-api-1.4.pom
[linux-jdk7] [INFO] Downloaded from central: https://repo.maven.apache.org/maven2/org/apache/maven/doxia/doxia-logging-api/1.4/doxia-logging-api-1.4.pom
(1.5 kB at 128 kB/s)
[linux-jdk7] [INFO] Downloading from central: https://repo.maven.apache.org/maven2/org/apache/maven/doxia/doxia-site-renderer/1.4/doxia-site-renderer-1.4.pom
[linux-jdk7] [INFO] Downloaded from central: https://repo.maven.apache.org/maven2/org/apache/maven/doxia/doxia-site-renderer/1.4/doxia-site-renderer-1.4.pom
(6.1 kB at 509 kB/s)
[linux-jdk7] [INFO] Downloading from central: https://repo.maven.apache.org/maven2/org/apache/maven/doxia/doxia-sitetools/1.4/doxia-sitetools-1.4.pom
[linux-jdk7] [INFO] Downloaded from central: https://repo.maven.apache.org/maven2/org/apache/maven/doxia/doxia-sitetools/1.4/doxia-sitetools-1.4.pom
(17 kB at 1.3 MB/s)
[linux-jdk7] [INFO] Downloading from central: https://repo.maven.apache.org/maven2/org/apache/maven/doxia/doxia-core/1.4/doxia-core-1.4.pom
[linux-jdk7] [INFO] Downloaded from central: https://repo.maven.apache.org/maven2/org/apache/maven/doxia/doxia-core/1.4/doxia-core-1.4.pom
(4.1 kB at 370 kB/s)
[linux-jdk7] [INFO] Downloading from central: https://repo.maven.apache.org/maven2/org/apache/maven/doxia/doxia-decoration-model/1.4/doxia-decoration-model-1.4.pom
[linux-jdk7] [INFO] Downloaded from central: https://repo.maven.apache.org/maven2/org/apache/maven/doxia/doxia-decoration-model/1.4/doxia-decoration-model-1.4.pom
(2.7 kB at 243 kB/s)
[linux-jdk7] [INFO] Downloading from central: https://repo.maven.apache.org/maven2/org/apache/maven/doxia/doxia-module-xhtml/1.4/doxia-module-xhtml-1.4.pom
[linux-jdk7] [INFO] Downloaded from central: https://repo.maven.apache.org/maven2/org/apache/maven/doxia/doxia-module-xhtml/1.4/doxia-module-xhtml-1.4.pom
(1.6 kB at 136 kB/s)
[linux-jdk7] [INFO] Downloading from central: https://repo.maven.apache.org/maven2/org/apache/maven/doxia/doxia-modules/1.4/doxia-modules-1.4.pom
[linux-jdk7] [INFO] Downloaded from central: https://repo.maven.apache.org/maven2/org/apache/maven/doxia/doxia-modules/1.4/doxia-modules-1.4.pom
(2.6 kB at 238 kB/s)
[linux-jdk7] [INFO] Downloading from central: https://repo.maven.apache.org/maven2/org/apache/maven/doxia/doxia-module-fml/1.4/doxia-module-fml-1.4.pom
[linux-jdk7] [INFO] Downloaded from central: https://repo.maven.apache.org/maven2/org/apache/maven/doxia/doxia-module-fml/1.4/doxia-module-fml-1.4.pom
(4.8 kB at 400 kB/s)
[linux-jdk7] [INFO] Downloading from central: https://repo.maven.apache.org/maven2/org/apache/maven/reporting/maven-reporting-impl/2.3/maven-reporting-impl-2.3.pom
[linux-jdk7] [INFO] Downloaded from central: https://repo.maven.apache.org/maven2/org/apache/maven/reporting/maven-reporting-impl/2.3/maven-reporting-impl-2.3.pom
(5.0 kB at 417 kB/s)
[linux-jdk7] [INFO] Downloading from central: https://repo.maven.apache.org/maven2/org/apache/maven/plugin-tools/maven-plugin-tools-api/3.4/maven-plugin-tools-api-3.4.jar
[linux-jdk7] [INFO] Downloading from central: https://repo.maven.apache.org/maven2/org/apache/maven/plugin-tools/maven-plugin-tools-generators/3.4/maven-plugin-tools-generators-3.4.jar
[linux-jdk7] [INFO] Downloading from central: https://repo.maven.apache.org/maven2/org/ow2/asm/asm/5.0.2/asm-5.0.2.jar
[linux-jdk7] [INFO] Downloading from central: https://repo.maven.apache.org/maven2/org/ow2/asm/asm-tree/5.0.2/asm-tree-5.0.2.jar
[linux-jdk7] [INFO] Downloading from central: https://repo.maven.apache.org/maven2/org/ow2/asm/asm-commons/5.0.2/asm-commons-5.0.2.jar
[linux-jdk7] [INFO] Downloaded from central: https://repo.maven.apache.org/maven2/org/apache/maven/plugin-tools/maven-plugin-tools-api/3.4/maven-plugin-tools-api-3.4.jar
(23 kB at 1.4 MB/s)
[linux-jdk7] [INFO] Downloading from central: https://repo.maven.apache.org/maven2/net/sf/jtidy/jtidy/r938/jtidy-r938.jar
[linux-jdk7] [INFO] Downloaded from central: https://repo.maven.apache.org/maven2/org/ow2/asm/asm/5.0.2/asm-5.0.2.jar
(53 kB at 3.5 MB/s)
[linux-jdk7] [INFO] Downloading from central: https://repo.maven.apache.org/maven2/org/apache/maven/plugin-tools/maven-plugin-tools-java/3.4/maven-plugin-tools-java-3.4.jar
[linux-jdk7] [INFO] Downloaded from central: https://repo.maven.apache.org/maven2/org/apache/maven/plugin-tools/maven-plugin-tools-generators/3.4/maven-plugin-tools-generators-3.4.jar
(47 kB at 2.8 MB/s)
[linux-jdk7] [INFO] Downloading from central: https://repo.maven.apache.org/maven2/com/thoughtworks/qdox/qdox/2.0-M3/qdox-2.0-M3.jar
[linux-jdk7] [INFO] Downloaded from central: https://repo.maven.apache.org/maven2/org/ow2/asm/asm-tree/5.0.2/asm-tree-5.0.2.jar
(29 kB at 1.9 MB/s)
[linux-jdk7] [INFO] Downloading from central: https://repo.maven.apache.org/maven2/org/apache/maven/plugin-tools/maven-plugin-tools-annotations/3.4/maven-plugin-tools-annotations-3.4.jar
[linux-jdk7] [INFO] Downloaded from central: https://repo.maven.apache.org/maven2/org/ow2/asm/asm-commons/5.0.2/asm-commons-5.0.2.jar
(42 kB at 2.6 MB/s)
[linux-jdk7] [INFO] Downloading from central: https://repo.maven.apache.org/maven2/org/codehaus/plexus/plexus-archiver/2.1.1/plexus-archiver-2.1.1.jar
[linux-jdk7] [INFO] Downloaded from central: https://repo.maven.apache.org/maven2/org/apache/maven/plugin-tools/maven-plugin-tools-java/3.4/maven-plugin-tools-java-3.4.jar
(18 kB at 681 kB/s)
[linux-jdk7] [INFO] Downloading from central: https://repo.maven.apache.org/maven2/org/codehaus/plexus/plexus-io/2.0.3/plexus-io-2.0.3.jar
[linux-jdk7] [INFO] Downloaded from central: https://repo.maven.apache.org/maven2/org/apache/maven/plugin-tools/maven-plugin-tools-annotations/3.4/maven-plugin-tools-annotations-3.4.jar
(41 kB at 1.3 MB/s)
[linux-jdk7] [INFO] Downloading from central: https://repo.maven.apache.org/maven2/org/apache/maven/doxia/doxia-sink-api/1.4/doxia-sink-api-1.4.jar
[linux-jdk7] [INFO] Downloaded from central: https://repo.maven.apache.org/maven2/net/sf/jtidy/jtidy/r938/jtidy-r938.jar
(250 kB at 7.4 MB/s)
[linux-jdk7] [INFO] Downloading from central: https://repo.maven.apache.org/maven2/org/apache/maven/doxia/doxia-logging-api/1.4/doxia-logging-api-1.4.jar
[linux-jdk7] [INFO] Downloaded from central: https://repo.maven.apache.org/maven2/org/codehaus/plexus/plexus-archiver/2.1.1/plexus-archiver-2.1.1.jar
(185 kB at 5.1 MB/s)
[linux-jdk7] [INFO] Downloading from central: https://repo.maven.apache.org/maven2/org/apache/maven/doxia/doxia-site-renderer/1.4/doxia-site-renderer-1.4.jar
[linux-jdk7] [INFO] Downloaded from central: https://repo.maven.apache.org/maven2/com/thoughtworks/qdox/qdox/2.0-M3/qdox-2.0-M3.jar
(292 kB at 7.9 MB/s)
[linux-jdk7] [INFO] Downloading from central: https://repo.maven.apache.org/maven2/org/apache/maven/doxia/doxia-core/1.4/doxia-core-1.4.jar
[linux-jdk7] [INFO] Downloaded from central: https://repo.maven.apache.org/maven2/org/codehaus/plexus/plexus-io/2.0.3/plexus-io-2.0.3.jar
(58 kB at 1.5 MB/s)
[linux-jdk7] [INFO] Downloading from central: https://repo.maven.apache.org/maven2/org/apache/maven/doxia/doxia-decoration-model/1.4/doxia-decoration-model-1.4.jar
[linux-jdk7] [INFO] Downloaded from central: https://repo.maven.apache.org/maven2/org/apache/maven/doxia/doxia-sink-api/1.4/doxia-sink-api-1.4.jar
(11 kB at 261 kB/s)
[linux-jdk7] [INFO] Downloading from central: https://repo.maven.apache.org/maven2/org/apache/maven/doxia/doxia-module-xhtml/1.4/doxia-module-xhtml-1.4.jar
[linux-jdk7] [INFO] Downloaded from central: https://repo.maven.apache.org/maven2/org/apache/maven/doxia/doxia-logging-api/1.4/doxia-logging-api-1.4.jar
(11 kB at 246 kB/s)
[linux-jdk7] [INFO] Downloading from central: https://repo.maven.apache.org/maven2/org/apache/maven/doxia/doxia-module-fml/1.4/doxia-module-fml-1.4.jar
[linux-jdk7] [INFO] Downloaded from central: https://repo.maven.apache.org/maven2/org/apache/maven/doxia/doxia-site-renderer/1.4/doxia-site-renderer-1.4.jar
(53 kB at 1.1 MB/s)
[linux-jdk7] [INFO] Downloading from central: https://repo.maven.apache.org/maven2/org/apache/maven/reporting/maven-reporting-impl/2.3/maven-reporting-impl-2.3.jar
[linux-jdk7] [INFO] Downloaded from central: https://repo.maven.apache.org/maven2/org/apache/maven/doxia/doxia-decoration-model/1.4/doxia-decoration-model-1.4.jar
(61 kB at 1.1 MB/s)
[linux-jdk7] [INFO] Downloading from central: https://repo.maven.apache.org/maven2/org/codehaus/plexus/plexus-utils/3.0.20/plexus-utils-3.0.20.jar
[linux-jdk7] [INFO] Downloaded from central: https://repo.maven.apache.org/maven2/org/apache/maven/doxia/doxia-module-xhtml/1.4/doxia-module-xhtml-1.4.jar
(15 kB at 275 kB/s)
[linux-jdk7] [INFO] Downloaded from central: https://repo.maven.apache.org/maven2/org/apache/maven/doxia/doxia-core/1.4/doxia-core-1.4.jar
(165 kB at 2.9 MB/s)
[linux-jdk7] [INFO] Downloading from central: https://repo.maven.apache.org/maven2/org/codehaus/plexus/plexus-velocity/1.1.8/plexus-velocity-1.1.8.jar
[linux-jdk7] [INFO] Downloading from central: https://repo.maven.apache.org/maven2/org/apache/velocity/velocity/1.7/velocity-1.7.jar
[linux-jdk7] [INFO] Downloaded from central: https://repo.maven.apache.org/maven2/org/apache/maven/doxia/doxia-module-fml/1.4/doxia-module-fml-1.4.jar
(38 kB at 641 kB/s)
[linux-jdk7] [INFO] Downloaded from central: https://repo.maven.apache.org/maven2/org/apache/maven/reporting/maven-reporting-impl/2.3/maven-reporting-impl-2.3.jar
(18 kB at 285 kB/s)
[linux-jdk7] [INFO] Downloaded from central: https://repo.maven.apache.org/maven2/org/codehaus/plexus/plexus-velocity/1.1.8/plexus-velocity-1.1.8.jar
(7.9 kB at 114 kB/s)
[linux-jdk7] [INFO] Downloaded from central: https://repo.maven.apache.org/maven2/org/codehaus/plexus/plexus-utils/3.0.20/plexus-utils-3.0.20.jar
(243 kB at 3.2 MB/s)
[linux-jdk7] [INFO] Downloaded from central: https://repo.maven.apache.org/maven2/org/apache/velocity/velocity/1.7/velocity-1.7.jar
(450 kB at 5.2 MB/s)
[linux-jdk9] Failed in branch linux-jdk9
[linux-jdk8] [INFO] /home/jenkins/jenkins-slave/workspace/-info-reports-plugin_master-32Y3P743XLZN3V3HHV4NR6ZSZMFDM7Z5PXO3RSN6SA3U6NVU4ZTA/m/src/main/java/org/apache/maven/report/projectinfo/AbstractProjectInfoReport.java:
/home/jenkins/jenkins-slave/workspace/-info-reports-plugin_master-32Y3P743XLZN3V3HHV4NR6ZSZMFDM7Z5PXO3RSN6SA3U6NVU4ZTA/m/src/main/java/org/apache/maven/report/projectinfo/AbstractProjectInfoReport.java
uses unchecked or unsafe operations.
[linux-jdk8] [INFO] /home/jenkins/jenkins-slave/workspace/-info-reports-plugin_master-32Y3P743XLZN3V3HHV4NR6ZSZMFDM7Z5PXO3RSN6SA3U6NVU4ZTA/m/src/main/java/org/apache/maven/report/projectinfo/AbstractProjectInfoReport.java:
Recompile with -Xlint:unchecked for details.
[linux-jdk8] [INFO] 
[linux-jdk8] [INFO] --- maven-plugin-plugin:3.4:descriptor (default-descriptor) @ maven-project-info-reports-plugin
---
[linux-jdk8] [INFO] Using 'UTF-8' encoding to read mojo metadata.
[linux-jdk8] [INFO] Mojo extractor with id: java-javadoc found 0 mojo descriptors.
[linux-jdk8] [INFO] Mojo extractor with id: java-annotations found 17 mojo descriptors.
[linux-jdk8] [INFO] 
[linux-jdk8] [INFO] --- maven-resources-plugin:2.7:testResources (default-testResources) @
maven-project-info-reports-plugin ---
[linux-jdk8] [INFO] Using 'UTF-8' encoding to copy filtered resources.
[linux-jdk8] [INFO] Copying 22 resources
[linux-jdk8] [INFO] Copying 3 resources
[linux-jdk8] [INFO] 
[linux-jdk8] [INFO] --- maven-compiler-plugin:3.5.1:testCompile (default-testCompile) @ maven-project-info-reports-plugin
---
[linux-jdk7] Sending interrupt signal to process
[linux-jdk7] [INFO] Using 'UTF-8' encoding to read mojo metadata.
[linux-jdk8] [INFO] Changes detected - recompiling the module!
[linux-jdk8] [INFO] Compiling 36 source files to /home/jenkins/jenkins-slave/workspace/-info-reports-plugin_master-32Y3P743XLZN3V3HHV4NR6ZSZMFDM7Z5PXO3RSN6SA3U6NVU4ZTA/m/target/test-classes
[linux-jdk8] [INFO] /home/jenkins/jenkins-slave/workspace/-info-reports-plugin_master-32Y3P743XLZN3V3HHV4NR6ZSZMFDM7Z5PXO3RSN6SA3U6NVU4ZTA/m/src/test/java/org/apache/maven/report/projectinfo/stubs/ProjectInfoPluginArtifactStub.java:
/home/jenkins/jenkins-slave/workspace/-info-reports-plugin_master-32Y3P743XLZN3V3HHV4NR6ZSZMFDM7Z5PXO3RSN6SA3U6NVU4ZTA/m/src/test/java/org/apache/maven/report/projectinfo/stubs/ProjectInfoPluginArtifactStub.java
uses unchecked or unsafe operations.
[linux-jdk8] [INFO] /home/jenkins/jenkins-slave/workspace/-info-reports-plugin_master-32Y3P743XLZN3V3HHV4NR6ZSZMFDM7Z5PXO3RSN6SA3U6NVU4ZTA/m/src/test/java/org/apache/maven/report/projectinfo/stubs/ProjectInfoPluginArtifactStub.java:
Recompile with -Xlint:unchecked for details.
[linux-jdk8] [INFO] 
[linux-jdk8] [INFO] --- maven-surefire-plugin:2.19.1:test (default-test) @ maven-project-info-reports-plugin
---
[linux-jdk8] [INFO] Downloading from central: https://repo.maven.apache.org/maven2/org/apache/maven/surefire/maven-surefire-common/2.19.1/maven-surefire-common-2.19.1.pom
[linux-jdk8] [INFO] Downloaded from central: https://repo.maven.apache.org/maven2/org/apache/maven/surefire/maven-surefire-common/2.19.1/maven-surefire-common-2.19.1.pom
(7.3 kB at 458 kB/s)
[linux-jdk8] [INFO] Downloading from central: https://repo.maven.apache.org/maven2/org/apache/maven/plugin-tools/maven-plugin-annotations/3.3/maven-plugin-annotations-3.3.pom
[linux-jdk8] [INFO] Downloaded from central: https://repo.maven.apache.org/maven2/org/apache/maven/plugin-tools/maven-plugin-annotations/3.3/maven-plugin-annotations-3.3.pom
(1.6 kB at 125 kB/s)
[linux-jdk8] [INFO] Downloading from central: https://repo.maven.apache.org/maven2/org/apache/maven/plugin-tools/maven-plugin-tools/3.3/maven-plugin-tools-3.3.pom
[linux-jdk8] [INFO] Downloaded from central: https://repo.maven.apache.org/maven2/org/apache/maven/plugin-tools/maven-plugin-tools/3.3/maven-plugin-tools-3.3.pom
(13 kB at 903 kB/s)
[linux-jdk8] [INFO] Downloading from central: https://repo.maven.apache.org/maven2/org/apache/maven/surefire/surefire-api/2.19.1/surefire-api-2.19.1.pom
[linux-jdk8] [INFO] Downloaded from central: https://repo.maven.apache.org/maven2/org/apache/maven/surefire/surefire-api/2.19.1/surefire-api-2.19.1.pom
(3.5 kB at 270 kB/s)
[linux-jdk8] [INFO] Downloading from central: https://repo.maven.apache.org/maven2/org/apache/maven/surefire/surefire-booter/2.19.1/surefire-booter-2.19.1.pom
[linux-jdk8] [INFO] Downloaded from central: https://repo.maven.apache.org/maven2/org/apache/maven/surefire/surefire-booter/2.19.1/surefire-booter-2.19.1.pom
(3.2 kB at 245 kB/s)
[linux-jdk8] [INFO] Downloading from central: https://repo.maven.apache.org/maven2/junit/junit/4.12/junit-4.12.pom
[linux-jdk8] [INFO] Downloaded from central: https://repo.maven.apache.org/maven2/junit/junit/4.12/junit-4.12.pom
(24 kB at 1.7 MB/s)
[linux-jdk8] [INFO] Downloading from central: https://repo.maven.apache.org/maven2/org/apache/commons/commons-lang3/3.1/commons-lang3-3.1.pom
[linux-jdk8] [INFO] Downloaded from central: https://repo.maven.apache.org/maven2/org/apache/commons/commons-lang3/3.1/commons-lang3-3.1.pom
(17 kB at 1.3 MB/s)
[linux-jdk8] [INFO] Downloading from central: https://repo.maven.apache.org/maven2/org/apache/commons/commons-parent/22/commons-parent-22.pom
[linux-jdk8] [INFO] Downloaded from central: https://repo.maven.apache.org/maven2/org/apache/commons/commons-parent/22/commons-parent-22.pom
(42 kB at 3.0 MB/s)
[linux-jdk8] [INFO] Downloading from central: https://repo.maven.apache.org/maven2/org/apache/maven/surefire/maven-surefire-common/2.19.1/maven-surefire-common-2.19.1.jar
[linux-jdk8] [INFO] Downloading from central: https://repo.maven.apache.org/maven2/org/apache/maven/surefire/surefire-booter/2.19.1/surefire-booter-2.19.1.jar
[linux-jdk8] [INFO] Downloading from central: https://repo.maven.apache.org/maven2/junit/junit/4.12/junit-4.12.jar
[linux-jdk8] [INFO] Downloading from central: https://repo.maven.apache.org/maven2/org/apache/commons/commons-lang3/3.1/commons-lang3-3.1.jar
[linux-jdk8] [INFO] Downloading from central: https://repo.maven.apache.org/maven2/org/apache/maven/surefire/surefire-api/2.19.1/surefire-api-2.19.1.jar
[linux-jdk8] [INFO] Downloaded from central: https://repo.maven.apache.org/maven2/org/apache/maven/surefire/surefire-booter/2.19.1/surefire-booter-2.19.1.jar
(46 kB at 2.4 MB/s)
[linux-jdk8] [INFO] Downloading from central: https://repo.maven.apache.org/maven2/org/apache/maven/plugin-tools/maven-plugin-annotations/3.3/maven-plugin-annotations-3.3.jar
[linux-jdk8] [INFO] Downloaded from central: https://repo.maven.apache.org/maven2/org/apache/maven/surefire/surefire-api/2.19.1/surefire-api-2.19.1.jar
(196 kB at 6.8 MB/s)
[linux-jdk8] [INFO] Downloaded from central: https://repo.maven.apache.org/maven2/org/apache/maven/plugin-tools/maven-plugin-annotations/3.3/maven-plugin-annotations-3.3.jar
(14 kB at 453 kB/s)
[linux-jdk8] [INFO] Downloaded from central: https://repo.maven.apache.org/maven2/junit/junit/4.12/junit-4.12.jar
(315 kB at 7.7 MB/s)
[linux-jdk8] [INFO] Downloaded from central: https://repo.maven.apache.org/maven2/org/apache/commons/commons-lang3/3.1/commons-lang3-3.1.jar
(316 kB at 7.7 MB/s)
[linux-jdk8] [INFO] Downloaded from central: https://repo.maven.apache.org/maven2/org/apache/maven/surefire/maven-surefire-common/2.19.1/maven-surefire-common-2.19.1.jar
(293 kB at 6.6 MB/s)
[linux-jdk8] Sending interrupt signal to process
[linux-jdk8] [INFO] Downloading from central: https://repo.maven.apache.org/maven2/org/apache/maven/surefire/surefire-junit3/2.19.1/surefire-junit3-2.19.1.pom
[linux-jdk8] [INFO] Downloaded from central: https://repo.maven.apache.org/maven2/org/apache/maven/surefire/surefire-junit3/2.19.1/surefire-junit3-2.19.1.pom
(2.5 kB at 206 kB/s)
[linux-jdk8] [INFO] Downloading from central: https://repo.maven.apache.org/maven2/org/apache/maven/surefire/surefire-providers/2.19.1/surefire-providers-2.19.1.pom
[linux-jdk8] [INFO] Downloaded from central: https://repo.maven.apache.org/maven2/org/apache/maven/surefire/surefire-providers/2.19.1/surefire-providers-2.19.1.pom
(2.6 kB at 233 kB/s)
[linux-jdk8] [INFO] Downloading from central: https://repo.maven.apache.org/maven2/org/apache/maven/surefire/surefire-junit3/2.19.1/surefire-junit3-2.19.1.jar
[linux-jdk8] [INFO] Downloaded from central: https://repo.maven.apache.org/maven2/org/apache/maven/surefire/surefire-junit3/2.19.1/surefire-junit3-2.19.1.jar
(26 kB at 1.2 MB/s)
[linux-jdk8] 
[linux-jdk8] -------------------------------------------------------
[linux-jdk8]  T E S T S
[linux-jdk8] -------------------------------------------------------
[linux-jdk8] Picked up JAVA_TOOL_OPTIONS: -Dmaven.ext.class.path="/home/jenkins/jenkins-slave/workspace/-info-reports-plugin_master-32Y3P743XLZN3V3HHV4NR6ZSZMFDM7Z5PXO3RSN6SA3U6NVU4ZTA@tmp/withMavenb20541cc/pipeline-maven-spy.jar"
-Dorg.jenkinsci.plugins.pipeline.maven.reportsFolder="/home/jenkins/jenkins-slave/workspace/-info-reports-plugin_master-32Y3P743XLZN3V3HHV4NR6ZSZMFDM7Z5PXO3RSN6SA3U6NVU4ZTA@tmp/withMavenb20541cc"

[linux-jdk8] 
[linux-jdk8] Results :
[linux-jdk8] 
[linux-jdk8] Tests run: 0, Failures: 0, Errors: 0, Skipped: 0
[linux-jdk8] 
[linux-jdk8] [INFO] ------------------------------------------------------------------------
[linux-jdk8] [INFO] BUILD FAILURE
[linux-jdk8] [INFO] ------------------------------------------------------------------------
[linux-jdk8] [INFO] Total time: 25.857 s
[linux-jdk8] [INFO] Finished at: 2017-12-28T15:30:03Z
[linux-jdk8] [INFO] Final Memory: 60M/2023M
[linux-jdk8] [INFO] ------------------------------------------------------------------------
[linux-jdk8] [INFO] [jenkins-event-spy] Generated /home/jenkins/jenkins-slave/workspace/-info-reports-plugin_master-32Y3P743XLZN3V3HHV4NR6ZSZMFDM7Z5PXO3RSN6SA3U6NVU4ZTA@tmp/withMavenb20541cc/maven-spy-20171228-152937-6046257024403710850011.log
[linux-jdk8] [ERROR] Failed to execute goal org.apache.maven.plugins:maven-surefire-plugin:2.19.1:test
(default-test) on project maven-project-info-reports-plugin: Execution default-test of goal
org.apache.maven.plugins:maven-surefire-plugin:2.19.1:test failed: The forked VM terminated
without properly saying goodbye. VM crash or System.exit called?
[linux-jdk8] [ERROR] Command was /bin/sh -c cd /home/jenkins/jenkins-slave/workspace/-info-reports-plugin_master-32Y3P743XLZN3V3HHV4NR6ZSZMFDM7Z5PXO3RSN6SA3U6NVU4ZTA/m
&& /usr/local/asfpackages/java/jdk1.8.0_152/jre/bin/java -jar /home/jenkins/jenkins-slave/workspace/-info-reports-plugin_master-32Y3P743XLZN3V3HHV4NR6ZSZMFDM7Z5PXO3RSN6SA3U6NVU4ZTA/m/target/surefire/surefirebooter2068146760078284092.jar
/home/jenkins/jenkins-slave/workspace/-info-reports-plugin_master-32Y3P743XLZN3V3HHV4NR6ZSZMFDM7Z5PXO3RSN6SA3U6NVU4ZTA/m/target/surefire/surefire5656371643923444303tmp
/home/jenkins/jenkins-slave/workspace/-info-reports-plugin_master-32Y3P743XLZN3V3HHV4NR6ZSZMFDM7Z5PXO3RSN6SA3U6NVU4ZTA/m/target/surefire/surefire_02404317405631753466tmp
[linux-jdk8] [ERROR] -> [Help 1]
[linux-jdk8] [ERROR] 
[linux-jdk8] [ERROR] To see the full stack trace of the errors, re-run Maven with the -e switch.
[linux-jdk8] [ERROR] Re-run Maven using the -X switch to enable full debug logging.
[linux-jdk8] [ERROR] 
[linux-jdk8] [ERROR] For more information about the errors and possible solutions, please
read the following articles:
[linux-jdk8] [ERROR] [Help 1] http://cwiki.apache.org/confluence/display/MAVEN/PluginExecutionException
[Pipeline] [windows-jdk7] // node
[Pipeline] [windows-jdk8] // node
[Pipeline] [windows-jdk9] // node
[Pipeline] [windows-jdk7] }
[windows-jdk7] Failed in branch windows-jdk7
[Pipeline] [windows-jdk8] }
[windows-jdk8] Failed in branch windows-jdk8
[Pipeline] [windows-jdk9] }
[windows-jdk9] Failed in branch windows-jdk9
[Pipeline] [linux-jdk7] }
[Pipeline] [linux-jdk7] // dir
[Pipeline] [linux-jdk7] }
[linux-jdk7] [withMaven] One or multiple Maven executions have been ignored by the Jenkins
Pipeline Maven Plugin because they have been interrupted before completion (1). See Pipeline
Maven Plugin FAQ for more details.
[Pipeline] [linux-jdk7] // withMaven
[Pipeline] [linux-jdk8] }
[Pipeline] [linux-jdk7] }
[Pipeline] [linux-jdk8] // dir
[Pipeline] [linux-jdk7] // stage
[Pipeline] [linux-jdk7] }
[Pipeline] [linux-jdk8] }
[linux-jdk8] [withMaven] Skip 'Generated Artifacts Publisher' disabled by configuration
[linux-jdk8] [withMaven] junitPublisher - Archive test results for Maven artifact org.apache.maven.plugins:maven-project-info-reports-plugin:2.10-SNAPSHOT
generated by maven-surefire-plugin:test (default-test): m/target/surefire-reports/*.xml
[linux-jdk8] [withMaven] junitPublisher - Jenkins JUnit Attachments Plugin not found, can't
publish test attachments.Recording test results
[linux-jdk8] None of the test reports contained any result
[linux-jdk8] [withMaven] Skip 'Findbugs Publisher' disabled by configuration
[linux-jdk8] [withMaven] Skip 'Open Task Scanner Publisher' disabled by configuration
[Pipeline] [linux-jdk7] // node
[Pipeline] [linux-jdk8] // withMaven
[Pipeline] [linux-jdk7] }
[linux-jdk7] Failed in branch linux-jdk7
[Pipeline] [linux-jdk8] }
[Pipeline] [linux-jdk8] // stage
[Pipeline] [linux-jdk8] }
[Pipeline] [linux-jdk8] // node
[Pipeline] [linux-jdk8] }
[linux-jdk8] Failed in branch linux-jdk8
[Pipeline] // parallel
[Pipeline] stage
[Pipeline] { (Notifications)
[Pipeline] echo
Build result: FAILURE
[Pipeline] jiraIssueSelector
[Pipeline] jiraComment
[Pipeline] emailext
Mime
  • Unnamed multipart/mixed (inline, None, 0 bytes)
View raw message