maven-notifications mailing list archives

Site index · List index
Message view « Date » · « Thread »
Top « Date » · « Thread »
From Apache Jenkins Server <jenk...@builds.apache.org>
Subject Build failed in Jenkins: Maven TLP » maven-archiver » MSHARED-668-test #6
Date Thu, 28 Dec 2017 13:48:46 GMT
See https://builds.apache.org/job/maven-box/job/maven-archiver/job/MSHARED-668-test/6/

Changes:

* Upgrade to 3.1.1-SNAPSHOT of plexus-utils for testing purposes.
* Upgrade to 3.1.1-SNAPSHOT of plexus-utils for testing purposes.
* Upgrade to 3.1.1-SNAPSHOT of plexus-utils for testing purposes.
* Upgrade to 3.1.1-SNAPSHOT of plexus-utils for testing purposes.
* Upgrade to 3.1.1-SNAPSHOT of plexus-utils for testing purposes.
* Upgrade to 3.1.1-SNAPSHOT of plexus-utils for testing purposes.

No tests ran.

Build log:
[...truncated 50.44 KB...]
[windows-jdk8] [ERROR] To see the full stack trace of the errors, re-run Maven with the -e
switch.
[windows-jdk8] [ERROR] Re-run Maven using the -X switch to enable full debug logging.
[windows-jdk8] [ERROR] 
[windows-jdk8] [ERROR] For more information about the errors and possible solutions, please
read the following articles:
[windows-jdk8] [ERROR] [Help 1] http://cwiki.apache.org/confluence/display/MAVEN/DependencyResolutionException
[windows-jdk8] Picked up JAVA_TOOL_OPTIONS: -Dmaven.ext.class.path="f:\jenkins\jenkins-slave\workspace\n-archiver_MSHARED-668-test-WG4DQP6EJS2N73J3VGM2JH6SMRRHF477RDRLQRWF4WAHIMWMG5OA@2@tmp\withMaven8070042e\pipeline-maven-spy.jar"
-Dorg.jenkinsci.plugins.pipeline.maven.reportsFolder="f:\jenkins\jenkins-slave\workspace\n-archiver_MSHARED-668-test-WG4DQP6EJS2N73J3VGM2JH6SMRRHF477RDRLQRWF4WAHIMWMG5OA@2@tmp\withMaven8070042e"

[windows-jdk7] [INFO] Downloading: http://repository.apache.org/snapshots/org/codehaus/plexus/plexus-utils/3.1.1-SNAPSHOT/maven-metadata.xml
[windows-jdk7] [INFO] Downloading: http://repository.apache.org/snapshots/org/codehaus/plexus/plexus-utils/3.1.1-SNAPSHOT/maven-metadata.xml
[linux-jdk9] [INFO] [jenkins-event-spy] Generate /home/jenkins/jenkins-slave/workspace/n-archiver_MSHARED-668-test-WG4DQP6EJS2N73J3VGM2JH6SMRRHF477RDRLQRWF4WAHIMWMG5OA@tmp/withMaven16d62b40/maven-spy-20171228-134741-20115991440919496403948.log.tmp
...
[linux-jdk9] [INFO] Scanning for projects...
[windows-jdk9] Apache Maven 3.5.0 (ff8f5e7444045639af65f6095c62210b5713f426; 2017-04-03T19:39:06Z)
[windows-jdk9] Maven home: F:\jenkins\tools\maven\apache-maven-3.5.0\bin\..
[windows-jdk9] Java version: 9.0.1, vendor: Oracle Corporation
[windows-jdk9] Java home: f:\jenkins\tools\java\latest9
[windows-jdk9] Default locale: en_US, platform encoding: Cp1252
[windows-jdk9] OS name: "windows server 2012 r2", version: "6.3", arch: "amd64", family: "windows"
[windows-jdk7] [INFO] Downloading: http://repository.apache.org/snapshots/org/codehaus/plexus/plexus-utils/3.1.1-SNAPSHOT/plexus-utils-3.1.1-SNAPSHOT.pom
[windows-jdk7] [WARNING] The POM for org.codehaus.plexus:plexus-utils:jar:3.1.1-SNAPSHOT is
missing, no dependency information available
[windows-jdk7] [INFO] Downloading: http://repository.apache.org/snapshots/org/codehaus/plexus/plexus-utils/3.1.1-SNAPSHOT/plexus-utils-3.1.1-SNAPSHOT.jar
[windows-jdk7] [INFO] ------------------------------------------------------------------------
[windows-jdk7] [INFO] BUILD FAILURE
[windows-jdk7] [INFO] ------------------------------------------------------------------------
[windows-jdk7] [INFO] Total time: 2.422 s
[windows-jdk7] [INFO] Finished at: 2017-12-28T13:47:40Z
[windows-jdk7] [INFO] Final Memory: 13M/368M
[windows-jdk7] [INFO] ------------------------------------------------------------------------
[windows-jdk7] [WARNING] The requested profile "run-its" could not be activated because it
does not exist.
[windows-jdk7] [INFO] [jenkins-event-spy] Generated F:\jenkins\jenkins-slave\workspace\n-archiver_MSHARED-668-test-WG4DQP6EJS2N73J3VGM2JH6SMRRHF477RDRLQRWF4WAHIMWMG5OA@tmp\withMaven1435aec1\maven-spy-20171228-134737-1431900701422368419463.log
[windows-jdk7] [ERROR] Failed to execute goal on project maven-archiver: Could not resolve
dependencies for project org.apache.maven:maven-archiver:jar:3.2.1-SNAPSHOT: Could not find
artifact org.codehaus.plexus:plexus-utils:jar:3.1.1-SNAPSHOT in apache-snapshots (http://repository.apache.org/snapshots/)
-> [Help 1]
[windows-jdk7] [ERROR] 
[windows-jdk7] [ERROR] To see the full stack trace of the errors, re-run Maven with the -e
switch.
[windows-jdk7] [ERROR] Re-run Maven using the -X switch to enable full debug logging.
[windows-jdk7] [ERROR] 
[windows-jdk7] [ERROR] For more information about the errors and possible solutions, please
read the following articles:
[windows-jdk7] [ERROR] [Help 1] http://cwiki.apache.org/confluence/display/MAVEN/DependencyResolutionException
[windows-jdk7] Picked up JAVA_TOOL_OPTIONS: -Dmaven.ext.class.path="f:\jenkins\jenkins-slave\workspace\n-archiver_MSHARED-668-test-WG4DQP6EJS2N73J3VGM2JH6SMRRHF477RDRLQRWF4WAHIMWMG5OA@tmp\withMaven1435aec1\pipeline-maven-spy.jar"
-Dorg.jenkinsci.plugins.pipeline.maven.reportsFolder="f:\jenkins\jenkins-slave\workspace\n-archiver_MSHARED-668-test-WG4DQP6EJS2N73J3VGM2JH6SMRRHF477RDRLQRWF4WAHIMWMG5OA@tmp\withMaven1435aec1"

[linux-jdk9] [INFO] 
[linux-jdk9] [INFO] ------------------------------------------------------------------------
[linux-jdk9] [INFO] Building Apache Maven Archiver 3.2.1-SNAPSHOT
[linux-jdk9] [INFO] ------------------------------------------------------------------------
[linux-jdk9] [INFO] Downloading from Nexus: http://repository.apache.org/snapshots/org/codehaus/plexus/plexus-utils/3.1.1-SNAPSHOT/maven-metadata.xml
[linux-jdk9] [INFO] Downloading from Nexus: http://repository.apache.org/snapshots/org/codehaus/plexus/plexus-utils/3.1.1-SNAPSHOT/plexus-utils-3.1.1-SNAPSHOT.pom
[linux-jdk9] [WARNING] The POM for org.codehaus.plexus:plexus-utils:jar:3.1.1-SNAPSHOT is
missing, no dependency information available
[linux-jdk9] [INFO] Downloading from Nexus: http://repository.apache.org/snapshots/org/codehaus/plexus/plexus-utils/3.1.1-SNAPSHOT/plexus-utils-3.1.1-SNAPSHOT.jar
[linux-jdk9] [INFO] ------------------------------------------------------------------------
[linux-jdk9] [INFO] BUILD FAILURE
[linux-jdk9] [INFO] ------------------------------------------------------------------------
[linux-jdk9] [INFO] Total time: 1.616 s
[linux-jdk9] [INFO] Finished at: 2017-12-28T13:47:43Z
[linux-jdk9] [INFO] Final Memory: 13M/44M
[linux-jdk9] [INFO] ------------------------------------------------------------------------
[linux-jdk9] [WARNING] The requested profile "run-its" could not be activated because it does
not exist.
[linux-jdk9] [INFO] [jenkins-event-spy] Generated /home/jenkins/jenkins-slave/workspace/n-archiver_MSHARED-668-test-WG4DQP6EJS2N73J3VGM2JH6SMRRHF477RDRLQRWF4WAHIMWMG5OA@tmp/withMaven16d62b40/maven-spy-20171228-134741-20115991440919496403948.log
[linux-jdk9] [ERROR] Failed to execute goal on project maven-archiver: Could not resolve dependencies
for project org.apache.maven:maven-archiver:jar:3.2.1-SNAPSHOT: Could not find artifact org.codehaus.plexus:plexus-utils:jar:3.1.1-SNAPSHOT
in Nexus (http://repository.apache.org/snapshots) -> [Help 1]
[linux-jdk9] [ERROR] 
[linux-jdk9] [ERROR] To see the full stack trace of the errors, re-run Maven with the -e switch.
[linux-jdk9] [ERROR] Re-run Maven using the -X switch to enable full debug logging.
[linux-jdk9] [ERROR] 
[linux-jdk9] [ERROR] For more information about the errors and possible solutions, please
read the following articles:
[linux-jdk9] [ERROR] [Help 1] http://cwiki.apache.org/confluence/display/MAVEN/DependencyResolutionException
[windows-jdk9] [INFO] [jenkins-event-spy] Generate F:\jenkins\jenkins-slave\workspace\n-archiver_MSHARED-668-test-WG4DQP6EJS2N73J3VGM2JH6SMRRHF477RDRLQRWF4WAHIMWMG5OA@tmp\withMaven8898a794\maven-spy-20171228-134741-4726065386195398938241.log.tmp
...
[windows-jdk9] [INFO] Scanning for projects...
[windows-jdk9] [INFO] 
[windows-jdk9] [INFO] ------------------------------------------------------------------------
[windows-jdk9] [INFO] Building Apache Maven Archiver 3.2.1-SNAPSHOT
[windows-jdk9] [INFO] ------------------------------------------------------------------------
[windows-jdk9] [INFO] Downloading: http://repository.apache.org/snapshots/org/codehaus/plexus/plexus-utils/3.1.1-SNAPSHOT/maven-metadata.xml
[windows-jdk9] [INFO] Downloading: http://repository.apache.org/snapshots/org/codehaus/plexus/plexus-utils/3.1.1-SNAPSHOT/maven-metadata.xml
[windows-jdk9] [INFO] Downloading: http://repository.apache.org/snapshots/org/codehaus/plexus/plexus-utils/3.1.1-SNAPSHOT/plexus-utils-3.1.1-SNAPSHOT.pom
[windows-jdk9] [WARNING] The POM for org.codehaus.plexus:plexus-utils:jar:3.1.1-SNAPSHOT is
missing, no dependency information available
[windows-jdk9] [INFO] Downloading: http://repository.apache.org/snapshots/org/codehaus/plexus/plexus-utils/3.1.1-SNAPSHOT/plexus-utils-3.1.1-SNAPSHOT.jar
[windows-jdk9] [INFO] ------------------------------------------------------------------------
[windows-jdk9] [INFO] BUILD FAILURE
[windows-jdk9] [INFO] ------------------------------------------------------------------------
[windows-jdk9] [INFO] Total time: 2.772 s
[windows-jdk9] [INFO] Finished at: 2017-12-28T13:47:44Z
[windows-jdk9] [INFO] Final Memory: 13M/44M
[windows-jdk9] [INFO] ------------------------------------------------------------------------
[windows-jdk9] [WARNING] The requested profile "run-its" could not be activated because it
does not exist.
[windows-jdk9] [INFO] [jenkins-event-spy] Generated F:\jenkins\jenkins-slave\workspace\n-archiver_MSHARED-668-test-WG4DQP6EJS2N73J3VGM2JH6SMRRHF477RDRLQRWF4WAHIMWMG5OA@tmp\withMaven8898a794\maven-spy-20171228-134741-4726065386195398938241.log
[windows-jdk9] [ERROR] Failed to execute goal on project maven-archiver: Could not resolve
dependencies for project org.apache.maven:maven-archiver:jar:3.2.1-SNAPSHOT: Could not find
artifact org.codehaus.plexus:plexus-utils:jar:3.1.1-SNAPSHOT in apache-snapshots (http://repository.apache.org/snapshots/)
-> [Help 1]
[windows-jdk9] [ERROR] 
[windows-jdk9] [ERROR] To see the full stack trace of the errors, re-run Maven with the -e
switch.
[windows-jdk9] [ERROR] Re-run Maven using the -X switch to enable full debug logging.
[windows-jdk9] [ERROR] 
[windows-jdk9] [ERROR] For more information about the errors and possible solutions, please
read the following articles:
[windows-jdk9] [ERROR] [Help 1] http://cwiki.apache.org/confluence/display/MAVEN/DependencyResolutionException
[Pipeline] [linux-jdk8] withMaven
[linux-jdk8] [withMaven] Options: [org.jenkinsci.plugins.pipeline.maven.publishers.GeneratedArtifactsPublisher[disabled=true],
org.jenkinsci.plugins.pipeline.maven.publishers.JunitTestsPublisher[disabled=false], org.jenkinsci.plugins.pipeline.maven.publishers.FindbugsAnalysisPublisher[disabled=true],
org.jenkinsci.plugins.pipeline.maven.publishers.TasksScannerPublisher[disabled=true], org.jenkinsci.plugins.pipeline.maven.publishers.DependenciesFingerprintPublisher[disabled=false,
scopes=[compile, provided, runtime], versions={snapshot:true, release:false}], org.jenkinsci.plugins.pipeline.maven.publishers.InvokerRunsPublisher[disabled=false],
org.jenkinsci.plugins.pipeline.maven.publishers.PipelineGraphPublisher[disabled=false, scopes=[compile,
provided, runtime], versions={snapshot:true, release:false}, skipDownstreamTriggers=false,
lifecycleThreshold=deploy, ignoreUpstreamTriggers=false]]
[linux-jdk8] [withMaven] Available options: 
[linux-jdk8] [withMaven] use JDK installation JDK 1.8 (latest)
[linux-jdk8] [withMaven] use Maven installation 'Maven 3.5.2'
[Pipeline] [linux-jdk8] {
[Pipeline] [linux-jdk7] // stage
[Pipeline] [linux-jdk7] stage
[Pipeline] [linux-jdk7] { (Build linux-jdk7)
[Pipeline] [linux-jdk8] dir
[linux-jdk8] Running in /home/jenkins/jenkins-slave/workspace/n-archiver_MSHARED-668-test-WG4DQP6EJS2N73J3VGM2JH6SMRRHF477RDRLQRWF4WAHIMWMG5OA/m
[Pipeline] [linux-jdk8] {
[Pipeline] [linux-jdk7] withMaven
[linux-jdk7] [withMaven] Options: [org.jenkinsci.plugins.pipeline.maven.publishers.GeneratedArtifactsPublisher[disabled=false],
org.jenkinsci.plugins.pipeline.maven.publishers.JunitTestsPublisher[disabled=false], org.jenkinsci.plugins.pipeline.maven.publishers.FindbugsAnalysisPublisher[disabled=false],
org.jenkinsci.plugins.pipeline.maven.publishers.TasksScannerPublisher[disabled=false], org.jenkinsci.plugins.pipeline.maven.publishers.DependenciesFingerprintPublisher[disabled=false,
scopes=[compile, provided, runtime], versions={snapshot:true, release:false}], org.jenkinsci.plugins.pipeline.maven.publishers.InvokerRunsPublisher[disabled=false],
org.jenkinsci.plugins.pipeline.maven.publishers.PipelineGraphPublisher[disabled=false, scopes=[compile,
provided, runtime], versions={snapshot:true, release:false}, skipDownstreamTriggers=false,
lifecycleThreshold=deploy, ignoreUpstreamTriggers=false]]
[linux-jdk7] [withMaven] Available options: 
[linux-jdk7] [withMaven] use JDK installation JDK 1.7 (latest)
[linux-jdk7] [withMaven] use Maven installation 'Maven 3.5.2'
[Pipeline] [linux-jdk7] {
[Pipeline] [linux-jdk8] isUnix
[Pipeline] [linux-jdk8] sh
[linux-jdk8] [m] Running shell script
[Pipeline] [windows-jdk8] }
[Pipeline] [windows-jdk7] }
[Pipeline] [linux-jdk9] }
[Pipeline] [windows-jdk9] }
[Pipeline] [linux-jdk7] dir
[linux-jdk7] Running in /home/jenkins/jenkins-slave/workspace/n-archiver_MSHARED-668-test-WG4DQP6EJS2N73J3VGM2JH6SMRRHF477RDRLQRWF4WAHIMWMG5OA/m
[Pipeline] [linux-jdk7] {
[linux-jdk8] + mvn -P+run-its -Dmaven.test.failure.ignore=true -Dfindbugs.failOnError=false
-Dfindbugs.skip=true clean verify
[linux-jdk8] ----- withMaven Wrapper script -----
[linux-jdk8] Picked up JAVA_TOOL_OPTIONS: -Dmaven.ext.class.path="/home/jenkins/jenkins-slave/workspace/n-archiver_MSHARED-668-test-WG4DQP6EJS2N73J3VGM2JH6SMRRHF477RDRLQRWF4WAHIMWMG5OA@tmp/withMaven40de9117/pipeline-maven-spy.jar"
-Dorg.jenkinsci.plugins.pipeline.maven.reportsFolder="/home/jenkins/jenkins-slave/workspace/n-archiver_MSHARED-668-test-WG4DQP6EJS2N73J3VGM2JH6SMRRHF477RDRLQRWF4WAHIMWMG5OA@tmp/withMaven40de9117"

[linux-jdk8] Apache Maven 3.5.2 (138edd61fd100ec658bfa2d307c43b76940a5d7d; 2017-10-18T07:58:13Z)
[linux-jdk8] Maven home: /home/jenkins/tools/maven/apache-maven-3.5.2
[linux-jdk8] Java version: 1.8.0_152, vendor: Oracle Corporation
[linux-jdk8] Java home: /usr/local/asfpackages/java/jdk1.8.0_152/jre
[linux-jdk8] Default locale: en_US, platform encoding: ISO-8859-1
[linux-jdk8] OS name: "linux", version: "4.4.0-43-generic", arch: "amd64", family: "unix"
[Pipeline] [linux-jdk7] isUnix
[Pipeline] [linux-jdk7] sh
[linux-jdk7] [m] Running shell script
[Pipeline] [windows-jdk8] // dir
[Pipeline] [windows-jdk7] // dir
[Pipeline] [linux-jdk9] // dir
[Pipeline] [windows-jdk9] // dir
[linux-jdk7] + mvn -P+run-its -Dmaven.test.failure.ignore=true -Dfindbugs.failOnError=false
clean verify
[linux-jdk7] ----- withMaven Wrapper script -----
[linux-jdk7] Picked up JAVA_TOOL_OPTIONS: -Dmaven.ext.class.path="/home/jenkins/jenkins-slave/workspace/n-archiver_MSHARED-668-test-WG4DQP6EJS2N73J3VGM2JH6SMRRHF477RDRLQRWF4WAHIMWMG5OA@tmp/withMaven1ba80b2b/pipeline-maven-spy.jar"
-Dorg.jenkinsci.plugins.pipeline.maven.reportsFolder="/home/jenkins/jenkins-slave/workspace/n-archiver_MSHARED-668-test-WG4DQP6EJS2N73J3VGM2JH6SMRRHF477RDRLQRWF4WAHIMWMG5OA@tmp/withMaven1ba80b2b"

[linux-jdk7] Apache Maven 3.5.2 (138edd61fd100ec658bfa2d307c43b76940a5d7d; 2017-10-18T07:58:13Z)
[linux-jdk7] Maven home: /home/jenkins/tools/maven/apache-maven-3.5.2
[linux-jdk7] Java version: 1.7.0_80, vendor: Oracle Corporation
[linux-jdk7] Java home: /usr/local/asfpackages/java/jdk1.7.0_80/jre
[linux-jdk7] Default locale: en_US, platform encoding: ISO-8859-1
[linux-jdk7] OS name: "linux", version: "4.4.0-98-generic", arch: "amd64", family: "unix"
[linux-jdk8] [INFO] [jenkins-event-spy] Generate /home/jenkins/jenkins-slave/workspace/n-archiver_MSHARED-668-test-WG4DQP6EJS2N73J3VGM2JH6SMRRHF477RDRLQRWF4WAHIMWMG5OA@tmp/withMaven40de9117/maven-spy-20171228-134840-456773934700711231125.log.tmp
...
[linux-jdk8] [INFO] Scanning for projects...
[linux-jdk8] [INFO] 
[linux-jdk8] [INFO] ------------------------------------------------------------------------
[linux-jdk8] [INFO] Building Apache Maven Archiver 3.2.1-SNAPSHOT
[linux-jdk8] [INFO] ------------------------------------------------------------------------
[linux-jdk8] [INFO] Downloading from Nexus: http://repository.apache.org/snapshots/org/codehaus/plexus/plexus-utils/3.1.1-SNAPSHOT/maven-metadata.xml
[linux-jdk8] [INFO] Downloading from Nexus: http://repository.apache.org/snapshots/org/codehaus/plexus/plexus-utils/3.1.1-SNAPSHOT/plexus-utils-3.1.1-SNAPSHOT.pom
[linux-jdk7] [INFO] [jenkins-event-spy] Generate /home/jenkins/jenkins-slave/workspace/n-archiver_MSHARED-668-test-WG4DQP6EJS2N73J3VGM2JH6SMRRHF477RDRLQRWF4WAHIMWMG5OA@tmp/withMaven1ba80b2b/maven-spy-20171228-134841-9604895284012044116831.log.tmp
...
[Pipeline] [windows-jdk8] }
[windows-jdk8] [withMaven] Skip 'Generated Artifacts Publisher' disabled by configuration
[windows-jdk8] [withMaven] Skip 'Findbugs Publisher' disabled by configuration
[windows-jdk8] [withMaven] Skip 'Open Task Scanner Publisher' disabled by configuration
[Pipeline] [windows-jdk7] }
[windows-jdk7] [withMaven] Skip 'Generated Artifacts Publisher' disabled by configuration
[windows-jdk7] [withMaven] Skip 'Findbugs Publisher' disabled by configuration
[windows-jdk7] [withMaven] Skip 'Open Task Scanner Publisher' disabled by configuration
[Pipeline] [linux-jdk9] }
[linux-jdk9] [withMaven] Skip 'Generated Artifacts Publisher' disabled by configuration
[linux-jdk9] [withMaven] Skip 'Findbugs Publisher' disabled by configuration
[linux-jdk9] [withMaven] Skip 'Open Task Scanner Publisher' disabled by configuration
[Pipeline] [windows-jdk9] }
[windows-jdk9] [withMaven] Skip 'Generated Artifacts Publisher' disabled by configuration
[windows-jdk9] [withMaven] Skip 'Findbugs Publisher' disabled by configuration
[windows-jdk9] [withMaven] Skip 'Open Task Scanner Publisher' disabled by configuration
[Pipeline] [windows-jdk8] // withMaven
[Pipeline] [windows-jdk7] // withMaven
[Pipeline] [linux-jdk9] // withMaven
[Pipeline] [windows-jdk9] // withMaven
[Pipeline] [windows-jdk8] }
[Pipeline] [windows-jdk7] }
[Pipeline] [linux-jdk9] }
[Pipeline] [windows-jdk9] }
[Pipeline] [windows-jdk8] // stage
[Pipeline] [windows-jdk7] // stage
[Pipeline] [linux-jdk9] // stage
[Pipeline] [windows-jdk9] // stage
[Pipeline] [linux-jdk9] }
[Pipeline] [windows-jdk7] }
[Pipeline] [windows-jdk8] }
[Pipeline] [windows-jdk9] }
[Pipeline] [linux-jdk9] // node
[Pipeline] [windows-jdk7] // node
[Pipeline] [windows-jdk8] // node
[Pipeline] [windows-jdk9] // node
[Pipeline] [linux-jdk9] }
[linux-jdk9] Failed in branch linux-jdk9
[Pipeline] [windows-jdk7] }
[windows-jdk7] Failed in branch windows-jdk7
[Pipeline] [windows-jdk8] }
[windows-jdk8] Failed in branch windows-jdk8
[Pipeline] [windows-jdk9] }
[windows-jdk9] Failed in branch windows-jdk9
[linux-jdk8] [WARNING] The POM for org.codehaus.plexus:plexus-utils:jar:3.1.1-SNAPSHOT is
missing, no dependency information available
[linux-jdk8] [INFO] Downloading from Nexus: http://repository.apache.org/snapshots/org/codehaus/plexus/plexus-utils/3.1.1-SNAPSHOT/plexus-utils-3.1.1-SNAPSHOT.jar
[linux-jdk8] [INFO] ------------------------------------------------------------------------
[linux-jdk8] [INFO] BUILD FAILURE
[linux-jdk8] [INFO] ------------------------------------------------------------------------
[linux-jdk8] [INFO] Total time: 2.306 s
[linux-jdk8] [INFO] Finished at: 2017-12-28T13:48:42Z
[linux-jdk8] [INFO] Final Memory: 27M/1447M
[linux-jdk8] [INFO] ------------------------------------------------------------------------
[linux-jdk8] [WARNING] The requested profile "run-its" could not be activated because it does
not exist.
[linux-jdk8] [INFO] [jenkins-event-spy] Generated /home/jenkins/jenkins-slave/workspace/n-archiver_MSHARED-668-test-WG4DQP6EJS2N73J3VGM2JH6SMRRHF477RDRLQRWF4WAHIMWMG5OA@tmp/withMaven40de9117/maven-spy-20171228-134840-456773934700711231125.log
[linux-jdk8] [ERROR] Failed to execute goal on project maven-archiver: Could not resolve dependencies
for project org.apache.maven:maven-archiver:jar:3.2.1-SNAPSHOT: Could not find artifact org.codehaus.plexus:plexus-utils:jar:3.1.1-SNAPSHOT
in Nexus (http://repository.apache.org/snapshots) -> [Help 1]
[linux-jdk8] [ERROR] 
[linux-jdk8] [ERROR] To see the full stack trace of the errors, re-run Maven with the -e switch.
[linux-jdk8] [ERROR] Re-run Maven using the -X switch to enable full debug logging.
[linux-jdk8] [ERROR] 
[linux-jdk8] [ERROR] For more information about the errors and possible solutions, please
read the following articles:
[linux-jdk8] [ERROR] [Help 1] http://cwiki.apache.org/confluence/display/MAVEN/DependencyResolutionException
[linux-jdk7] Sending interrupt signal to process
[linux-jdk7] [INFO] Scanning for projects...
[linux-jdk7] [INFO] 
[linux-jdk7] [INFO] ------------------------------------------------------------------------
[linux-jdk7] [INFO] Building Apache Maven Archiver 3.2.1-SNAPSHOT
[linux-jdk7] [INFO] ------------------------------------------------------------------------
[linux-jdk8] Sending interrupt signal to process
[Pipeline] [linux-jdk8] }
[Pipeline] [linux-jdk8] // dir
[Pipeline] [linux-jdk8] }
[linux-jdk8] [withMaven] Skip 'Generated Artifacts Publisher' disabled by configuration
[linux-jdk8] [withMaven] Skip 'Findbugs Publisher' disabled by configuration
[linux-jdk8] [withMaven] Skip 'Open Task Scanner Publisher' disabled by configuration
[Pipeline] [linux-jdk8] // withMaven
[Pipeline] [linux-jdk8] }
[Pipeline] [linux-jdk7] }
[Pipeline] [linux-jdk8] // stage
[Pipeline] [linux-jdk7] // dir
[Pipeline] [linux-jdk8] }
[Pipeline] [linux-jdk7] }
[linux-jdk7] [withMaven] One or multiple Maven executions have been ignored by the Jenkins
Pipeline Maven Plugin because they have been interrupted before completion (1). See Pipeline
Maven Plugin FAQ for more details.
[Pipeline] [linux-jdk8] // node
[Pipeline] [linux-jdk7] // withMaven
[Pipeline] [linux-jdk8] }
[linux-jdk8] Failed in branch linux-jdk8
[Pipeline] [linux-jdk7] }
[Pipeline] [linux-jdk7] // stage
[Pipeline] [linux-jdk7] }
[Pipeline] [linux-jdk7] // node
[Pipeline] [linux-jdk7] }
[linux-jdk7] Failed in branch linux-jdk7
[Pipeline] // parallel
[Pipeline] stage
[Pipeline] { (Notifications)
[Pipeline] echo
Build result: FAILURE
[Pipeline] jiraIssueSelector
[Pipeline] emailext
Mime
  • Unnamed multipart/mixed (inline, None, 0 bytes)
View raw message