maven-notifications mailing list archives

Site index · List index
Message view « Date » · « Thread »
Top « Date » · « Thread »
From Apache Jenkins Server <jenk...@builds.apache.org>
Subject Build failed in Jenkins: Maven TLP » maven-archiver » MSHARED-668-test #7
Date Thu, 28 Dec 2017 13:53:36 GMT
See https://builds.apache.org/job/maven-box/job/maven-archiver/job/MSHARED-668-test/7/

Changes:

* Upgrade to 3.1.1-SNAPSHOT of plexus-utils for testing purposes. Added
* Upgrade to 3.1.1-SNAPSHOT of plexus-utils for testing purposes. Added
* Upgrade to 3.1.1-SNAPSHOT of plexus-utils for testing purposes. Added
* Upgrade to 3.1.1-SNAPSHOT of plexus-utils for testing purposes. Added
* Upgrade to 3.1.1-SNAPSHOT of plexus-utils for testing purposes. Added

No tests ran.

Build log:
[...truncated 44.49 KB...]
[linux-jdk8] Running in /home/jenkins/jenkins-slave/workspace/n-archiver_MSHARED-668-test-WG4DQP6EJS2N73J3VGM2JH6SMRRHF477RDRLQRWF4WAHIMWMG5OA/m
[Pipeline] [linux-jdk8] {
[Pipeline] [linux-jdk9] dir
[linux-jdk9] Running in /home/jenkins/jenkins-slave/workspace/n-archiver_MSHARED-668-test-WG4DQP6EJS2N73J3VGM2JH6SMRRHF477RDRLQRWF4WAHIMWMG5OA/m
[Pipeline] [linux-jdk9] {
[Pipeline] [windows-jdk7] dir
[windows-jdk7] Running in f:\jenkins\jenkins-slave\workspace\n-archiver_MSHARED-668-test-WG4DQP6EJS2N73J3VGM2JH6SMRRHF477RDRLQRWF4WAHIMWMG5OA\m
[Pipeline] [windows-jdk7] {
[Pipeline] [linux-jdk7] isUnix
[Pipeline] [linux-jdk7] sh
[linux-jdk7] [m] Running shell script
[linux-jdk7] + mvn -P+run-its -Dmaven.test.failure.ignore=true -Dfindbugs.failOnError=false
clean verify
[linux-jdk7] ----- withMaven Wrapper script -----
[linux-jdk7] Picked up JAVA_TOOL_OPTIONS: -Dmaven.ext.class.path="/home/jenkins/jenkins-slave/workspace/n-archiver_MSHARED-668-test-WG4DQP6EJS2N73J3VGM2JH6SMRRHF477RDRLQRWF4WAHIMWMG5OA@tmp/withMaven6ea32b20/pipeline-maven-spy.jar"
-Dorg.jenkinsci.plugins.pipeline.maven.reportsFolder="/home/jenkins/jenkins-slave/workspace/n-archiver_MSHARED-668-test-WG4DQP6EJS2N73J3VGM2JH6SMRRHF477RDRLQRWF4WAHIMWMG5OA@tmp/withMaven6ea32b20"

[linux-jdk7] Apache Maven 3.5.2 (138edd61fd100ec658bfa2d307c43b76940a5d7d; 2017-10-18T07:58:13Z)
[linux-jdk7] Maven home: /home/jenkins/tools/maven/apache-maven-3.5.2
[linux-jdk7] Java version: 1.7.0_80, vendor: Oracle Corporation
[linux-jdk7] Java home: /usr/local/asfpackages/java/jdk1.7.0_80/jre
[linux-jdk7] Default locale: en_US, platform encoding: ISO-8859-1
[linux-jdk7] OS name: "linux", version: "4.4.0-98-generic", arch: "amd64", family: "unix"
[linux-jdk7] [INFO] [jenkins-event-spy] Generate /home/jenkins/jenkins-slave/workspace/n-archiver_MSHARED-668-test-WG4DQP6EJS2N73J3VGM2JH6SMRRHF477RDRLQRWF4WAHIMWMG5OA@tmp/withMaven6ea32b20/maven-spy-20171228-135322-7275829910252998095148.log.tmp
...
[Pipeline] [linux-jdk8] isUnix
[Pipeline] [linux-jdk8] sh
[linux-jdk8] [m] Running shell script
[linux-jdk8] + mvn -P+run-its -Dmaven.test.failure.ignore=true -Dfindbugs.failOnError=false
-Dfindbugs.skip=true clean verify
[linux-jdk8] ----- withMaven Wrapper script -----
[linux-jdk8] Picked up JAVA_TOOL_OPTIONS: -Dmaven.ext.class.path="/home/jenkins/jenkins-slave/workspace/n-archiver_MSHARED-668-test-WG4DQP6EJS2N73J3VGM2JH6SMRRHF477RDRLQRWF4WAHIMWMG5OA@tmp/withMavenf81fb989/pipeline-maven-spy.jar"
-Dorg.jenkinsci.plugins.pipeline.maven.reportsFolder="/home/jenkins/jenkins-slave/workspace/n-archiver_MSHARED-668-test-WG4DQP6EJS2N73J3VGM2JH6SMRRHF477RDRLQRWF4WAHIMWMG5OA@tmp/withMavenf81fb989"

[linux-jdk8] Apache Maven 3.5.2 (138edd61fd100ec658bfa2d307c43b76940a5d7d; 2017-10-18T07:58:13Z)
[linux-jdk8] Maven home: /home/jenkins/tools/maven/apache-maven-3.5.2
[linux-jdk8] Java version: 1.8.0_152, vendor: Oracle Corporation
[linux-jdk8] Java home: /usr/local/asfpackages/java/jdk1.8.0_152/jre
[linux-jdk8] Default locale: en_US, platform encoding: ISO-8859-1
[linux-jdk8] OS name: "linux", version: "4.4.0-43-generic", arch: "amd64", family: "unix"
[Pipeline] [linux-jdk9] isUnix
[Pipeline] [linux-jdk9] sh
[linux-jdk9] [m] Running shell script
[Pipeline] [windows-jdk7] isUnix
[Pipeline] [windows-jdk7] bat
[windows-jdk7] [m] Running batch script
[Pipeline] [windows-jdk9] {
[Pipeline] [windows-jdk9] stage
[Pipeline] [windows-jdk9] { (Checkout windows-jdk9)
[Pipeline] [windows-jdk8] }
[Pipeline] [windows-jdk9] dir
[windows-jdk9] Running in f:\jenkins\jenkins-slave\workspace\n-archiver_MSHARED-668-test-WG4DQP6EJS2N73J3VGM2JH6SMRRHF477RDRLQRWF4WAHIMWMG5OA\m
[Pipeline] [windows-jdk9] {
[Pipeline] [windows-jdk9] checkout
[linux-jdk7] [INFO] Scanning for projects...
[windows-jdk7] 
[windows-jdk7] f:\jenkins\jenkins-slave\workspace\n-archiver_MSHARED-668-test-WG4DQP6EJS2N73J3VGM2JH6SMRRHF477RDRLQRWF4WAHIMWMG5OA\m>mvn
-P+run-its -Dmaven.test.failure.ignore=true -Dfindbugs.failOnError=false -Dfindbugs.skip=true
clean verify 
[windows-jdk7] ----- withMaven Wrapper script -----
[windows-jdk9]  > git rev-parse --is-inside-work-tree # timeout=10
[windows-jdk9] Fetching changes from the remote Git repository
[windows-jdk9]  > git config remote.origin.url https://gitbox.apache.org/repos/asf/maven-archiver.git
# timeout=10
[windows-jdk9] Fetching without tags
[Pipeline] [windows-jdk8] // dir
[Pipeline] [windows-jdk8] }
[windows-jdk8] [withMaven] Skip 'Generated Artifacts Publisher' disabled by configuration
[windows-jdk8] [withMaven] Skip 'Findbugs Publisher' disabled by configuration
[windows-jdk8] [withMaven] Skip 'Open Task Scanner Publisher' disabled by configuration
[Pipeline] [windows-jdk8] // withMaven
[windows-jdk9] Fetching upstream changes from https://gitbox.apache.org/repos/asf/maven-archiver.git
[windows-jdk9]  > git --version # timeout=10
[Pipeline] [windows-jdk8] }
[Pipeline] [windows-jdk8] // stage
[Pipeline] [windows-jdk8] }
[Pipeline] [windows-jdk8] // node
[Pipeline] [windows-jdk8] }
[linux-jdk7] Sending interrupt signal to process
[linux-jdk8] [INFO] [jenkins-event-spy] Generate /home/jenkins/jenkins-slave/workspace/n-archiver_MSHARED-668-test-WG4DQP6EJS2N73J3VGM2JH6SMRRHF477RDRLQRWF4WAHIMWMG5OA@tmp/withMavenf81fb989/maven-spy-20171228-135323-4662722088672041300150.log.tmp
...
[linux-jdk8] [INFO] Scanning for projects...
[linux-jdk9] + mvn -P+run-its -Dmaven.test.failure.ignore=true -Dfindbugs.failOnError=false
-Dfindbugs.skip=true clean verify
[linux-jdk9] ----- withMaven Wrapper script -----
[linux-jdk9] Picked up JAVA_TOOL_OPTIONS: -Dmaven.ext.class.path="/home/jenkins/jenkins-slave/workspace/n-archiver_MSHARED-668-test-WG4DQP6EJS2N73J3VGM2JH6SMRRHF477RDRLQRWF4WAHIMWMG5OA@tmp/withMaven070a30a6/pipeline-maven-spy.jar"
-Dorg.jenkinsci.plugins.pipeline.maven.reportsFolder="/home/jenkins/jenkins-slave/workspace/n-archiver_MSHARED-668-test-WG4DQP6EJS2N73J3VGM2JH6SMRRHF477RDRLQRWF4WAHIMWMG5OA@tmp/withMaven070a30a6"

[linux-jdk9] Apache Maven 3.5.2 (138edd61fd100ec658bfa2d307c43b76940a5d7d; 2017-10-18T07:58:13Z)
[linux-jdk9] Maven home: /home/jenkins/tools/maven/apache-maven-3.5.2
[linux-jdk9] Java version: 9.0.1, vendor: Oracle Corporation
[linux-jdk9] Java home: /usr/local/asfpackages/java/jdk-9.0.1
[linux-jdk9] Default locale: en_US, platform encoding: ISO-8859-1
[linux-jdk9] OS name: "linux", version: "4.4.0-43-generic", arch: "amd64", family: "unix"
[windows-jdk7] Apache Maven 3.5.0 (ff8f5e7444045639af65f6095c62210b5713f426; 2017-04-03T19:39:06Z)
[windows-jdk7] Maven home: F:\jenkins\tools\maven\apache-maven-3.5.0\bin\..
[windows-jdk7] Java version: 1.7.0_79, vendor: Oracle Corporation
[windows-jdk7] Java home: f:\jenkins\tools\java\latest1.7\jre
[windows-jdk7] Default locale: en_US, platform encoding: Cp1252
[windows-jdk7] OS name: "windows server 2012 r2", version: "6.3", arch: "amd64", family: "windows"
[windows-jdk9]  > git fetch --no-tags --progress https://gitbox.apache.org/repos/asf/maven-archiver.git
+refs/heads/*:refs/remotes/origin/*
[windows-jdk9] Checking out Revision 220ee2b896546eab844476b36bc2c3402cd32143 (MSHARED-668-test)
[windows-jdk9]  > git config core.sparsecheckout # timeout=10
[windows-jdk8] Failed in branch windows-jdk8
[linux-jdk7] [INFO] 
[linux-jdk7] [INFO] ------------------------------------------------------------------------
[linux-jdk7] [INFO] Building Apache Maven Archiver 3.2.1-SNAPSHOT
[linux-jdk7] [INFO] ------------------------------------------------------------------------
[linux-jdk8] [INFO] 
[linux-jdk8] [INFO] ------------------------------------------------------------------------
[linux-jdk8] [INFO] Building Apache Maven Archiver 3.2.1-SNAPSHOT
[linux-jdk8] [INFO] ------------------------------------------------------------------------
[linux-jdk8] [WARNING] The POM for org.codehaus.plexus:plexus-utils:jar:3.1.1-SNAPSHOT is
missing, no dependency information available
[linux-jdk8] [INFO] ------------------------------------------------------------------------
[linux-jdk8] [INFO] BUILD FAILURE
[linux-jdk8] [INFO] ------------------------------------------------------------------------
[linux-jdk8] [INFO] Total time: 0.857 s
[linux-jdk8] [INFO] Finished at: 2017-12-28T13:53:24Z
[linux-jdk8] Sending interrupt signal to process
[linux-jdk8] [INFO] Final Memory: 24M/1447M
[linux-jdk8] [INFO] ------------------------------------------------------------------------
[linux-jdk8] [WARNING] The requested profile "run-its" could not be activated because it does
not exist.
[linux-jdk8] [INFO] [jenkins-event-spy] Generated /home/jenkins/jenkins-slave/workspace/n-archiver_MSHARED-668-test-WG4DQP6EJS2N73J3VGM2JH6SMRRHF477RDRLQRWF4WAHIMWMG5OA@tmp/withMavenf81fb989/maven-spy-20171228-135323-4662722088672041300150.log
[linux-jdk8] [ERROR] Failed to execute goal on project maven-archiver: Could not resolve dependencies
for project org.apache.maven:maven-archiver:jar:3.2.1-SNAPSHOT: Failure to find org.codehaus.plexus:plexus-utils:jar:3.1.1-SNAPSHOT
in http://repository.apache.org/snapshots was cached in the local repository, resolution will
not be reattempted until the update interval of Nexus has elapsed or updates are forced ->
[Help 1]
[linux-jdk8] [ERROR] 
[linux-jdk8] [ERROR] To see the full stack trace of the errors, re-run Maven with the -e switch.
[linux-jdk8] [ERROR] Re-run Maven using the -X switch to enable full debug logging.
[linux-jdk8] [ERROR] 
[linux-jdk8] [ERROR] For more information about the errors and possible solutions, please
read the following articles:
[linux-jdk8] [ERROR] [Help 1] http://cwiki.apache.org/confluence/display/MAVEN/DependencyResolutionException
[linux-jdk9] [INFO] [jenkins-event-spy] Generate /home/jenkins/jenkins-slave/workspace/n-archiver_MSHARED-668-test-WG4DQP6EJS2N73J3VGM2JH6SMRRHF477RDRLQRWF4WAHIMWMG5OA@tmp/withMaven070a30a6/maven-spy-20171228-135324-63617168437506866923960.log.tmp
...
[linux-jdk9] [INFO] Scanning for projects...
[linux-jdk9] Sending interrupt signal to process
[windows-jdk9]  > git checkout -f 220ee2b896546eab844476b36bc2c3402cd32143
[windows-jdk9] Commit message: "Upgrade to 3.1.1-SNAPSHOT of plexus-utils for testing purposes.
Added repository."
[windows-jdk9] Cleaning workspace
[windows-jdk9]  > git rev-parse --verify HEAD # timeout=10
[windows-jdk9] Resetting working tree
[windows-jdk9]  > git reset --hard # timeout=10
[windows-jdk9]  > git clean -fdx # timeout=10
[linux-jdk9] [INFO] 
[linux-jdk9] [INFO] ------------------------------------------------------------------------
[linux-jdk9] [INFO] Building Apache Maven Archiver 3.2.1-SNAPSHOT
[linux-jdk9] [INFO] ------------------------------------------------------------------------
[windows-jdk7] [INFO] [jenkins-event-spy] Generate F:\jenkins\jenkins-slave\workspace\n-archiver_MSHARED-668-test-WG4DQP6EJS2N73J3VGM2JH6SMRRHF477RDRLQRWF4WAHIMWMG5OA@tmp\withMaven6f321b59\maven-spy-20171228-135324-9996487885335209450598.log.tmp
...
[windows-jdk7] Sending interrupt signal to process
[Pipeline] [linux-jdk7] }
[Pipeline] [linux-jdk8] }
[Pipeline] [windows-jdk9] }
[Pipeline] [linux-jdk7] // dir
[Pipeline] [linux-jdk8] // dir
[Pipeline] [windows-jdk9] // dir
[Pipeline] [linux-jdk7] }
[linux-jdk7] [withMaven] One or multiple Maven executions have been ignored by the Jenkins
Pipeline Maven Plugin because they have been interrupted before completion (1). See Pipeline
Maven Plugin FAQ for more details.
[Pipeline] [linux-jdk8] }
[linux-jdk8] [withMaven] Skip 'Generated Artifacts Publisher' disabled by configuration
[linux-jdk8] [withMaven] Skip 'Findbugs Publisher' disabled by configuration
[linux-jdk8] [withMaven] Skip 'Open Task Scanner Publisher' disabled by configuration
[Pipeline] [windows-jdk9] }
[Pipeline] [linux-jdk7] // withMaven
[Pipeline] [linux-jdk8] // withMaven
[Pipeline] [windows-jdk9] // stage
[Pipeline] [linux-jdk7] }
[Pipeline] [linux-jdk8] }
[Pipeline] [linux-jdk9] }
[Pipeline] [windows-jdk7] }
[Pipeline] [windows-jdk9] stage
[Pipeline] [windows-jdk9] { (Build windows-jdk9)
[Pipeline] [windows-jdk9] withMaven
[windows-jdk9] [withMaven] Options: [org.jenkinsci.plugins.pipeline.maven.publishers.GeneratedArtifactsPublisher[disabled=true],
org.jenkinsci.plugins.pipeline.maven.publishers.JunitTestsPublisher[disabled=false], org.jenkinsci.plugins.pipeline.maven.publishers.FindbugsAnalysisPublisher[disabled=true],
org.jenkinsci.plugins.pipeline.maven.publishers.TasksScannerPublisher[disabled=true], org.jenkinsci.plugins.pipeline.maven.publishers.DependenciesFingerprintPublisher[disabled=false,
scopes=[compile, provided, runtime], versions={snapshot:true, release:false}], org.jenkinsci.plugins.pipeline.maven.publishers.InvokerRunsPublisher[disabled=false],
org.jenkinsci.plugins.pipeline.maven.publishers.PipelineGraphPublisher[disabled=false, scopes=[compile,
provided, runtime], versions={snapshot:true, release:false}, skipDownstreamTriggers=false,
lifecycleThreshold=deploy, ignoreUpstreamTriggers=false]]
[windows-jdk9] [withMaven] Available options: 
[windows-jdk9] [withMaven] use JDK installation JDK 1.9 (latest)
[windows-jdk9] [withMaven] use Maven installation 'Maven 3.5.0 (Windows)'
[Pipeline] [windows-jdk9] {
[Pipeline] [windows-jdk9] dir
[windows-jdk9] Running in f:\jenkins\jenkins-slave\workspace\n-archiver_MSHARED-668-test-WG4DQP6EJS2N73J3VGM2JH6SMRRHF477RDRLQRWF4WAHIMWMG5OA\m
[Pipeline] [windows-jdk9] {
[Pipeline] [linux-jdk7] // stage
[Pipeline] [linux-jdk8] // stage
[Pipeline] [linux-jdk9] // dir
[Pipeline] [windows-jdk7] // dir
[Pipeline] [linux-jdk7] }
[Pipeline] [linux-jdk8] }
[Pipeline] [linux-jdk9] }
[linux-jdk9] [withMaven] One or multiple Maven executions have been ignored by the Jenkins
Pipeline Maven Plugin because they have been interrupted before completion (1). See Pipeline
Maven Plugin FAQ for more details.
[Pipeline] [windows-jdk7] }
[windows-jdk7] [withMaven] One or multiple Maven executions have been ignored by the Jenkins
Pipeline Maven Plugin because they have been interrupted before completion (1). See Pipeline
Maven Plugin FAQ for more details.
[Pipeline] [windows-jdk9] isUnix
[Pipeline] [windows-jdk9] bat
[windows-jdk9] [m] Running batch script
[Pipeline] [linux-jdk7] // node
[Pipeline] [linux-jdk8] // node
[Pipeline] [linux-jdk9] // withMaven
[Pipeline] [windows-jdk7] // withMaven
[Pipeline] [linux-jdk7] }
[linux-jdk7] Failed in branch linux-jdk7
[Pipeline] [linux-jdk8] }
[linux-jdk8] Failed in branch linux-jdk8
[Pipeline] [linux-jdk9] }
[Pipeline] [windows-jdk7] }
[Pipeline] [linux-jdk9] // stage
[Pipeline] [windows-jdk7] // stage
[Pipeline] [linux-jdk9] }
[Pipeline] [windows-jdk7] }
[Pipeline] [linux-jdk9] // node
[Pipeline] [windows-jdk7] // node
[Pipeline] [linux-jdk9] }
[linux-jdk9] Failed in branch linux-jdk9
[Pipeline] [windows-jdk7] }
[windows-jdk9] 
[windows-jdk9] f:\jenkins\jenkins-slave\workspace\n-archiver_MSHARED-668-test-WG4DQP6EJS2N73J3VGM2JH6SMRRHF477RDRLQRWF4WAHIMWMG5OA\m>mvn
-P+run-its -Dmaven.test.failure.ignore=true -Dfindbugs.failOnError=false -Dfindbugs.skip=true
clean verify 
[windows-jdk9] ----- withMaven Wrapper script -----
[windows-jdk9] Picked up JAVA_TOOL_OPTIONS: -Dmaven.ext.class.path="f:\jenkins\jenkins-slave\workspace\n-archiver_MSHARED-668-test-WG4DQP6EJS2N73J3VGM2JH6SMRRHF477RDRLQRWF4WAHIMWMG5OA@tmp\withMaven95d7af5c\pipeline-maven-spy.jar"
-Dorg.jenkinsci.plugins.pipeline.maven.reportsFolder="f:\jenkins\jenkins-slave\workspace\n-archiver_MSHARED-668-test-WG4DQP6EJS2N73J3VGM2JH6SMRRHF477RDRLQRWF4WAHIMWMG5OA@tmp\withMaven95d7af5c"

[windows-jdk7] Failed in branch windows-jdk7
[windows-jdk9] Apache Maven 3.5.0 (ff8f5e7444045639af65f6095c62210b5713f426; 2017-04-03T19:39:06Z)
[windows-jdk9] Maven home: F:\jenkins\tools\maven\apache-maven-3.5.0\bin\..
[windows-jdk9] Java version: 9.0.1, vendor: Oracle Corporation
[windows-jdk9] Java home: f:\jenkins\tools\java\latest9
[windows-jdk9] Default locale: en_US, platform encoding: Cp1252
[windows-jdk9] OS name: "windows server 2012 r2", version: "6.3", arch: "amd64", family: "windows"
[windows-jdk9] [INFO] [jenkins-event-spy] Generate F:\jenkins\jenkins-slave\workspace\n-archiver_MSHARED-668-test-WG4DQP6EJS2N73J3VGM2JH6SMRRHF477RDRLQRWF4WAHIMWMG5OA@tmp\withMaven95d7af5c\maven-spy-20171228-135332-2854795398267151697243.log.tmp
...
[windows-jdk9] [INFO] Scanning for projects...
[windows-jdk9] [INFO] 
[windows-jdk9] [INFO] ------------------------------------------------------------------------
[windows-jdk9] [INFO] Building Apache Maven Archiver 3.2.1-SNAPSHOT
[windows-jdk9] [INFO] ------------------------------------------------------------------------
[windows-jdk9] [WARNING] The POM for org.codehaus.plexus:plexus-utils:jar:3.1.1-SNAPSHOT is
missing, no dependency information available
[windows-jdk9] [INFO] ------------------------------------------------------------------------
[windows-jdk9] [INFO] BUILD FAILURE
[windows-jdk9] [INFO] ------------------------------------------------------------------------
[windows-jdk9] [INFO] Total time: 1.248 s
[windows-jdk9] [INFO] Finished at: 2017-12-28T13:53:34Z
[windows-jdk9] [INFO] Final Memory: 9M/31M
[windows-jdk9] [INFO] ------------------------------------------------------------------------
[windows-jdk9] [WARNING] The requested profile "run-its" could not be activated because it
does not exist.
[windows-jdk9] [INFO] [jenkins-event-spy] Generated F:\jenkins\jenkins-slave\workspace\n-archiver_MSHARED-668-test-WG4DQP6EJS2N73J3VGM2JH6SMRRHF477RDRLQRWF4WAHIMWMG5OA@tmp\withMaven95d7af5c\maven-spy-20171228-135332-2854795398267151697243.log
[windows-jdk9] [ERROR] Failed to execute goal on project maven-archiver: Could not resolve
dependencies for project org.apache.maven:maven-archiver:jar:3.2.1-SNAPSHOT: Failure to find
org.codehaus.plexus:plexus-utils:jar:3.1.1-SNAPSHOT in http://repository.apache.org/snapshots/
was cached in the local repository, resolution will not be reattempted until the update interval
of apache-snapshots has elapsed or updates are forced -> [Help 1]
[windows-jdk9] [ERROR] 
[windows-jdk9] [ERROR] To see the full stack trace of the errors, re-run Maven with the -e
switch.
[windows-jdk9] [ERROR] Re-run Maven using the -X switch to enable full debug logging.
[windows-jdk9] [ERROR] 
[windows-jdk9] [ERROR] For more information about the errors and possible solutions, please
read the following articles:
[windows-jdk9] [ERROR] [Help 1] http://cwiki.apache.org/confluence/display/MAVEN/DependencyResolutionException
[Pipeline] [windows-jdk9] }
[Pipeline] [windows-jdk9] // dir
[Pipeline] [windows-jdk9] }
[windows-jdk9] [withMaven] Skip 'Generated Artifacts Publisher' disabled by configuration
[windows-jdk9] [withMaven] Skip 'Findbugs Publisher' disabled by configuration
[windows-jdk9] [withMaven] Skip 'Open Task Scanner Publisher' disabled by configuration
[Pipeline] [windows-jdk9] // withMaven
[Pipeline] [windows-jdk9] }
[Pipeline] [windows-jdk9] // stage
[Pipeline] [windows-jdk9] }
[Pipeline] [windows-jdk9] // node
[Pipeline] [windows-jdk9] }
[windows-jdk9] Failed in branch windows-jdk9
[Pipeline] // parallel
[Pipeline] stage
[Pipeline] { (Notifications)
[Pipeline] echo
Build result: FAILURE
[Pipeline] jiraIssueSelector
[Pipeline] emailext
Mime
  • Unnamed multipart/mixed (inline, None, 0 bytes)
View raw message