maven-notifications mailing list archives

Site index · List index
Message view « Date » · « Thread »
Top « Date » · « Thread »
From Apache Jenkins Server <jenk...@builds.apache.org>
Subject Build failed in Jenkins: Maven TLP (wip) » maven » MNG-6305-validation-of-ci-friendly #5
Date Sat, 30 Dec 2017 18:12:46 GMT
See https://builds.apache.org/job/maven-wip/job/maven/job/MNG-6305-validation-of-ci-friendly/5/

Changes:

* [MNG-6305] Validation of CI friendly version incorrect More efficient

All tests passed

Build log:
[...truncated 349.68 KB...]
[INFO] Downloaded from central: https://repo.maven.apache.org/maven2/org/apache/maven/maven-repository-metadata/2.2.0/maven-repository-metadata-2.2.0.pom
(1.9 kB at 312 kB/s)
[INFO] Downloading from central: https://repo.maven.apache.org/maven2/org/apache/maven/maven-artifact/2.2.0/maven-artifact-2.2.0.pom
[INFO] Downloaded from central: https://repo.maven.apache.org/maven2/org/apache/maven/maven-artifact/2.2.0/maven-artifact-2.2.0.pom
(1.6 kB at 176 kB/s)
[INFO] Downloading from central: https://repo.maven.apache.org/maven2/org/apache/maven/maven-plugin-registry/2.2.0/maven-plugin-registry-2.2.0.pom
[INFO] Downloaded from central: https://repo.maven.apache.org/maven2/org/apache/maven/maven-plugin-registry/2.2.0/maven-plugin-registry-2.2.0.pom
(1.9 kB at 322 kB/s)
[INFO] Downloading from central: https://repo.maven.apache.org/maven2/org/apache/maven/shared/maven-invoker/2.0.11/maven-invoker-2.0.11.pom
[INFO] Downloaded from central: https://repo.maven.apache.org/maven2/org/apache/maven/shared/maven-invoker/2.0.11/maven-invoker-2.0.11.pom
(5.1 kB at 725 kB/s)
[INFO] Downloading from central: https://repo.maven.apache.org/maven2/org/apache/maven/reporting/maven-reporting-impl/2.0.5/maven-reporting-impl-2.0.5.jar
[INFO] Downloading from central: https://repo.maven.apache.org/maven2/org/apache/maven/doxia/doxia-core/1.0/doxia-core-1.0.jar
[INFO] Downloading from central: https://repo.maven.apache.org/maven2/org/apache/maven/shared/maven-doxia-tools/1.0.2/maven-doxia-tools-1.0.2.jar
[INFO] Downloading from central: https://repo.maven.apache.org/maven2/xml-apis/xml-apis/1.0.b2/xml-apis-1.0.b2.jar
[INFO] Downloading from central: https://repo.maven.apache.org/maven2/commons-validator/commons-validator/1.2.0/commons-validator-1.2.0.jar
[INFO] Downloaded from central: https://repo.maven.apache.org/maven2/org/apache/maven/reporting/maven-reporting-impl/2.0.5/maven-reporting-impl-2.0.5.jar
(21 kB at 1.9 MB/s)
[INFO] Downloading from central: https://repo.maven.apache.org/maven2/org/apache/maven/doxia/doxia-sink-api/1.0/doxia-sink-api-1.0.jar
[INFO] Downloaded from central: https://repo.maven.apache.org/maven2/org/apache/maven/shared/maven-doxia-tools/1.0.2/maven-doxia-tools-1.0.2.jar
(41 kB at 4.6 MB/s)
[INFO] Downloading from central: https://repo.maven.apache.org/maven2/org/apache/maven/doxia/doxia-site-renderer/1.0/doxia-site-renderer-1.0.jar
[INFO] Downloaded from central: https://repo.maven.apache.org/maven2/org/apache/maven/doxia/doxia-sink-api/1.0/doxia-sink-api-1.0.jar
(10 kB at 775 kB/s)
[INFO] Downloading from central: https://repo.maven.apache.org/maven2/org/apache/maven/doxia/doxia-decoration-model/1.0/doxia-decoration-model-1.0.jar
[INFO] Downloaded from central: https://repo.maven.apache.org/maven2/org/apache/maven/doxia/doxia-core/1.0/doxia-core-1.0.jar
(55 kB at 3.7 MB/s)
[INFO] Downloading from central: https://repo.maven.apache.org/maven2/org/apache/maven/doxia/doxia-module-apt/1.0/doxia-module-apt-1.0.jar
[INFO] Downloaded from central: https://repo.maven.apache.org/maven2/org/apache/maven/doxia/doxia-site-renderer/1.0/doxia-site-renderer-1.0.jar
(47 kB at 3.3 MB/s)
[INFO] Downloading from central: https://repo.maven.apache.org/maven2/org/apache/maven/doxia/doxia-module-fml/1.0/doxia-module-fml-1.0.jar
[INFO] Downloaded from central: https://repo.maven.apache.org/maven2/xml-apis/xml-apis/1.0.b2/xml-apis-1.0.b2.jar
(109 kB at 5.8 MB/s)
[INFO] Downloading from central: https://repo.maven.apache.org/maven2/org/apache/maven/doxia/doxia-module-xdoc/1.0/doxia-module-xdoc-1.0.jar
[INFO] Downloaded from central: https://repo.maven.apache.org/maven2/org/apache/maven/doxia/doxia-module-fml/1.0/doxia-module-fml-1.0.jar
(19 kB at 883 kB/s)
[INFO] Downloading from central: https://repo.maven.apache.org/maven2/org/apache/maven/doxia/doxia-module-xhtml/1.0/doxia-module-xhtml-1.0.jar
[INFO] Downloaded from central: https://repo.maven.apache.org/maven2/commons-validator/commons-validator/1.2.0/commons-validator-1.2.0.jar
(91 kB at 4.0 MB/s)
[INFO] Downloading from central: https://repo.maven.apache.org/maven2/org/codehaus/plexus/plexus-archiver/2.3/plexus-archiver-2.3.jar
[INFO] Downloaded from central: https://repo.maven.apache.org/maven2/org/apache/maven/doxia/doxia-decoration-model/1.0/doxia-decoration-model-1.0.jar
(49 kB at 2.2 MB/s)
[INFO] Downloading from central: https://repo.maven.apache.org/maven2/org/codehaus/plexus/plexus-utils/3.0.9/plexus-utils-3.0.9.jar
[INFO] Downloaded from central: https://repo.maven.apache.org/maven2/org/apache/maven/doxia/doxia-module-apt/1.0/doxia-module-apt-1.0.jar
(47 kB at 2.0 MB/s)
[INFO] Downloading from central: https://repo.maven.apache.org/maven2/org/apache/maven/shared/file-management/1.2.1/file-management-1.2.1.jar
[INFO] Downloaded from central: https://repo.maven.apache.org/maven2/org/apache/maven/doxia/doxia-module-xhtml/1.0/doxia-module-xhtml-1.0.jar
(22 kB at 779 kB/s)
[INFO] Downloading from central: https://repo.maven.apache.org/maven2/org/apache/maven/shared/maven-shared-io/1.1/maven-shared-io-1.1.jar
[INFO] Downloaded from central: https://repo.maven.apache.org/maven2/org/apache/maven/shared/file-management/1.2.1/file-management-1.2.1.jar
(38 kB at 1.1 MB/s)
[INFO] Downloading from central: https://repo.maven.apache.org/maven2/org/apache/maven/wagon/wagon-provider-api/1.0-alpha-6/wagon-provider-api-1.0-alpha-6.jar
[INFO] Downloaded from central: https://repo.maven.apache.org/maven2/org/apache/maven/doxia/doxia-module-xdoc/1.0/doxia-module-xdoc-1.0.jar
(28 kB at 662 kB/s)
[INFO] Downloading from central: https://repo.maven.apache.org/maven2/org/codehaus/plexus/plexus-io/2.0.6/plexus-io-2.0.6.jar
[INFO] Downloaded from central: https://repo.maven.apache.org/maven2/org/apache/maven/shared/maven-shared-io/1.1/maven-shared-io-1.1.jar
(39 kB at 940 kB/s)
[INFO] Downloading from central: https://repo.maven.apache.org/maven2/org/apache/maven/shared/maven-dependency-analyzer/1.4/maven-dependency-analyzer-1.4.jar
[INFO] Downloaded from central: https://repo.maven.apache.org/maven2/org/codehaus/plexus/plexus-archiver/2.3/plexus-archiver-2.3.jar
(186 kB at 4.3 MB/s)
[INFO] Downloading from central: https://repo.maven.apache.org/maven2/asm/asm/3.3.1/asm-3.3.1.jar
[INFO] Downloaded from central: https://repo.maven.apache.org/maven2/org/codehaus/plexus/plexus-utils/3.0.9/plexus-utils-3.0.9.jar
(232 kB at 5.4 MB/s)
[INFO] Downloading from central: https://repo.maven.apache.org/maven2/org/apache/maven/shared/maven-invoker/2.0.11/maven-invoker-2.0.11.jar
[INFO] Downloaded from central: https://repo.maven.apache.org/maven2/org/apache/maven/wagon/wagon-provider-api/1.0-alpha-6/wagon-provider-api-1.0-alpha-6.jar
(43 kB at 971 kB/s)
[INFO] Downloaded from central: https://repo.maven.apache.org/maven2/asm/asm/3.3.1/asm-3.3.1.jar
(44 kB at 889 kB/s)
[INFO] Downloaded from central: https://repo.maven.apache.org/maven2/org/apache/maven/shared/maven-dependency-analyzer/1.4/maven-dependency-analyzer-1.4.jar
(27 kB at 560 kB/s)
[INFO] Downloaded from central: https://repo.maven.apache.org/maven2/org/apache/maven/shared/maven-invoker/2.0.11/maven-invoker-2.0.11.jar
(29 kB at 556 kB/s)
[INFO] Downloaded from central: https://repo.maven.apache.org/maven2/org/codehaus/plexus/plexus-io/2.0.6/plexus-io-2.0.6.jar
(58 kB at 1.1 MB/s)
[INFO] Configured Artifact: org.slf4j:slf4j-simple:sources:1.7.25:jar
[INFO] Downloading from central: https://repo.maven.apache.org/maven2/org/slf4j/slf4j-simple/1.7.25/slf4j-simple-1.7.25-sources.jar
[INFO] Downloaded from central: https://repo.maven.apache.org/maven2/org/slf4j/slf4j-simple/1.7.25/slf4j-simple-1.7.25-sources.jar
(14 kB at 601 kB/s)
[INFO] Unpacking /home/jenkins/jenkins-slave/workspace/5-validation-of-ci-friendly-5LZZOXIMJVIA5GDBWL3AMUX4JD6C26GYU2W2565MJXYK4YDML5PQ/build/.repository/org/slf4j/slf4j-simple/1.7.25/slf4j-simple-1.7.25-sources.jar
to /home/jenkins/jenkins-slave/workspace/5-validation-of-ci-friendly-5LZZOXIMJVIA5GDBWL3AMUX4JD6C26GYU2W2565MJXYK4YDML5PQ/build/maven-slf4j-provider/target/generated-sources/slf4j-simple
with includes "org/slf4j/impl/*.java" and excludes "org/slf4j/impl/StaticLoggerBinder*"
[INFO] 
[INFO] --- maven-remote-resources-plugin:1.5:process (default) @ maven-slf4j-provider ---
[INFO] 
[INFO] --- maven-resources-plugin:2.7:resources (default-resources) @ maven-slf4j-provider
---
[INFO] Using 'UTF-8' encoding to copy filtered resources.
[INFO] skip non existing resourceDirectory /home/jenkins/jenkins-slave/workspace/5-validation-of-ci-friendly-5LZZOXIMJVIA5GDBWL3AMUX4JD6C26GYU2W2565MJXYK4YDML5PQ/build/maven-slf4j-provider/src/main/resources
[INFO] Copying 3 resources
[INFO] 
[INFO] --- maven-compiler-plugin:3.2:compile (default-compile) @ maven-slf4j-provider ---
[INFO] Changes detected - recompiling the module!
[INFO] Compiling 9 source files to /home/jenkins/jenkins-slave/workspace/5-validation-of-ci-friendly-5LZZOXIMJVIA5GDBWL3AMUX4JD6C26GYU2W2565MJXYK4YDML5PQ/build/maven-slf4j-provider/target/classes
[INFO] 
[INFO] --- animal-sniffer-maven-plugin:1.15:check (check-java-compat) @ maven-slf4j-provider
---
[INFO] Checking unresolved references to org.codehaus.mojo.signature:java17:1.0
[INFO] 
[INFO] --- maven-resources-plugin:2.7:testResources (default-testResources) @ maven-slf4j-provider
---
[INFO] Using 'UTF-8' encoding to copy filtered resources.
[INFO] skip non existing resourceDirectory /home/jenkins/jenkins-slave/workspace/5-validation-of-ci-friendly-5LZZOXIMJVIA5GDBWL3AMUX4JD6C26GYU2W2565MJXYK4YDML5PQ/build/maven-slf4j-provider/src/test/resources
[INFO] Copying 3 resources
[INFO] 
[INFO] --- maven-compiler-plugin:3.2:testCompile (default-testCompile) @ maven-slf4j-provider
---
[INFO] No sources to compile
[INFO] 
[INFO] --- maven-surefire-plugin:2.18.1:test (default-test) @ maven-slf4j-provider ---
[INFO] 
[INFO] --- maven-jar-plugin:2.5:jar (default-jar) @ maven-slf4j-provider ---
[INFO] Building jar: /home/jenkins/jenkins-slave/workspace/5-validation-of-ci-friendly-5LZZOXIMJVIA5GDBWL3AMUX4JD6C26GYU2W2565MJXYK4YDML5PQ/build/maven-slf4j-provider/target/maven-slf4j-provider-3.5.3-SNAPSHOT.jar
[INFO] 
[INFO] --- maven-site-plugin:3.4:attach-descriptor (attach-descriptor) @ maven-slf4j-provider
---
[INFO] 
[INFO] --- maven-checkstyle-plugin:2.15:check (checkstyle-check) @ maven-slf4j-provider ---
[INFO] There is 1 error reported by Checkstyle 6.1.1 with config/maven_checks.xml ruleset.
[INFO] Ignored 1 error, 0 violation remaining.
[INFO] 
[INFO] ------------------------------------------------------------------------
[INFO] Skipping Maven Embedder
[INFO] This project has been banned from the build due to previous failures.
[INFO] ------------------------------------------------------------------------
[INFO] 
[INFO] ------------------------------------------------------------------------
[INFO] Skipping Maven Compat
[INFO] This project has been banned from the build due to previous failures.
[INFO] ------------------------------------------------------------------------
[INFO] 
[INFO] ------------------------------------------------------------------------
[INFO] Skipping Apache Maven Distribution
[INFO] This project has been banned from the build due to previous failures.
[INFO] ------------------------------------------------------------------------
[INFO] ------------------------------------------------------------------------
[INFO] Reactor Summary:
[INFO] 
[INFO] Apache Maven ....................................... SUCCESS [ 12.825 s]
[INFO] Maven Model ........................................ SUCCESS [  8.318 s]
[INFO] Maven Artifact ..................................... SUCCESS [  2.109 s]
[INFO] Maven Plugin API ................................... SUCCESS [  2.254 s]
[INFO] Maven Builder Support .............................. SUCCESS [  1.615 s]
[INFO] Maven Model Builder ................................ FAILURE [  8.203 s]
[INFO] Maven Settings ..................................... SUCCESS [  0.864 s]
[INFO] Maven Settings Builder ............................. SUCCESS [  1.806 s]
[INFO] Maven Repository Metadata Model .................... SUCCESS [  0.659 s]
[INFO] Maven Artifact Resolver Provider ................... SKIPPED
[INFO] Maven Core ......................................... SKIPPED
[INFO] Maven SLF4J Simple Provider ........................ SUCCESS [  2.132 s]
[INFO] Maven Embedder ..................................... SKIPPED
[INFO] Maven Compat ....................................... SKIPPED
[INFO] Apache Maven Distribution .......................... SKIPPED
[INFO] ------------------------------------------------------------------------
[INFO] BUILD FAILURE
[INFO] ------------------------------------------------------------------------
[INFO] Total time: 42.184 s
[INFO] Finished at: 2017-12-30T19:12:41+01:00
[INFO] Final Memory: 85M/1812M
[INFO] ------------------------------------------------------------------------
[INFO] [jenkins-event-spy] Generated /home/jenkins/jenkins-slave/workspace/5-validation-of-ci-friendly-5LZZOXIMJVIA5GDBWL3AMUX4JD6C26GYU2W2565MJXYK4YDML5PQ/build@tmp/withMaven24cd9608/maven-spy-20171230-191158-7565023625720422847042.log
[ERROR] Failed to execute goal org.apache.maven.plugins:maven-checkstyle-plugin:2.15:check
(checkstyle-check) on project maven-model-builder: You have 2 Checkstyle violations. ->
[Help 1]
org.apache.maven.lifecycle.LifecycleExecutionException: Failed to execute goal org.apache.maven.plugins:maven-checkstyle-plugin:2.15:check
(checkstyle-check) on project maven-model-builder: You have 2 Checkstyle violations.
    at org.apache.maven.lifecycle.internal.MojoExecutor.execute (MojoExecutor.java:213)
    at org.apache.maven.lifecycle.internal.MojoExecutor.execute (MojoExecutor.java:154)
    at org.apache.maven.lifecycle.internal.MojoExecutor.execute (MojoExecutor.java:146)
    at org.apache.maven.lifecycle.internal.LifecycleModuleBuilder.buildProject (LifecycleModuleBuilder.java:117)
    at org.apache.maven.lifecycle.internal.LifecycleModuleBuilder.buildProject (LifecycleModuleBuilder.java:81)
    at org.apache.maven.lifecycle.internal.builder.singlethreaded.SingleThreadedBuilder.build
(SingleThreadedBuilder.java:51)
    at org.apache.maven.lifecycle.internal.LifecycleStarter.execute (LifecycleStarter.java:128)
    at org.apache.maven.DefaultMaven.doExecute (DefaultMaven.java:309)
    at org.apache.maven.DefaultMaven.doExecute (DefaultMaven.java:194)
    at org.apache.maven.DefaultMaven.execute (DefaultMaven.java:107)
    at org.apache.maven.cli.MavenCli.execute (MavenCli.java:955)
    at org.apache.maven.cli.MavenCli.doMain (MavenCli.java:290)
    at org.apache.maven.cli.MavenCli.main (MavenCli.java:194)
    at sun.reflect.NativeMethodAccessorImpl.invoke0 (Native Method)
    at sun.reflect.NativeMethodAccessorImpl.invoke (NativeMethodAccessorImpl.java:57)
    at sun.reflect.DelegatingMethodAccessorImpl.invoke (DelegatingMethodAccessorImpl.java:43)
    at java.lang.reflect.Method.invoke (Method.java:606)
    at org.codehaus.plexus.classworlds.launcher.Launcher.launchEnhanced (Launcher.java:289)
    at org.codehaus.plexus.classworlds.launcher.Launcher.launch (Launcher.java:229)
    at org.codehaus.plexus.classworlds.launcher.Launcher.mainWithExitCode (Launcher.java:415)
    at org.codehaus.plexus.classworlds.launcher.Launcher.main (Launcher.java:356)
Caused by: org.apache.maven.plugin.MojoFailureException: You have 2 Checkstyle violations.
    at org.apache.maven.plugin.checkstyle.CheckstyleViolationCheckMojo.execute (CheckstyleViolationCheckMojo.java:580)
    at org.apache.maven.plugin.DefaultBuildPluginManager.executeMojo (DefaultBuildPluginManager.java:134)
    at org.apache.maven.lifecycle.internal.MojoExecutor.execute (MojoExecutor.java:208)
    at org.apache.maven.lifecycle.internal.MojoExecutor.execute (MojoExecutor.java:154)
    at org.apache.maven.lifecycle.internal.MojoExecutor.execute (MojoExecutor.java:146)
    at org.apache.maven.lifecycle.internal.LifecycleModuleBuilder.buildProject (LifecycleModuleBuilder.java:117)
    at org.apache.maven.lifecycle.internal.LifecycleModuleBuilder.buildProject (LifecycleModuleBuilder.java:81)
    at org.apache.maven.lifecycle.internal.builder.singlethreaded.SingleThreadedBuilder.build
(SingleThreadedBuilder.java:51)
    at org.apache.maven.lifecycle.internal.LifecycleStarter.execute (LifecycleStarter.java:128)
    at org.apache.maven.DefaultMaven.doExecute (DefaultMaven.java:309)
    at org.apache.maven.DefaultMaven.doExecute (DefaultMaven.java:194)
    at org.apache.maven.DefaultMaven.execute (DefaultMaven.java:107)
    at org.apache.maven.cli.MavenCli.execute (MavenCli.java:955)
    at org.apache.maven.cli.MavenCli.doMain (MavenCli.java:290)
    at org.apache.maven.cli.MavenCli.main (MavenCli.java:194)
    at sun.reflect.NativeMethodAccessorImpl.invoke0 (Native Method)
    at sun.reflect.NativeMethodAccessorImpl.invoke (NativeMethodAccessorImpl.java:57)
    at sun.reflect.DelegatingMethodAccessorImpl.invoke (DelegatingMethodAccessorImpl.java:43)
    at java.lang.reflect.Method.invoke (Method.java:606)
    at org.codehaus.plexus.classworlds.launcher.Launcher.launchEnhanced (Launcher.java:289)
    at org.codehaus.plexus.classworlds.launcher.Launcher.launch (Launcher.java:229)
    at org.codehaus.plexus.classworlds.launcher.Launcher.mainWithExitCode (Launcher.java:415)
    at org.codehaus.plexus.classworlds.launcher.Launcher.main (Launcher.java:356)
[ERROR] 
[ERROR] Re-run Maven using the -X switch to enable full debug logging.
[ERROR] 
[ERROR] For more information about the errors and possible solutions, please read the following
articles:
[ERROR] [Help 1] http://cwiki.apache.org/confluence/display/MAVEN/MojoFailureException
[ERROR] 
[ERROR] After correcting the problems, you can resume the build with the command
[ERROR]   mvn <goals> -rf :maven-model-builder
[Pipeline] }
[withMaven] artifactsPublisher - Archive artifact pom.xml under org/apache/maven/maven/3.5.3-SNAPSHOT/maven-3.5.3-SNAPSHOT.pom
[withMaven] artifactsPublisher - Archive artifact maven-model/pom.xml under org/apache/maven/maven-model/3.5.3-SNAPSHOT/maven-model-3.5.3-SNAPSHOT.pom
[withMaven] artifactsPublisher - Archive artifact maven-model/target/maven-model-3.5.3-SNAPSHOT.jar
under org/apache/maven/maven-model/3.5.3-SNAPSHOT/maven-model-3.5.3-SNAPSHOT.jar
[withMaven] artifactsPublisher - Archive artifact maven-artifact/pom.xml under org/apache/maven/maven-artifact/3.5.3-SNAPSHOT/maven-artifact-3.5.3-SNAPSHOT.pom
[withMaven] artifactsPublisher - Archive artifact maven-artifact/target/maven-artifact-3.5.3-SNAPSHOT.jar
under org/apache/maven/maven-artifact/3.5.3-SNAPSHOT/maven-artifact-3.5.3-SNAPSHOT.jar
[withMaven] artifactsPublisher - Archive artifact maven-plugin-api/pom.xml under org/apache/maven/maven-plugin-api/3.5.3-SNAPSHOT/maven-plugin-api-3.5.3-SNAPSHOT.pom
[withMaven] artifactsPublisher - Archive artifact maven-plugin-api/target/maven-plugin-api-3.5.3-SNAPSHOT.jar
under org/apache/maven/maven-plugin-api/3.5.3-SNAPSHOT/maven-plugin-api-3.5.3-SNAPSHOT.jar
[withMaven] artifactsPublisher - Archive artifact maven-builder-support/pom.xml under org/apache/maven/maven-builder-support/3.5.3-SNAPSHOT/maven-builder-support-3.5.3-SNAPSHOT.pom
[withMaven] artifactsPublisher - Archive artifact maven-builder-support/target/maven-builder-support-3.5.3-SNAPSHOT.jar
under org/apache/maven/maven-builder-support/3.5.3-SNAPSHOT/maven-builder-support-3.5.3-SNAPSHOT.jar
[withMaven] artifactsPublisher - Archive artifact maven-settings/pom.xml under org/apache/maven/maven-settings/3.5.3-SNAPSHOT/maven-settings-3.5.3-SNAPSHOT.pom
[withMaven] artifactsPublisher - Archive artifact maven-settings/target/maven-settings-3.5.3-SNAPSHOT.jar
under org/apache/maven/maven-settings/3.5.3-SNAPSHOT/maven-settings-3.5.3-SNAPSHOT.jar
[withMaven] artifactsPublisher - Archive artifact maven-settings-builder/pom.xml under org/apache/maven/maven-settings-builder/3.5.3-SNAPSHOT/maven-settings-builder-3.5.3-SNAPSHOT.pom
[withMaven] artifactsPublisher - Archive artifact maven-settings-builder/target/maven-settings-builder-3.5.3-SNAPSHOT.jar
under org/apache/maven/maven-settings-builder/3.5.3-SNAPSHOT/maven-settings-builder-3.5.3-SNAPSHOT.jar
[withMaven] artifactsPublisher - Archive artifact maven-repository-metadata/pom.xml under
org/apache/maven/maven-repository-metadata/3.5.3-SNAPSHOT/maven-repository-metadata-3.5.3-SNAPSHOT.pom
[withMaven] artifactsPublisher - Archive artifact maven-repository-metadata/target/maven-repository-metadata-3.5.3-SNAPSHOT.jar
under org/apache/maven/maven-repository-metadata/3.5.3-SNAPSHOT/maven-repository-metadata-3.5.3-SNAPSHOT.jar
[withMaven] artifactsPublisher - Archive artifact maven-slf4j-provider/pom.xml under org/apache/maven/maven-slf4j-provider/3.5.3-SNAPSHOT/maven-slf4j-provider-3.5.3-SNAPSHOT.pom
[withMaven] artifactsPublisher - Archive artifact maven-slf4j-provider/target/maven-slf4j-provider-3.5.3-SNAPSHOT.jar
under org/apache/maven/maven-slf4j-provider/3.5.3-SNAPSHOT/maven-slf4j-provider-3.5.3-SNAPSHOT.jar
[withMaven] artifactsPublisher - Archive artifact target/maven-3.5.3-SNAPSHOT-site.xml under
org/apache/maven/maven/3.5.3-SNAPSHOT/maven-3.5.3-SNAPSHOT-site.xml
[withMaven] junitPublisher - Archive test results for Maven artifact org.apache.maven:maven-model:3.5.3-SNAPSHOT
generated by maven-surefire-plugin:test (default-test): maven-model/target/surefire-reports/*.xml
[withMaven] junitPublisher - Jenkins JUnit Attachments Plugin not found, can't publish test
attachments.Recording test results
[withMaven] junitPublisher - Archive test results for Maven artifact org.apache.maven:maven-artifact:3.5.3-SNAPSHOT
generated by maven-surefire-plugin:test (default-test): maven-artifact/target/surefire-reports/*.xml
[withMaven] junitPublisher - Jenkins JUnit Attachments Plugin not found, can't publish test
attachments.Recording test results
[withMaven] junitPublisher - Archive test results for Maven artifact org.apache.maven:maven-plugin-api:3.5.3-SNAPSHOT
generated by maven-surefire-plugin:test (default-test): maven-plugin-api/target/surefire-reports/*.xml
[withMaven] junitPublisher - Jenkins JUnit Attachments Plugin not found, can't publish test
attachments.Recording test results
[withMaven] junitPublisher - Archive test results for Maven artifact org.apache.maven:maven-builder-support:3.5.3-SNAPSHOT
generated by maven-surefire-plugin:test (default-test): maven-builder-support/target/surefire-reports/*.xml
[withMaven] junitPublisher - Jenkins JUnit Attachments Plugin not found, can't publish test
attachments.Recording test results
[withMaven] junitPublisher - Archive test results for Maven artifact org.apache.maven:maven-model-builder:3.5.3-SNAPSHOT
generated by maven-surefire-plugin:test (default-test): maven-model-builder/target/surefire-reports/*.xml
[withMaven] junitPublisher - Jenkins JUnit Attachments Plugin not found, can't publish test
attachments.Recording test results
[withMaven] junitPublisher - Archive test results for Maven artifact org.apache.maven:maven-settings:3.5.3-SNAPSHOT
generated by maven-surefire-plugin:test (default-test): maven-settings/target/surefire-reports/*.xml
[withMaven] junitPublisher - Jenkins JUnit Attachments Plugin not found, can't publish test
attachments.Recording test results
None of the test reports contained any result
[withMaven] junitPublisher - Archive test results for Maven artifact org.apache.maven:maven-settings-builder:3.5.3-SNAPSHOT
generated by maven-surefire-plugin:test (default-test): maven-settings-builder/target/surefire-reports/*.xml
[withMaven] junitPublisher - Jenkins JUnit Attachments Plugin not found, can't publish test
attachments.Recording test results
[withMaven] junitPublisher - Archive test results for Maven artifact org.apache.maven:maven-repository-metadata:3.5.3-SNAPSHOT
generated by maven-surefire-plugin:test (default-test): maven-repository-metadata/target/surefire-reports/*.xml
[withMaven] junitPublisher - Jenkins JUnit Attachments Plugin not found, can't publish test
attachments.Recording test results
None of the test reports contained any result
[withMaven] junitPublisher - Archive test results for Maven artifact org.apache.maven:maven-slf4j-provider:3.5.3-SNAPSHOT
generated by maven-surefire-plugin:test (default-test): maven-slf4j-provider/target/surefire-reports/*.xml
[withMaven] junitPublisher - Jenkins JUnit Attachments Plugin not found, can't publish test
attachments.Recording test results
None of the test reports contained any result
[withMaven] openTasksPublisher - Scan Tasks for Maven artifact org.apache.maven:maven-model:3.5.3-SNAPSHOT
in source directory maven-model/src/main/java
[withMaven] openTasksPublisher - Scan Tasks for Maven artifact org.apache.maven:maven-artifact:3.5.3-SNAPSHOT
in source directory maven-artifact/src/main/java
[withMaven] openTasksPublisher - Scan Tasks for Maven artifact org.apache.maven:maven-plugin-api:3.5.3-SNAPSHOT
in source directory maven-plugin-api/src/main/java
[withMaven] openTasksPublisher - Scan Tasks for Maven artifact org.apache.maven:maven-builder-support:3.5.3-SNAPSHOT
in source directory maven-builder-support/src/main/java
[withMaven] openTasksPublisher - Scan Tasks for Maven artifact org.apache.maven:maven-model-builder:3.5.3-SNAPSHOT
in source directory maven-model-builder/src/main/java
[withMaven] openTasksPublisher - Scan Tasks for Maven artifact org.apache.maven:maven-settings:3.5.3-SNAPSHOT
in source directory maven-settings/src/main/java
[withMaven] openTasksPublisher - Scan Tasks for Maven artifact org.apache.maven:maven-settings-builder:3.5.3-SNAPSHOT
in source directory maven-settings-builder/src/main/java
[withMaven] openTasksPublisher - Scan Tasks for Maven artifact org.apache.maven:maven-slf4j-provider:3.5.3-SNAPSHOT
in source directory maven-slf4j-provider/src/main/java
[TASKS] Scanning folder '/home/jenkins/jenkins-slave/workspace/5-validation-of-ci-friendly-5LZZOXIMJVIA5GDBWL3AMUX4JD6C26GYU2W2565MJXYK4YDML5PQ/build'
for files matching the pattern 'maven-model/src/main/java/**/*,maven-artifact/src/main/java/**/*,maven-plugin-api/src/main/java/**/*,maven-builder-support/src/main/java/**/*,maven-model-builder/src/main/java/**/*,maven-settings/src/main/java/**/*,maven-settings-builder/src/main/java/**/*,maven-slf4j-provider/src/main/java/**/*'
- excludes: null
[TASKS] Found 185 files to scan for tasks
[TASKS] Found 25 open tasks.
Skipping warnings blame since pipelines do not have an SCM link.%n
[TASKS] Computing warning deltas based on reference build #4
[Pipeline] // withMaven
[Pipeline] }
[Pipeline] // stage
[Pipeline] }
[Pipeline] // dir
[Pipeline] }
[Pipeline] // node
[Pipeline] stage
[Pipeline] { (Notifications)
[Pipeline] echo
Build result: FAILURE
[Pipeline] jiraIssueSelector
[Pipeline] jiraComment
[Pipeline] emailext
Mime
  • Unnamed multipart/mixed (inline, None, 0 bytes)
View raw message