maven-notifications mailing list archives

Site index · List index
Message view « Date » · « Thread »
Top « Date » · « Thread »
From Apache Jenkins Server <jenk...@builds.apache.org>
Subject Build failed in Jenkins: Maven TLP » maven-release » master #7
Date Sun, 24 Dec 2017 14:52:48 GMT
See https://builds.apache.org/job/maven-box/job/maven-release/job/master/7/

Changes:

* Verify update-versions and rollback without ReflectionUtils
* Move unittests to proper unit
* replace whitebox usage
* Remove all reflection calls in tests

All tests passed

Build log:
[...truncated 1.92 MB...]
[linux-jdk8] Running org.apache.maven.shared.release.scm.DefaultScmRepositoryConfiguratorTest
[windows-jdk8] [ERROR] ...
[windows-jdk8] [ERROR] 
[windows-jdk8] [ERROR] Cannot perform release - the preparation step was stopped mid-way.
Please re-run release:prepare to continue, or perform the release from an SCM tag.
[windows-jdk8] [ERROR] No SCM URL was provided to perform the release from
[windows-jdk9] [INFO] 
[windows-jdk9] [INFO] --- maven-resources-plugin:2.7:resources (default-resources) @ maven-release-manager
---
[windows-jdk9] [INFO] Using 'UTF-8' encoding to copy filtered resources.
[windows-jdk9] [INFO] Copying 3 resources
[windows-jdk9] [INFO] Copying 3 resources
[windows-jdk9] [INFO] 
[windows-jdk9] [INFO] --- maven-compiler-plugin:3.2:compile (default-compile) @ maven-release-manager
---
[windows-jdk9] [INFO] Changes detected - recompiling the module!
[windows-jdk9] [INFO] Compiling 103 source files to F:\jenkins\jenkins-slave\workspace\en-box_maven-release_master-OCKGULQBCZ67VBKJ7HF6E7KZUCKX7ZC6FX64GH66OHP7A4VAQBIQ\m\maven-release-manager\target\classes
[linux-jdk8] Sending interrupt signal to process
[linux-jdk8] Tests run: 9, Failures: 0, Errors: 0, Skipped: 0, Time elapsed: 0.549 sec - in
org.apache.maven.shared.release.scm.DefaultScmRepositoryConfiguratorTest
[linux-jdk8] Running org.apache.maven.shared.release.scm.SubversionScmTranslatorTest
[linux-jdk8] Tests run: 4, Failures: 0, Errors: 0, Skipped: 0, Time elapsed: 0 sec - in org.apache.maven.shared.release.scm.SubversionScmTranslatorTest
[linux-jdk8] Running org.apache.maven.shared.release.scm.GitScmTranslatorTest
[linux-jdk8] Tests run: 4, Failures: 0, Errors: 0, Skipped: 0, Time elapsed: 0.001 sec - in
org.apache.maven.shared.release.scm.GitScmTranslatorTest
[linux-jdk8] Running org.apache.maven.shared.release.scm.ClearCaseScmTranslatorTest
[linux-jdk8] Tests run: 4, Failures: 0, Errors: 0, Skipped: 0, Time elapsed: 0.001 sec - in
org.apache.maven.shared.release.scm.ClearCaseScmTranslatorTest
[linux-jdk8] Running org.apache.maven.shared.release.scm.HgScmTranslatorTest
[linux-jdk8] Tests run: 4, Failures: 0, Errors: 0, Skipped: 0, Time elapsed: 0.001 sec - in
org.apache.maven.shared.release.scm.HgScmTranslatorTest
[linux-jdk8] Running org.apache.maven.shared.release.scm.JazzScmTranslatorTest
[linux-jdk8] Tests run: 4, Failures: 0, Errors: 0, Skipped: 0, Time elapsed: 0.001 sec - in
org.apache.maven.shared.release.scm.JazzScmTranslatorTest
[linux-jdk8] Running org.apache.maven.shared.release.config.ReleaseUtilsTest
[linux-jdk8] Tests run: 9, Failures: 0, Errors: 0, Skipped: 0, Time elapsed: 0.002 sec - in
org.apache.maven.shared.release.config.ReleaseUtilsTest
[linux-jdk8] Running org.apache.maven.shared.release.config.PropertiesReleaseDescriptorStoreTest
[linux-jdk8] 
[linux-jdk8] Results :
[linux-jdk8] 
[linux-jdk8] Tests run: 502, Failures: 0, Errors: 0, Skipped: 0
[linux-jdk8] 
[linux-jdk8] [INFO] ------------------------------------------------------------------------
[linux-jdk8] [INFO] Reactor Summary:
[linux-jdk8] [INFO] 
[linux-jdk8] [INFO] Maven Release ...................................... SUCCESS [ 12.487
s]
[linux-jdk8] [INFO] Maven Release APIs ................................. SUCCESS [  3.233
s]
[linux-jdk8] [INFO] Maven Release Manager .............................. FAILURE [ 52.234
s]
[linux-jdk8] [INFO] Maven Release Plugin ............................... SKIPPED
[linux-jdk8] [INFO] Maven Release Odd-Even Policy ...................... SKIPPED
[linux-jdk8] [INFO] ------------------------------------------------------------------------
[linux-jdk8] [INFO] BUILD FAILURE
[linux-jdk8] [INFO] ------------------------------------------------------------------------
[linux-jdk8] [INFO] Total time: 01:09 min
[linux-jdk8] [INFO] Finished at: 2017-12-24T14:52:21Z
[windows-jdk8] Tests run: 23, Failures: 0, Errors: 0, Skipped: 0, Time elapsed: 0.978 sec
- in org.apache.maven.shared.release.DefaultReleaseManagerTest
[windows-jdk8] Running org.apache.maven.shared.release.exec.AbstractMavenExecutorTest
[windows-jdk8] Tests run: 1, Failures: 0, Errors: 0, Skipped: 0, Time elapsed: 0.024 sec -
in org.apache.maven.shared.release.exec.AbstractMavenExecutorTest
[windows-jdk8] Running org.apache.maven.shared.release.exec.CommandLineFactoryTest
[windows-jdk8] Tests run: 1, Failures: 0, Errors: 0, Skipped: 0, Time elapsed: 0.012 sec -
in org.apache.maven.shared.release.exec.CommandLineFactoryTest
[windows-jdk8] Running org.apache.maven.shared.release.exec.ForkedMavenExecutorTest
[windows-jdk8] Tests run: 6, Failures: 0, Errors: 0, Skipped: 0, Time elapsed: 0.223 sec -
in org.apache.maven.shared.release.exec.ForkedMavenExecutorTest
[windows-jdk8] Running org.apache.maven.shared.release.exec.InvokerMavenExecutorTest
[windows-jdk7] Sending interrupt signal to process
[windows-jdk9] [INFO] /F:/jenkins/jenkins-slave/workspace/en-box_maven-release_master-OCKGULQBCZ67VBKJ7HF6E7KZUCKX7ZC6FX64GH66OHP7A4VAQBIQ/m/maven-release-manager/src/main/java/org/apache/maven/shared/release/phase/AbstractReleasePhase.java:
Some input files use or override a deprecated API.
[windows-jdk9] [INFO] /F:/jenkins/jenkins-slave/workspace/en-box_maven-release_master-OCKGULQBCZ67VBKJ7HF6E7KZUCKX7ZC6FX64GH66OHP7A4VAQBIQ/m/maven-release-manager/src/main/java/org/apache/maven/shared/release/phase/AbstractReleasePhase.java:
Recompile with -Xlint:deprecation for details.
[windows-jdk9] [INFO] /F:/jenkins/jenkins-slave/workspace/en-box_maven-release_master-OCKGULQBCZ67VBKJ7HF6E7KZUCKX7ZC6FX64GH66OHP7A4VAQBIQ/m/maven-release-manager/target/generated-sources/modello/org/apache/maven/shared/release/config/ReleaseDescriptor.java:
Some input files use unchecked or unsafe operations.
[windows-jdk9] [INFO] /F:/jenkins/jenkins-slave/workspace/en-box_maven-release_master-OCKGULQBCZ67VBKJ7HF6E7KZUCKX7ZC6FX64GH66OHP7A4VAQBIQ/m/maven-release-manager/target/generated-sources/modello/org/apache/maven/shared/release/config/ReleaseDescriptor.java:
Recompile with -Xlint:unchecked for details.
[windows-jdk9] [INFO] 
[windows-jdk9] [INFO] --- plexus-component-metadata:1.6:generate-metadata (default) @ maven-release-manager
---
[windows-jdk9] [INFO] Downloading: https://repo.maven.apache.org/maven2/org/codehaus/plexus/plexus-container-default/1.6/plexus-container-default-1.6.pom
[windows-jdk9] [INFO] Downloaded: https://repo.maven.apache.org/maven2/org/codehaus/plexus/plexus-container-default/1.6/plexus-container-default-1.6.pom
(2.7 kB at 242 kB/s)
[windows-jdk9] [INFO] Downloading: https://repo.maven.apache.org/maven2/org/codehaus/plexus/plexus-classworlds/2.5.1/plexus-classworlds-2.5.1.pom
[windows-jdk9] [INFO] Downloaded: https://repo.maven.apache.org/maven2/org/codehaus/plexus/plexus-classworlds/2.5.1/plexus-classworlds-2.5.1.pom
(5.0 kB at 626 kB/s)
[windows-jdk9] [INFO] Downloading: https://repo.maven.apache.org/maven2/org/apache/xbean/xbean-reflect/3.7/xbean-reflect-3.7.pom
[windows-jdk9] [INFO] Downloaded: https://repo.maven.apache.org/maven2/org/apache/xbean/xbean-reflect/3.7/xbean-reflect-3.7.pom
(5.1 kB at 463 kB/s)
[windows-jdk9] [INFO] Downloading: https://repo.maven.apache.org/maven2/org/apache/xbean/xbean/3.7/xbean-3.7.pom
[windows-jdk9] [INFO] Downloaded: https://repo.maven.apache.org/maven2/org/apache/xbean/xbean/3.7/xbean-3.7.pom
(15 kB at 1.7 MB/s)
[windows-jdk9] [INFO] Downloading: https://repo.maven.apache.org/maven2/org/apache/geronimo/genesis/genesis-java5-flava/2.0/genesis-java5-flava-2.0.pom
[windows-jdk9] [INFO] Downloaded: https://repo.maven.apache.org/maven2/org/apache/geronimo/genesis/genesis-java5-flava/2.0/genesis-java5-flava-2.0.pom
(5.5 kB at 548 kB/s)
[windows-jdk9] [INFO] Downloading: https://repo.maven.apache.org/maven2/org/apache/geronimo/genesis/genesis-default-flava/2.0/genesis-default-flava-2.0.pom
[windows-jdk9] [INFO] Downloaded: https://repo.maven.apache.org/maven2/org/apache/geronimo/genesis/genesis-default-flava/2.0/genesis-default-flava-2.0.pom
(18 kB at 2.0 MB/s)
[windows-jdk9] [INFO] Downloading: https://repo.maven.apache.org/maven2/org/apache/geronimo/genesis/genesis/2.0/genesis-2.0.pom
[windows-jdk9] [INFO] Downloaded: https://repo.maven.apache.org/maven2/org/apache/geronimo/genesis/genesis/2.0/genesis-2.0.pom
(18 kB at 1.5 MB/s)
[windows-jdk9] [INFO] Downloading: https://repo.maven.apache.org/maven2/org/codehaus/plexus/plexus-component-annotations/1.6/plexus-component-annotations-1.6.pom
[windows-jdk9] [INFO] Downloaded: https://repo.maven.apache.org/maven2/org/codehaus/plexus/plexus-component-annotations/1.6/plexus-component-annotations-1.6.pom
(748 B at 83 kB/s)
[windows-jdk9] [INFO] Downloading: https://repo.maven.apache.org/maven2/com/thoughtworks/qdox/qdox/2.0-M2/qdox-2.0-M2.pom
[windows-jdk9] [INFO] Downloaded: https://repo.maven.apache.org/maven2/com/thoughtworks/qdox/qdox/2.0-M2/qdox-2.0-M2.pom
(18 kB at 1.8 MB/s)
[windows-jdk9] [INFO] Downloading: https://repo.maven.apache.org/maven2/jdom/jdom/1.1/jdom-1.1.pom
[windows-jdk9] [INFO] Downloaded: https://repo.maven.apache.org/maven2/jdom/jdom/1.1/jdom-1.1.pom
(526 B at 66 kB/s)
[windows-jdk9] [INFO] Downloading: https://repo.maven.apache.org/maven2/org/codehaus/plexus/plexus-cli/1.6/plexus-cli-1.6.pom
[windows-jdk9] [INFO] Downloaded: https://repo.maven.apache.org/maven2/org/codehaus/plexus/plexus-cli/1.6/plexus-cli-1.6.pom
(1.4 kB at 156 kB/s)
[windows-jdk9] [INFO] Downloading: https://repo.maven.apache.org/maven2/org/codehaus/plexus/plexus-components/1.1.20/plexus-components-1.1.20.pom
[windows-jdk9] [INFO] Downloaded: https://repo.maven.apache.org/maven2/org/codehaus/plexus/plexus-components/1.1.20/plexus-components-1.1.20.pom
(3.0 kB at 431 kB/s)
[windows-jdk9] [INFO] Downloading: https://repo.maven.apache.org/maven2/org/codehaus/plexus/plexus/3.1/plexus-3.1.pom
[windows-jdk9] [INFO] Downloaded: https://repo.maven.apache.org/maven2/org/codehaus/plexus/plexus/3.1/plexus-3.1.pom
(19 kB at 1.9 MB/s)
[windows-jdk9] [INFO] Downloading: https://repo.maven.apache.org/maven2/org/ow2/asm/asm-all/5.0.2/asm-all-5.0.2.pom
[windows-jdk9] [INFO] Downloaded: https://repo.maven.apache.org/maven2/org/ow2/asm/asm-all/5.0.2/asm-all-5.0.2.pom
(2.0 kB at 246 kB/s)
[windows-jdk9] [INFO] Downloading: https://repo.maven.apache.org/maven2/org/ow2/asm/asm-parent/5.0.2/asm-parent-5.0.2.pom
[windows-jdk9] [INFO] Downloaded: https://repo.maven.apache.org/maven2/org/ow2/asm/asm-parent/5.0.2/asm-parent-5.0.2.pom
(5.5 kB at 785 kB/s)
[windows-jdk9] [INFO] Downloading: https://repo.maven.apache.org/maven2/org/codehaus/plexus/plexus-container-default/1.6/plexus-container-default-1.6.jar
[windows-jdk9] [INFO] Downloading: https://repo.maven.apache.org/maven2/org/codehaus/plexus/plexus-component-annotations/1.6/plexus-component-annotations-1.6.jar
[windows-jdk9] [INFO] Downloading: https://repo.maven.apache.org/maven2/org/apache/xbean/xbean-reflect/3.7/xbean-reflect-3.7.jar
[windows-jdk9] [INFO] Downloading: https://repo.maven.apache.org/maven2/com/thoughtworks/qdox/qdox/2.0-M2/qdox-2.0-M2.jar
[windows-jdk9] [INFO] Downloading: https://repo.maven.apache.org/maven2/org/codehaus/plexus/plexus-classworlds/2.5.1/plexus-classworlds-2.5.1.jar
[windows-jdk9] [INFO] Downloaded: https://repo.maven.apache.org/maven2/org/codehaus/plexus/plexus-component-annotations/1.6/plexus-component-annotations-1.6.jar
(4.3 kB at 194 kB/s)
[windows-jdk9] [INFO] Downloading: https://repo.maven.apache.org/maven2/org/codehaus/plexus/plexus-cli/1.6/plexus-cli-1.6.jar
[windows-jdk9] [INFO] Downloaded: https://repo.maven.apache.org/maven2/org/apache/xbean/xbean-reflect/3.7/xbean-reflect-3.7.jar
(148 kB at 5.3 MB/s)
[windows-jdk9] [INFO] Downloading: https://repo.maven.apache.org/maven2/org/ow2/asm/asm-all/5.0.2/asm-all-5.0.2.jar
[windows-jdk9] [INFO] Downloaded: https://repo.maven.apache.org/maven2/org/codehaus/plexus/plexus-classworlds/2.5.1/plexus-classworlds-2.5.1.jar
(50 kB at 1.7 MB/s)
[windows-jdk9] [INFO] Downloaded: https://repo.maven.apache.org/maven2/com/thoughtworks/qdox/qdox/2.0-M2/qdox-2.0-M2.jar
(292 kB at 10 MB/s)
[windows-jdk9] [INFO] Downloaded: https://repo.maven.apache.org/maven2/org/codehaus/plexus/plexus-container-default/1.6/plexus-container-default-1.6.jar
(224 kB at 6.2 MB/s)
[windows-jdk9] [INFO] Downloaded: https://repo.maven.apache.org/maven2/org/codehaus/plexus/plexus-cli/1.6/plexus-cli-1.6.jar
(7.4 kB at 176 kB/s)
[windows-jdk9] [INFO] Downloaded: https://repo.maven.apache.org/maven2/org/ow2/asm/asm-all/5.0.2/asm-all-5.0.2.jar
(242 kB at 4.7 MB/s)
[linux-jdk8] [INFO] Final Memory: 66M/2222M
[linux-jdk8] [INFO] ------------------------------------------------------------------------
[linux-jdk8] [jenkins-maven-event-spy] INFO generated /home/jenkins/jenkins-slave/workspace/en-box_maven-release_master-OCKGULQBCZ67VBKJ7HF6E7KZUCKX7ZC6FX64GH66OHP7A4VAQBIQ@tmp/withMavenb1029fbd/maven-spy-20171224-145111-9723811351368175713735.log
[linux-jdk8] [ERROR] Failed to execute goal org.apache.maven.plugins:maven-surefire-plugin:2.18.1:test
(default-test) on project maven-release-manager: Execution default-test of goal org.apache.maven.plugins:maven-surefire-plugin:2.18.1:test
failed: The forked VM terminated without properly saying goodbye. VM crash or System.exit
called?
[linux-jdk8] [ERROR] Command was /bin/sh -c cd /home/jenkins/jenkins-slave/workspace/en-box_maven-release_master-OCKGULQBCZ67VBKJ7HF6E7KZUCKX7ZC6FX64GH66OHP7A4VAQBIQ/m/maven-release-manager
&& /usr/local/asfpackages/java/jdk1.8.0_152/jre/bin/java -Xmx256m -jar /home/jenkins/jenkins-slave/workspace/en-box_maven-release_master-OCKGULQBCZ67VBKJ7HF6E7KZUCKX7ZC6FX64GH66OHP7A4VAQBIQ/m/maven-release-manager/target/surefire/surefirebooter3209380340518744366.jar
/home/jenkins/jenkins-slave/workspace/en-box_maven-release_master-OCKGULQBCZ67VBKJ7HF6E7KZUCKX7ZC6FX64GH66OHP7A4VAQBIQ/m/maven-release-manager/target/surefire/surefire9044475564395423405tmp
/home/jenkins/jenkins-slave/workspace/en-box_maven-release_master-OCKGULQBCZ67VBKJ7HF6E7KZUCKX7ZC6FX64GH66OHP7A4VAQBIQ/m/maven-release-manager/target/surefire/surefire_04158482800044418341tmp
[linux-jdk8] [ERROR] -> [Help 1]
[linux-jdk8] [ERROR] 
[linux-jdk8] [ERROR] To see the full stack trace of the errors, re-run Maven with the -e switch.
[linux-jdk8] [ERROR] Re-run Maven using the -X switch to enable full debug logging.
[linux-jdk8] [ERROR] 
[linux-jdk8] [ERROR] For more information about the errors and possible solutions, please
read the following articles:
[linux-jdk8] [ERROR] [Help 1] http://cwiki.apache.org/confluence/display/MAVEN/PluginExecutionException
[linux-jdk8] [ERROR] 
[linux-jdk8] [ERROR] After correcting the problems, you can resume the build with the command
[linux-jdk8] [ERROR]   mvn <goals> -rf :maven-release-manager
[windows-jdk8] Tests run: 5, Failures: 0, Errors: 0, Skipped: 0, Time elapsed: 2.028 sec -
in org.apache.maven.shared.release.exec.InvokerMavenExecutorTest
[windows-jdk8] Running org.apache.maven.shared.release.exec.TeeConsumerTest
[windows-jdk8] Tests run: 1, Failures: 0, Errors: 0, Skipped: 0, Time elapsed: 0 sec - in
org.apache.maven.shared.release.exec.TeeConsumerTest
[windows-jdk8] Running org.apache.maven.shared.release.exec.TeeOutputStreamTest
[windows-jdk8] Tests run: 1, Failures: 0, Errors: 0, Skipped: 0, Time elapsed: 0 sec - in
org.apache.maven.shared.release.exec.TeeOutputStreamTest
[windows-jdk8] Running org.apache.maven.shared.release.phase.AbstractScmCommitPhaseTest
[windows-jdk8] Tests run: 4, Failures: 0, Errors: 0, Skipped: 0, Time elapsed: 0 sec - in
org.apache.maven.shared.release.phase.AbstractScmCommitPhaseTest
[windows-jdk8] Running org.apache.maven.shared.release.phase.BranchInputVariablesPhaseTest
[windows-jdk8] Tests run: 8, Failures: 0, Errors: 0, Skipped: 0, Time elapsed: 0.097 sec -
in org.apache.maven.shared.release.phase.BranchInputVariablesPhaseTest
[windows-jdk8] Running org.apache.maven.shared.release.phase.CheckDependencySnapshotsPhaseTest
[windows-jdk9] [INFO] ------------------------------------------------------------------------
[windows-jdk9] [INFO] Reactor Summary:
[windows-jdk9] [INFO] 
[windows-jdk9] [INFO] Maven Release ...................................... SUCCESS [ 15.098
s]
[windows-jdk9] [INFO] Maven Release APIs ................................. SUCCESS [  4.998
s]
[windows-jdk9] [INFO] Maven Release Manager .............................. FAILURE [ 36.065
s]
[windows-jdk9] [INFO] Maven Release Plugin ............................... SKIPPED
[windows-jdk9] [INFO] Maven Release Odd-Even Policy ...................... SKIPPED
[windows-jdk9] [INFO] ------------------------------------------------------------------------
[windows-jdk9] [INFO] BUILD FAILURE
[windows-jdk9] [INFO] ------------------------------------------------------------------------
[windows-jdk9] [INFO] Total time: 57.833 s
[windows-jdk9] [INFO] Finished at: 2017-12-24T14:52:23Z
[windows-jdk9] [INFO] Final Memory: 37M/123M
[windows-jdk9] [INFO] ------------------------------------------------------------------------
[windows-jdk9] [jenkins-maven-event-spy] INFO generated F:\jenkins\jenkins-slave\workspace\en-box_maven-release_master-OCKGULQBCZ67VBKJ7HF6E7KZUCKX7ZC6FX64GH66OHP7A4VAQBIQ@tmp\withMavenfa485242\maven-spy-20171224-145124-7547769628812577011852.log
[windows-jdk9] [ERROR] Failed to execute goal org.codehaus.plexus:plexus-component-metadata:1.6:generate-metadata
(default) on project maven-release-manager: Error generating metadata: Failed to extract descriptors:
IllegalArgumentException -> [Help 1]
[windows-jdk9] [ERROR] 
[windows-jdk9] [ERROR] To see the full stack trace of the errors, re-run Maven with the -e
switch.
[windows-jdk9] [ERROR] Re-run Maven using the -X switch to enable full debug logging.
[windows-jdk9] [ERROR] 
[windows-jdk9] [ERROR] For more information about the errors and possible solutions, please
read the following articles:
[windows-jdk9] [ERROR] [Help 1] http://cwiki.apache.org/confluence/display/MAVEN/MojoExecutionException
[windows-jdk9] [ERROR] 
[windows-jdk9] [ERROR] After correcting the problems, you can resume the build with the command
[windows-jdk9] [ERROR]   mvn <goals> -rf :maven-release-manager
[windows-jdk8] Tests run: 42, Failures: 0, Errors: 0, Skipped: 0, Time elapsed: 1.65 sec -
in org.apache.maven.shared.release.phase.CheckDependencySnapshotsPhaseTest
[windows-jdk8] Running org.apache.maven.shared.release.phase.CheckoutProjectFromScmTest
[windows-jdk8] [ERROR] ...
[windows-jdk8] [ERROR] No such provider: '...'.
[windows-jdk8] Tests run: 5, Failures: 0, Errors: 0, Skipped: 0, Time elapsed: 0.125 sec -
in org.apache.maven.shared.release.phase.CheckoutProjectFromScmTest
[windows-jdk8] Running org.apache.maven.shared.release.phase.CheckPomPhaseTest
[windows-jdk8] Tests run: 9, Failures: 0, Errors: 0, Skipped: 0, Time elapsed: 0.156 sec -
in org.apache.maven.shared.release.phase.CheckPomPhaseTest
[windows-jdk8] Running org.apache.maven.shared.release.phase.CreateBackupPomsPhaseTest
[windows-jdk8] Tests run: 2, Failures: 0, Errors: 0, Skipped: 0, Time elapsed: 0.039 sec -
in org.apache.maven.shared.release.phase.CreateBackupPomsPhaseTest
[windows-jdk8] Running org.apache.maven.shared.release.phase.EndReleasePhaseTest
[windows-jdk8] Tests run: 2, Failures: 0, Errors: 0, Skipped: 0, Time elapsed: 0.015 sec -
in org.apache.maven.shared.release.phase.EndReleasePhaseTest
[windows-jdk8] Running org.apache.maven.shared.release.phase.GenerateReleasePomsPhaseTest
[windows-jdk8] Tests run: 40, Failures: 0, Errors: 0, Skipped: 0, Time elapsed: 3.011 sec
- in org.apache.maven.shared.release.phase.GenerateReleasePomsPhaseTest
[windows-jdk8] Running org.apache.maven.shared.release.phase.InputVariablesPhaseTest
[windows-jdk8] Tests run: 9, Failures: 0, Errors: 0, Skipped: 0, Time elapsed: 0.121 sec -
in org.apache.maven.shared.release.phase.InputVariablesPhaseTest
[windows-jdk8] Running org.apache.maven.shared.release.phase.MapVersionsPhaseTest
[windows-jdk8] Sending interrupt signal to process
[windows-jdk9] Sending interrupt signal to process
[Pipeline] [linux-jdk7] }
[Pipeline] [linux-jdk8] }
[Pipeline] [windows-jdk7] }
[Pipeline] [windows-jdk9] }
[Pipeline] [linux-jdk7] // dir
[Pipeline] [linux-jdk8] // dir
[Pipeline] [windows-jdk7] // dir
[Pipeline] [windows-jdk9] // dir
[windows-jdk8] After 10s process did not stop
[Pipeline] [linux-jdk7] }
[linux-jdk7] [withMaven] One or multiple Maven executions have been ignored by the Jenkins
Pipeline Maven Plugin because they have been interrupted before completion (2). See Pipeline
Maven Plugin FAQ for more details.
[Pipeline] [linux-jdk8] }
[linux-jdk8] [withMaven] Skip 'Generated Artifacts Publisher' disabled by configuration
[linux-jdk8] [withMaven] junitPublisher - Archive test results for Maven artifact org.apache.maven.release:maven-release-api:3.0.0-SNAPSHOT
generated by maven-surefire-plugin:test (default-test): m/maven-release-api/target/surefire-reports/*.xml
[linux-jdk8] [withMaven] junitPublisher - Jenkins JUnit Attachments Plugin not found, can't
publish test attachments.Recording test results
[linux-jdk8] None of the test reports contained any result
[linux-jdk8] [withMaven] junitPublisher - Archive test results for Maven artifact org.apache.maven.release:maven-release-manager:3.0.0-SNAPSHOT
generated by maven-surefire-plugin:test (default-test): m/maven-release-manager/target/surefire-reports/*.xml
[linux-jdk8] [withMaven] junitPublisher - Jenkins JUnit Attachments Plugin not found, can't
publish test attachments.Recording test results
[linux-jdk8] [withMaven] Skip 'Findbugs Publisher' disabled by configuration
[linux-jdk8] [withMaven] Skip 'Open Task Scanner Publisher' disabled by configuration
[Pipeline] [windows-jdk7] }
[windows-jdk7] [withMaven] One or multiple Maven executions have been ignored by the Jenkins
Pipeline Maven Plugin because they have been interrupted before completion (1). See Pipeline
Maven Plugin FAQ for more details.
[Pipeline] [windows-jdk9] }
[windows-jdk9] [withMaven] Skip 'Generated Artifacts Publisher' disabled by configuration
[windows-jdk9] [withMaven] junitPublisher - Archive test results for Maven artifact org.apache.maven.release:maven-release-api:3.0.0-SNAPSHOT
generated by maven-surefire-plugin:test (default-test): m\maven-release-api\target\surefire-reports\*.xml
[windows-jdk9] [withMaven] junitPublisher - Jenkins JUnit Attachments Plugin not found, can't
publish test attachments.Recording test results
[windows-jdk9] None of the test reports contained any result
[windows-jdk9] [withMaven] Skip 'Findbugs Publisher' disabled by configuration
[windows-jdk9] [withMaven] Skip 'Open Task Scanner Publisher' disabled by configuration
[Pipeline] [linux-jdk7] // withMaven
[Pipeline] [linux-jdk8] // withMaven
[Pipeline] [windows-jdk7] // withMaven
[Pipeline] [windows-jdk9] // withMaven
[Pipeline] [linux-jdk7] }
[Pipeline] [linux-jdk8] }
[Pipeline] [windows-jdk7] }
[Pipeline] [windows-jdk9] }
[Pipeline] [windows-jdk8] }
[Pipeline] [linux-jdk7] // stage
[Pipeline] [linux-jdk8] // stage
[Pipeline] [windows-jdk7] // stage
[Pipeline] [windows-jdk9] // stage
[Pipeline] [windows-jdk8] // dir
[Pipeline] [linux-jdk7] }
[Pipeline] [linux-jdk8] }
[Pipeline] [windows-jdk7] }
[Pipeline] [windows-jdk9] }
[Pipeline] [windows-jdk8] }
[windows-jdk8] [withMaven] One or multiple Maven executions have been ignored by the Jenkins
Pipeline Maven Plugin because they have been interrupted before completion (2). See Pipeline
Maven Plugin FAQ for more details.
[Pipeline] [linux-jdk7] // node
[Pipeline] [linux-jdk8] // node
[Pipeline] [windows-jdk7] // node
[Pipeline] [windows-jdk9] // node
[Pipeline] [windows-jdk8] // withMaven
[Pipeline] [linux-jdk7] }
[linux-jdk7] Failed in branch linux-jdk7
[Pipeline] [linux-jdk8] }
[linux-jdk8] Failed in branch linux-jdk8
[Pipeline] [windows-jdk7] }
[Pipeline] [windows-jdk9] }
[windows-jdk9] Failed in branch windows-jdk9
[Pipeline] [windows-jdk8] }
[Pipeline] [windows-jdk8] // stage
[Pipeline] [windows-jdk8] }
[Pipeline] [windows-jdk8] // node
[Pipeline] [windows-jdk8] }
[windows-jdk8] Failed in branch windows-jdk8
[Pipeline] // parallel
[Pipeline] stage
[Pipeline] { (Notifications)
[Pipeline] echo
Build result: FAILURE
[Pipeline] jiraIssueSelector
[Pipeline] emailext
Mime
  • Unnamed multipart/mixed (inline, None, 0 bytes)
View raw message