maven-notifications mailing list archives

Site index · List index
Message view « Date » · « Thread »
Top « Date » · « Thread »
From Apache Jenkins Server <jenk...@builds.apache.org>
Subject Build failed in Jenkins: Maven TLP » maven-javadoc-plugin » master #1
Date Sat, 09 Dec 2017 19:05:26 GMT
See https://builds.apache.org/job/maven-box/job/maven-javadoc-plugin/job/master/1/

No changes.

10 tests failed.
FAILED:  org.apache.maven.plugins.javadoc.FixJavadocMojoTest.testFix

Error Message:
Error occurred during initialization of VM, try to reduce the Java heap size for the MAVEN_OPTS
environnement variable using -Xms:<size> and -Xmx:<size>.

Stack Trace:
org.apache.maven.shared.invoker.MavenInvocationException: Error occurred during initialization
of VM, try to reduce the Java heap size for the MAVEN_OPTS environnement variable using -Xms:<size>
and -Xmx:<size>.
	at org.apache.maven.plugins.javadoc.FixJavadocMojoTest.invokeCompileGoal(FixJavadocMojoTest.java:655)
	at org.apache.maven.plugins.javadoc.FixJavadocMojoTest.executeMojoAndTest(FixJavadocMojoTest.java:612)
	at org.apache.maven.plugins.javadoc.FixJavadocMojoTest.testFix(FixJavadocMojoTest.java:141)


FAILED:  org.apache.maven.plugins.javadoc.FixJavadocMojoTest.testFixJdk5

Error Message:
Error occurred during initialization of VM, try to reduce the Java heap size for the MAVEN_OPTS
environnement variable using -Xms:<size> and -Xmx:<size>.

Stack Trace:
org.apache.maven.shared.invoker.MavenInvocationException: Error occurred during initialization
of VM, try to reduce the Java heap size for the MAVEN_OPTS environnement variable using -Xms:<size>
and -Xmx:<size>.
	at org.apache.maven.plugins.javadoc.FixJavadocMojoTest.invokeCompileGoal(FixJavadocMojoTest.java:655)
	at org.apache.maven.plugins.javadoc.FixJavadocMojoTest.executeMojoAndTest(FixJavadocMojoTest.java:612)
	at org.apache.maven.plugins.javadoc.FixJavadocMojoTest.testFixJdk5(FixJavadocMojoTest.java:152)


FAILED:  org.apache.maven.plugins.javadoc.FixJavadocMojoTest.testFixJdk6

Error Message:
Error occurred during initialization of VM, try to reduce the Java heap size for the MAVEN_OPTS
environnement variable using -Xms:<size> and -Xmx:<size>.

Stack Trace:
org.apache.maven.shared.invoker.MavenInvocationException: Error occurred during initialization
of VM, try to reduce the Java heap size for the MAVEN_OPTS environnement variable using -Xms:<size>
and -Xmx:<size>.
	at org.apache.maven.plugins.javadoc.FixJavadocMojoTest.invokeCompileGoal(FixJavadocMojoTest.java:655)
	at org.apache.maven.plugins.javadoc.FixJavadocMojoTest.executeMojoAndTest(FixJavadocMojoTest.java:612)
	at org.apache.maven.plugins.javadoc.FixJavadocMojoTest.testFixJdk6(FixJavadocMojoTest.java:163)


FAILED:  org.apache.maven.plugins.javadoc.JavadocReportTest.testDefaultConfiguration

Error Message:
null

Stack Trace:
junit.framework.AssertionFailedError
	at org.apache.maven.plugins.javadoc.JavadocReportTest.testDefaultConfiguration(JavadocReportTest.java:225)


FAILED:  org.apache.maven.plugins.javadoc.JavadocReportTest.testJavadocResources

Error Message:
This bug appeared in JDK8 and was planned to be fixed in JDK9, see JDK-8032205

Stack Trace:
junit.framework.AssertionFailedError: This bug appeared in JDK8 and was planned to be fixed
in JDK9, see JDK-8032205
	at org.apache.maven.plugins.javadoc.JavadocReportTest.testJavadocResources(JavadocReportTest.java:637)


FAILED:  org.apache.maven.plugins.javadoc.JavadocReportTest.testDefaultConfiguration

Error Message:
null

Stack Trace:
junit.framework.AssertionFailedError
	at org.apache.maven.plugins.javadoc.JavadocReportTest.testDefaultConfiguration(JavadocReportTest.java:225)


FAILED:  org.apache.maven.plugins.javadoc.JavadocReportTest.testJdk5

Error Message:
An error has occurred in Javadoc report generation: 
Exit code: 2 - Picked up JAVA_TOOL_OPTIONS: -Dmaven.ext.class.path="/home/jenkins/jenkins-slave/workspace/maven-javadoc-plugin_master-XEOGALQNOP5LSNOEDUT42L6QGQHATWO55CM3NEKN4WGK3JAPU26Q@tmp/withMavenb539373a/pipeline-maven-spy.jar"
-Dorg.jenkinsci.plugins.pipeline.maven.reportsFolder="/home/jenkins/jenkins-slave/workspace/maven-javadoc-plugin_master-XEOGALQNOP5LSNOEDUT42L6QGQHATWO55CM3NEKN4WGK3JAPU26Q@tmp/withMavenb539373a"

error: Source option 1.5 is no longer supported. Use 1.6 or later.

Command line was: /home/jenkins/tools/java/latest1.9/bin/javadoc @options @packages

Refer to the generated Javadoc files in '/home/jenkins/jenkins-slave/workspace/maven-javadoc-plugin_master-XEOGALQNOP5LSNOEDUT42L6QGQHATWO55CM3NEKN4WGK3JAPU26Q/m/target/test/unit/jdk5-test/target/site/apidocs'
dir.


Stack Trace:
org.apache.maven.plugin.MojoExecutionException: 
An error has occurred in Javadoc report generation: 
Exit code: 2 - Picked up JAVA_TOOL_OPTIONS: -Dmaven.ext.class.path="/home/jenkins/jenkins-slave/workspace/maven-javadoc-plugin_master-XEOGALQNOP5LSNOEDUT42L6QGQHATWO55CM3NEKN4WGK3JAPU26Q@tmp/withMavenb539373a/pipeline-maven-spy.jar"
-Dorg.jenkinsci.plugins.pipeline.maven.reportsFolder="/home/jenkins/jenkins-slave/workspace/maven-javadoc-plugin_master-XEOGALQNOP5LSNOEDUT42L6QGQHATWO55CM3NEKN4WGK3JAPU26Q@tmp/withMavenb539373a"

error: Source option 1.5 is no longer supported. Use 1.6 or later.

Command line was: /home/jenkins/tools/java/latest1.9/bin/javadoc @options @packages

Refer to the generated Javadoc files in '/home/jenkins/jenkins-slave/workspace/maven-javadoc-plugin_master-XEOGALQNOP5LSNOEDUT42L6QGQHATWO55CM3NEKN4WGK3JAPU26Q/m/target/test/unit/jdk5-test/target/site/apidocs'
dir.

	at org.apache.maven.plugins.javadoc.JavadocReportTest.testJdk5(JavadocReportTest.java:558)
Caused by: org.apache.maven.reporting.MavenReportException: 

Exit code: 2 - Picked up JAVA_TOOL_OPTIONS: -Dmaven.ext.class.path="/home/jenkins/jenkins-slave/workspace/maven-javadoc-plugin_master-XEOGALQNOP5LSNOEDUT42L6QGQHATWO55CM3NEKN4WGK3JAPU26Q@tmp/withMavenb539373a/pipeline-maven-spy.jar"
-Dorg.jenkinsci.plugins.pipeline.maven.reportsFolder="/home/jenkins/jenkins-slave/workspace/maven-javadoc-plugin_master-XEOGALQNOP5LSNOEDUT42L6QGQHATWO55CM3NEKN4WGK3JAPU26Q@tmp/withMavenb539373a"

error: Source option 1.5 is no longer supported. Use 1.6 or later.

Command line was: /home/jenkins/tools/java/latest1.9/bin/javadoc @options @packages

Refer to the generated Javadoc files in '/home/jenkins/jenkins-slave/workspace/maven-javadoc-plugin_master-XEOGALQNOP5LSNOEDUT42L6QGQHATWO55CM3NEKN4WGK3JAPU26Q/m/target/test/unit/jdk5-test/target/site/apidocs'
dir.

	at org.apache.maven.plugins.javadoc.JavadocReportTest.testJdk5(JavadocReportTest.java:558)


FAILED:  org.apache.maven.plugins.javadoc.JavadocReportTest.testDefaultConfiguration

Error Message:
null

Stack Trace:
junit.framework.AssertionFailedError
	at org.apache.maven.plugins.javadoc.JavadocReportTest.testDefaultConfiguration(JavadocReportTest.java:225)


FAILED:  org.apache.maven.plugins.javadoc.JavadocReportTest.testDocfiles

Error Message:
null

Stack Trace:
junit.framework.AssertionFailedError
	at org.apache.maven.plugins.javadoc.JavadocReportTest.testDocfiles(JavadocReportTest.java:307)


FAILED:  org.apache.maven.plugins.javadoc.TestJavadocReportTest.testTestJavadoc

Error Message:
An error has occurred in Test Javadoc report generation: 
Exit code: 1 - Picked up JAVA_TOOL_OPTIONS: -Dmaven.ext.class.path="/home/jenkins/jenkins-slave/workspace/maven-javadoc-plugin_master-XEOGALQNOP5LSNOEDUT42L6QGQHATWO55CM3NEKN4WGK3JAPU26Q@tmp/withMavenb539373a/pipeline-maven-spy.jar"
-Dorg.jenkinsci.plugins.pipeline.maven.reportsFolder="/home/jenkins/jenkins-slave/workspace/maven-javadoc-plugin_master-XEOGALQNOP5LSNOEDUT42L6QGQHATWO55CM3NEKN4WGK3JAPU26Q@tmp/withMavenb539373a"

/home/jenkins/jenkins-slave/workspace/maven-javadoc-plugin_master-XEOGALQNOP5LSNOEDUT42L6QGQHATWO55CM3NEKN4WGK3JAPU26Q/m/src/test/resources/unit/test-javadoc-test/src/test/java/maven/AppTest.java:22:
error: package junit.framework does not exist
import junit.framework.Test;
                      ^
/home/jenkins/jenkins-slave/workspace/maven-javadoc-plugin_master-XEOGALQNOP5LSNOEDUT42L6QGQHATWO55CM3NEKN4WGK3JAPU26Q/m/src/test/resources/unit/test-javadoc-test/src/test/java/maven/AppTest.java:23:
error: package junit.framework does not exist
import junit.framework.TestCase;
                      ^
/home/jenkins/jenkins-slave/workspace/maven-javadoc-plugin_master-XEOGALQNOP5LSNOEDUT42L6QGQHATWO55CM3NEKN4WGK3JAPU26Q/m/src/test/resources/unit/test-javadoc-test/src/test/java/maven/AppTest.java:24:
error: package junit.framework does not exist
import junit.framework.TestSuite;
                      ^
/home/jenkins/jenkins-slave/workspace/maven-javadoc-plugin_master-XEOGALQNOP5LSNOEDUT42L6QGQHATWO55CM3NEKN4WGK3JAPU26Q/m/src/test/resources/unit/test-javadoc-test/src/test/java/maven/AppTest.java:30:
error: cannot find symbol
    extends TestCase
            ^
  symbol: class TestCase
/home/jenkins/jenkins-slave/workspace/maven-javadoc-plugin_master-XEOGALQNOP5LSNOEDUT42L6QGQHATWO55CM3NEKN4WGK3JAPU26Q/m/src/test/resources/unit/test-javadoc-test/src/test/java/maven/AppTest.java:45:
error: cannot find symbol
    public static Test suite()
                  ^
  symbol:   class Test
  location: class AppTest

Command line was: /home/jenkins/tools/java/latest1.9/bin/javadoc @options @packages

Refer to the generated Javadoc files in '/home/jenkins/jenkins-slave/workspace/maven-javadoc-plugin_master-XEOGALQNOP5LSNOEDUT42L6QGQHATWO55CM3NEKN4WGK3JAPU26Q/m/target/test/unit/test-javadoc-test/target/site/apidocs'
dir.


Stack Trace:
org.apache.maven.plugin.MojoExecutionException: 
An error has occurred in Test Javadoc report generation: 
Exit code: 1 - Picked up JAVA_TOOL_OPTIONS: -Dmaven.ext.class.path="/home/jenkins/jenkins-slave/workspace/maven-javadoc-plugin_master-XEOGALQNOP5LSNOEDUT42L6QGQHATWO55CM3NEKN4WGK3JAPU26Q@tmp/withMavenb539373a/pipeline-maven-spy.jar"
-Dorg.jenkinsci.plugins.pipeline.maven.reportsFolder="/home/jenkins/jenkins-slave/workspace/maven-javadoc-plugin_master-XEOGALQNOP5LSNOEDUT42L6QGQHATWO55CM3NEKN4WGK3JAPU26Q@tmp/withMavenb539373a"

/home/jenkins/jenkins-slave/workspace/maven-javadoc-plugin_master-XEOGALQNOP5LSNOEDUT42L6QGQHATWO55CM3NEKN4WGK3JAPU26Q/m/src/test/resources/unit/test-javadoc-test/src/test/java/maven/AppTest.java:22:
error: package junit.framework does not exist
import junit.framework.Test;
                      ^
/home/jenkins/jenkins-slave/workspace/maven-javadoc-plugin_master-XEOGALQNOP5LSNOEDUT42L6QGQHATWO55CM3NEKN4WGK3JAPU26Q/m/src/test/resources/unit/test-javadoc-test/src/test/java/maven/AppTest.java:23:
error: package junit.framework does not exist
import junit.framework.TestCase;
                      ^
/home/jenkins/jenkins-slave/workspace/maven-javadoc-plugin_master-XEOGALQNOP5LSNOEDUT42L6QGQHATWO55CM3NEKN4WGK3JAPU26Q/m/src/test/resources/unit/test-javadoc-test/src/test/java/maven/AppTest.java:24:
error: package junit.framework does not exist
import junit.framework.TestSuite;
                      ^
/home/jenkins/jenkins-slave/workspace/maven-javadoc-plugin_master-XEOGALQNOP5LSNOEDUT42L6QGQHATWO55CM3NEKN4WGK3JAPU26Q/m/src/test/resources/unit/test-javadoc-test/src/test/java/maven/AppTest.java:30:
error: cannot find symbol
    extends TestCase
            ^
  symbol: class TestCase
/home/jenkins/jenkins-slave/workspace/maven-javadoc-plugin_master-XEOGALQNOP5LSNOEDUT42L6QGQHATWO55CM3NEKN4WGK3JAPU26Q/m/src/test/resources/unit/test-javadoc-test/src/test/java/maven/AppTest.java:45:
error: cannot find symbol
    public static Test suite()
                  ^
  symbol:   class Test
  location: class AppTest

Command line was: /home/jenkins/tools/java/latest1.9/bin/javadoc @options @packages

Refer to the generated Javadoc files in '/home/jenkins/jenkins-slave/workspace/maven-javadoc-plugin_master-XEOGALQNOP5LSNOEDUT42L6QGQHATWO55CM3NEKN4WGK3JAPU26Q/m/target/test/unit/test-javadoc-test/target/site/apidocs'
dir.

	at org.apache.maven.plugins.javadoc.TestJavadocReportTest.testTestJavadoc(TestJavadocReportTest.java:53)
Caused by: org.apache.maven.reporting.MavenReportException: 

Exit code: 1 - Picked up JAVA_TOOL_OPTIONS: -Dmaven.ext.class.path="/home/jenkins/jenkins-slave/workspace/maven-javadoc-plugin_master-XEOGALQNOP5LSNOEDUT42L6QGQHATWO55CM3NEKN4WGK3JAPU26Q@tmp/withMavenb539373a/pipeline-maven-spy.jar"
-Dorg.jenkinsci.plugins.pipeline.maven.reportsFolder="/home/jenkins/jenkins-slave/workspace/maven-javadoc-plugin_master-XEOGALQNOP5LSNOEDUT42L6QGQHATWO55CM3NEKN4WGK3JAPU26Q@tmp/withMavenb539373a"

/home/jenkins/jenkins-slave/workspace/maven-javadoc-plugin_master-XEOGALQNOP5LSNOEDUT42L6QGQHATWO55CM3NEKN4WGK3JAPU26Q/m/src/test/resources/unit/test-javadoc-test/src/test/java/maven/AppTest.java:22:
error: package junit.framework does not exist
import junit.framework.Test;
                      ^
/home/jenkins/jenkins-slave/workspace/maven-javadoc-plugin_master-XEOGALQNOP5LSNOEDUT42L6QGQHATWO55CM3NEKN4WGK3JAPU26Q/m/src/test/resources/unit/test-javadoc-test/src/test/java/maven/AppTest.java:23:
error: package junit.framework does not exist
import junit.framework.TestCase;
                      ^
/home/jenkins/jenkins-slave/workspace/maven-javadoc-plugin_master-XEOGALQNOP5LSNOEDUT42L6QGQHATWO55CM3NEKN4WGK3JAPU26Q/m/src/test/resources/unit/test-javadoc-test/src/test/java/maven/AppTest.java:24:
error: package junit.framework does not exist
import junit.framework.TestSuite;
                      ^
/home/jenkins/jenkins-slave/workspace/maven-javadoc-plugin_master-XEOGALQNOP5LSNOEDUT42L6QGQHATWO55CM3NEKN4WGK3JAPU26Q/m/src/test/resources/unit/test-javadoc-test/src/test/java/maven/AppTest.java:30:
error: cannot find symbol
    extends TestCase
            ^
  symbol: class TestCase
/home/jenkins/jenkins-slave/workspace/maven-javadoc-plugin_master-XEOGALQNOP5LSNOEDUT42L6QGQHATWO55CM3NEKN4WGK3JAPU26Q/m/src/test/resources/unit/test-javadoc-test/src/test/java/maven/AppTest.java:45:
error: cannot find symbol
    public static Test suite()
                  ^
  symbol:   class Test
  location: class AppTest

Command line was: /home/jenkins/tools/java/latest1.9/bin/javadoc @options @packages

Refer to the generated Javadoc files in '/home/jenkins/jenkins-slave/workspace/maven-javadoc-plugin_master-XEOGALQNOP5LSNOEDUT42L6QGQHATWO55CM3NEKN4WGK3JAPU26Q/m/target/test/unit/test-javadoc-test/target/site/apidocs'
dir.

	at org.apache.maven.plugins.javadoc.TestJavadocReportTest.testTestJavadoc(TestJavadocReportTest.java:53)




Build log:
[...truncated 1.54 MB...]
[windows-jdk7] [INFO] Downloaded: https://repo.maven.apache.org/maven2/org/codehaus/modello/modello-plugin-converters/1.8.1/modello-plugin-converters-1.8.1.jar
(9.4 kB at 56 kB/s)
[windows-jdk7] [INFO] Downloading: https://repo.maven.apache.org/maven2/com/fasterxml/jackson/core/jackson-annotations/2.1.5/jackson-annotations-2.1.5.jar
[windows-jdk7] [INFO] Downloaded: https://repo.maven.apache.org/maven2/org/codehaus/modello/modello-plugin-jackson/1.8.1/modello-plugin-jackson-1.8.1.jar
(19 kB at 115 kB/s)
[windows-jdk7] [INFO] Downloading: https://repo.maven.apache.org/maven2/org/codehaus/modello/modello-plugin-java/1.8.1/modello-plugin-java-1.8.1.jar
[windows-jdk7] [INFO] Downloaded: https://repo.maven.apache.org/maven2/org/codehaus/modello/modello-plugin-xml/1.8.1/modello-plugin-xml-1.8.1.jar
(15 kB at 88 kB/s)
[windows-jdk7] [INFO] Downloading: https://repo.maven.apache.org/maven2/org/codehaus/modello/modello-plugin-jdom/1.8.1/modello-plugin-jdom-1.8.1.jar
[windows-jdk7] [INFO] Downloaded: https://repo.maven.apache.org/maven2/org/codehaus/modello/modello-plugin-java/1.8.1/modello-plugin-java-1.8.1.jar
(89 kB at 477 kB/s)
[windows-jdk7] [INFO] Downloading: https://repo.maven.apache.org/maven2/org/codehaus/modello/modello-plugin-jsonschema/1.8.1/modello-plugin-jsonschema-1.8.1.jar
[windows-jdk7] [INFO] Downloaded: https://repo.maven.apache.org/maven2/com/fasterxml/jackson/core/jackson-annotations/2.1.5/jackson-annotations-2.1.5.jar
(34 kB at 183 kB/s)
[windows-jdk7] [INFO] Downloading: https://repo.maven.apache.org/maven2/org/codehaus/modello/modello-plugin-sax/1.8.1/modello-plugin-sax-1.8.1.jar
[windows-jdk7] [INFO] Downloaded: https://repo.maven.apache.org/maven2/org/codehaus/modello/modello-plugin-jdom/1.8.1/modello-plugin-jdom-1.8.1.jar
(14 kB at 74 kB/s)
[windows-jdk7] [INFO] Downloading: https://repo.maven.apache.org/maven2/org/codehaus/modello/modello-plugin-snakeyaml/1.8.1/modello-plugin-snakeyaml-1.8.1.jar
[windows-jdk7] [INFO] Downloaded: https://repo.maven.apache.org/maven2/com/fasterxml/jackson/core/jackson-core/2.1.5/jackson-core-2.1.5.jar
(207 kB at 1.1 MB/s)
[windows-jdk7] [INFO] Downloading: https://repo.maven.apache.org/maven2/org/yaml/snakeyaml/1.12/snakeyaml-1.12.jar
[windows-jdk7] [INFO] Downloaded: https://repo.maven.apache.org/maven2/org/codehaus/modello/modello-plugin-sax/1.8.1/modello-plugin-sax-1.8.1.jar
(11 kB at 53 kB/s)
[windows-jdk7] [INFO] Downloading: https://repo.maven.apache.org/maven2/org/codehaus/modello/modello-plugin-stax/1.8.1/modello-plugin-stax-1.8.1.jar
[windows-jdk7] [INFO] Downloaded: https://repo.maven.apache.org/maven2/org/codehaus/modello/modello-plugin-jsonschema/1.8.1/modello-plugin-jsonschema-1.8.1.jar
(6.8 kB at 34 kB/s)
[windows-jdk7] [INFO] Downloading: https://repo.maven.apache.org/maven2/org/codehaus/modello/modello-plugin-xdoc/1.8.1/modello-plugin-xdoc-1.8.1.jar
[windows-jdk7] [INFO] Downloaded: https://repo.maven.apache.org/maven2/com/fasterxml/jackson/core/jackson-databind/2.1.5/jackson-databind-2.1.5.jar
(927 kB at 4.5 MB/s)
[windows-jdk7] [INFO] Downloading: https://repo.maven.apache.org/maven2/org/codehaus/modello/modello-plugin-xpp3/1.8.1/modello-plugin-xpp3-1.8.1.jar
[windows-jdk7] [INFO] Downloaded: https://repo.maven.apache.org/maven2/org/codehaus/modello/modello-plugin-snakeyaml/1.8.1/modello-plugin-snakeyaml-1.8.1.jar
(21 kB at 99 kB/s)
[windows-jdk7] [INFO] Downloading: https://repo.maven.apache.org/maven2/org/codehaus/modello/modello-plugin-xsd/1.8.1/modello-plugin-xsd-1.8.1.jar
[windows-jdk7] [INFO] Downloaded: https://repo.maven.apache.org/maven2/org/codehaus/modello/modello-plugin-xdoc/1.8.1/modello-plugin-xdoc-1.8.1.jar
(14 kB at 66 kB/s)
[windows-jdk7] [INFO] Downloading: https://repo.maven.apache.org/maven2/org/sonatype/plexus/plexus-build-api/0.0.7/plexus-build-api-0.0.7.jar
[windows-jdk7] [INFO] Downloaded: https://repo.maven.apache.org/maven2/org/codehaus/modello/modello-plugin-stax/1.8.1/modello-plugin-stax-1.8.1.jar
(37 kB at 174 kB/s)
[windows-jdk7] [INFO] Downloaded: https://repo.maven.apache.org/maven2/org/yaml/snakeyaml/1.12/snakeyaml-1.12.jar
(271 kB at 1.3 MB/s)
[windows-jdk7] [INFO] Downloaded: https://repo.maven.apache.org/maven2/org/codehaus/modello/modello-plugin-xpp3/1.8.1/modello-plugin-xpp3-1.8.1.jar
(24 kB at 111 kB/s)
[windows-jdk7] [INFO] Downloaded: https://repo.maven.apache.org/maven2/org/codehaus/modello/modello-plugin-xsd/1.8.1/modello-plugin-xsd-1.8.1.jar
(14 kB at 65 kB/s)
[windows-jdk7] [INFO] Downloaded: https://repo.maven.apache.org/maven2/org/sonatype/plexus/plexus-build-api/0.0.7/plexus-build-api-0.0.7.jar
(8.5 kB at 39 kB/s)
[windows-jdk7] [INFO] outputDirectory: f:\jenkins\jenkins-slave\workspace\maven-javadoc-plugin_master-XEOGALQNOP5LSNOEDUT42L6QGQHATWO55CM3NEKN4WGK3JAPU26Q\m\target\generated-sources\modello
[windows-jdk7] [INFO] Working on model: src/main/mdo/javadocOptions.mdo
[windows-jdk7] [INFO] Generating current version: 1.1.0
[windows-jdk7] [INFO] 
[windows-jdk7] [INFO] --- modello-maven-plugin:1.8.1:xpp3-reader (default) @ maven-javadoc-plugin
---
[windows-jdk7] [INFO] outputDirectory: f:\jenkins\jenkins-slave\workspace\maven-javadoc-plugin_master-XEOGALQNOP5LSNOEDUT42L6QGQHATWO55CM3NEKN4WGK3JAPU26Q\m\target\generated-sources\modello
[windows-jdk7] [INFO] Working on model: src/main/mdo/javadocOptions.mdo
[windows-jdk7] [INFO] Generating current version: 1.1.0
[windows-jdk7] [INFO] 
[windows-jdk7] [INFO] --- modello-maven-plugin:1.8.1:xpp3-writer (default) @ maven-javadoc-plugin
---
[windows-jdk7] [INFO] outputDirectory: f:\jenkins\jenkins-slave\workspace\maven-javadoc-plugin_master-XEOGALQNOP5LSNOEDUT42L6QGQHATWO55CM3NEKN4WGK3JAPU26Q\m\target\generated-sources\modello
[windows-jdk7] [INFO] Working on model: src/main/mdo/javadocOptions.mdo
[windows-jdk7] [INFO] Generating current version: 1.1.0
[windows-jdk7] [INFO] 
[windows-jdk7] [INFO] --- maven-remote-resources-plugin:1.5:process (process-resource-bundles)
@ maven-javadoc-plugin ---
[windows-jdk7] [INFO] Downloading: https://repo.maven.apache.org/maven2/org/apache/maven/shared/maven-artifact-resolver/1.0/maven-artifact-resolver-1.0.pom
[windows-jdk7] [INFO] Downloaded: https://repo.maven.apache.org/maven2/org/apache/maven/shared/maven-artifact-resolver/1.0/maven-artifact-resolver-1.0.pom
(6.0 kB at 545 kB/s)
[windows-jdk7] [INFO] Downloading: https://repo.maven.apache.org/maven2/org/apache/maven/shared/maven-shared-components/12/maven-shared-components-12.pom
[windows-jdk7] [INFO] Downloaded: https://repo.maven.apache.org/maven2/org/apache/maven/shared/maven-shared-components/12/maven-shared-components-12.pom
(9.3 kB at 934 kB/s)
[windows-jdk7] [INFO] Downloading: https://repo.maven.apache.org/maven2/org/apache/maven/maven-parent/13/maven-parent-13.pom
[windows-jdk7] [INFO] Downloaded: https://repo.maven.apache.org/maven2/org/apache/maven/maven-parent/13/maven-parent-13.pom
(23 kB at 1.9 MB/s)
[windows-jdk7] [INFO] Downloading: https://repo.maven.apache.org/maven2/org/apache/maven/maven-artifact/2.0.8/maven-artifact-2.0.8.pom
[windows-jdk7] [INFO] Downloaded: https://repo.maven.apache.org/maven2/org/apache/maven/maven-artifact/2.0.8/maven-artifact-2.0.8.pom
(1.6 kB at 180 kB/s)
[windows-jdk7] [INFO] Downloading: https://repo.maven.apache.org/maven2/org/codehaus/plexus/plexus-utils/1.4.6/plexus-utils-1.4.6.pom
[windows-jdk7] [INFO] Downloaded: https://repo.maven.apache.org/maven2/org/codehaus/plexus/plexus-utils/1.4.6/plexus-utils-1.4.6.pom
(2.3 kB at 283 kB/s)
[windows-jdk7] [INFO] Downloading: https://repo.maven.apache.org/maven2/org/apache/maven/maven-project/2.0.8/maven-project-2.0.8.pom
[windows-jdk7] [INFO] Downloaded: https://repo.maven.apache.org/maven2/org/apache/maven/maven-project/2.0.8/maven-project-2.0.8.pom
(2.7 kB at 339 kB/s)
[windows-jdk7] [INFO] Downloading: https://repo.maven.apache.org/maven2/org/apache/maven/maven-settings/2.0.8/maven-settings-2.0.8.pom
[windows-jdk7] [INFO] Downloaded: https://repo.maven.apache.org/maven2/org/apache/maven/maven-settings/2.0.8/maven-settings-2.0.8.pom
(2.1 kB at 257 kB/s)
[windows-jdk7] [INFO] Downloading: https://repo.maven.apache.org/maven2/org/apache/maven/maven-profile/2.0.8/maven-profile-2.0.8.pom
[windows-jdk7] [INFO] Downloaded: https://repo.maven.apache.org/maven2/org/apache/maven/maven-profile/2.0.8/maven-profile-2.0.8.pom
(2.0 kB at 255 kB/s)
[windows-jdk7] [INFO] Downloading: https://repo.maven.apache.org/maven2/org/apache/maven/maven-artifact-manager/2.0.8/maven-artifact-manager-2.0.8.pom
[windows-jdk7] [INFO] Downloaded: https://repo.maven.apache.org/maven2/org/apache/maven/maven-artifact-manager/2.0.8/maven-artifact-manager-2.0.8.pom
(2.7 kB at 270 kB/s)
[windows-jdk7] [INFO] Downloading: https://repo.maven.apache.org/maven2/org/apache/maven/maven-repository-metadata/2.0.8/maven-repository-metadata-2.0.8.pom
[windows-jdk7] [INFO] Downloaded: https://repo.maven.apache.org/maven2/org/apache/maven/maven-repository-metadata/2.0.8/maven-repository-metadata-2.0.8.pom
(1.9 kB at 100 kB/s)
[windows-jdk7] [INFO] Downloading: https://repo.maven.apache.org/maven2/org/apache/maven/maven-plugin-registry/2.0.8/maven-plugin-registry-2.0.8.pom
[windows-jdk7] [INFO] Downloaded: https://repo.maven.apache.org/maven2/org/apache/maven/maven-plugin-registry/2.0.8/maven-plugin-registry-2.0.8.pom
(2.0 kB at 91 kB/s)
[windows-jdk7] [INFO] Downloading: https://repo.maven.apache.org/maven2/org/apache/maven/maven-plugin-api/2.0.8/maven-plugin-api-2.0.8.pom
[windows-jdk7] [INFO] Downloaded: https://repo.maven.apache.org/maven2/org/apache/maven/maven-plugin-api/2.0.8/maven-plugin-api-2.0.8.pom
(1.5 kB at 136 kB/s)
[windows-jdk7] [INFO] Downloading: https://repo.maven.apache.org/maven2/org/codehaus/plexus/plexus-utils/2.1/plexus-utils-2.1.pom
[windows-jdk7] [INFO] Downloaded: https://repo.maven.apache.org/maven2/org/codehaus/plexus/plexus-utils/2.1/plexus-utils-2.1.pom
(4.0 kB at 403 kB/s)
[windows-jdk7] [INFO] Downloading: https://repo.maven.apache.org/maven2/org/apache/maven/shared/maven-filtering/1.1/maven-filtering-1.1.pom
[windows-jdk7] [INFO] Downloaded: https://repo.maven.apache.org/maven2/org/apache/maven/shared/maven-filtering/1.1/maven-filtering-1.1.pom
(5.8 kB at 724 kB/s)
[windows-jdk7] [INFO] Downloading: https://repo.maven.apache.org/maven2/org/apache/maven/maven-project/2.0.6/maven-project-2.0.6.pom
[windows-jdk7] [INFO] Downloaded: https://repo.maven.apache.org/maven2/org/apache/maven/maven-project/2.0.6/maven-project-2.0.6.pom
(2.6 kB at 264 kB/s)
[windows-jdk7] [INFO] Downloading: https://repo.maven.apache.org/maven2/org/apache/maven/maven/2.0.6/maven-2.0.6.pom
[windows-jdk7] [INFO] Downloaded: https://repo.maven.apache.org/maven2/org/apache/maven/maven/2.0.6/maven-2.0.6.pom
(9.0 kB at 1.1 MB/s)
[windows-jdk7] [INFO] Downloading: https://repo.maven.apache.org/maven2/org/apache/maven/maven-settings/2.0.6/maven-settings-2.0.6.pom
[windows-jdk7] [INFO] Downloaded: https://repo.maven.apache.org/maven2/org/apache/maven/maven-settings/2.0.6/maven-settings-2.0.6.pom
(2.0 kB at 286 kB/s)
[windows-jdk7] [INFO] Downloading: https://repo.maven.apache.org/maven2/org/apache/maven/maven-model/2.0.6/maven-model-2.0.6.pom
[windows-jdk7] [INFO] Downloaded: https://repo.maven.apache.org/maven2/org/apache/maven/maven-model/2.0.6/maven-model-2.0.6.pom
(3.0 kB at 435 kB/s)
[windows-jdk7] [INFO] Downloading: https://repo.maven.apache.org/maven2/org/apache/maven/maven-profile/2.0.6/maven-profile-2.0.6.pom
[windows-jdk7] [INFO] Downloaded: https://repo.maven.apache.org/maven2/org/apache/maven/maven-profile/2.0.6/maven-profile-2.0.6.pom
(2.0 kB at 330 kB/s)
[windows-jdk7] [INFO] Downloading: https://repo.maven.apache.org/maven2/org/apache/maven/maven-artifact-manager/2.0.6/maven-artifact-manager-2.0.6.pom
[windows-jdk7] [INFO] Downloaded: https://repo.maven.apache.org/maven2/org/apache/maven/maven-artifact-manager/2.0.6/maven-artifact-manager-2.0.6.pom
(2.6 kB at 328 kB/s)
[windows-jdk7] [INFO] Downloading: https://repo.maven.apache.org/maven2/org/apache/maven/maven-repository-metadata/2.0.6/maven-repository-metadata-2.0.6.pom
[windows-jdk7] [INFO] Downloaded: https://repo.maven.apache.org/maven2/org/apache/maven/maven-repository-metadata/2.0.6/maven-repository-metadata-2.0.6.pom
(1.8 kB at 264 kB/s)
[windows-jdk7] [INFO] Downloading: https://repo.maven.apache.org/maven2/org/apache/maven/maven-artifact/2.0.6/maven-artifact-2.0.6.pom
[windows-jdk7] [INFO] Downloaded: https://repo.maven.apache.org/maven2/org/apache/maven/maven-artifact/2.0.6/maven-artifact-2.0.6.pom
(1.6 kB at 175 kB/s)
[windows-jdk7] [INFO] Downloading: https://repo.maven.apache.org/maven2/org/apache/maven/maven-plugin-registry/2.0.6/maven-plugin-registry-2.0.6.pom
[windows-jdk7] [INFO] Downloaded: https://repo.maven.apache.org/maven2/org/apache/maven/maven-plugin-registry/2.0.6/maven-plugin-registry-2.0.6.pom
(1.9 kB at 243 kB/s)
[windows-jdk7] [INFO] Downloading: https://repo.maven.apache.org/maven2/org/apache/maven/maven-core/2.0.6/maven-core-2.0.6.pom
[windows-jdk7] [INFO] Downloaded: https://repo.maven.apache.org/maven2/org/apache/maven/maven-core/2.0.6/maven-core-2.0.6.pom
(6.7 kB at 959 kB/s)
[windows-jdk7] [INFO] Downloading: https://repo.maven.apache.org/maven2/org/apache/maven/maven-plugin-parameter-documenter/2.0.6/maven-plugin-parameter-documenter-2.0.6.pom
[windows-jdk7] [INFO] Downloaded: https://repo.maven.apache.org/maven2/org/apache/maven/maven-plugin-parameter-documenter/2.0.6/maven-plugin-parameter-documenter-2.0.6.pom
(1.9 kB at 273 kB/s)
[windows-jdk7] [INFO] Downloading: https://repo.maven.apache.org/maven2/org/apache/maven/reporting/maven-reporting-api/2.0.6/maven-reporting-api-2.0.6.pom
[windows-jdk7] [INFO] Downloaded: https://repo.maven.apache.org/maven2/org/apache/maven/reporting/maven-reporting-api/2.0.6/maven-reporting-api-2.0.6.pom
(1.8 kB at 250 kB/s)
[windows-jdk7] [INFO] Downloading: https://repo.maven.apache.org/maven2/org/apache/maven/reporting/maven-reporting/2.0.6/maven-reporting-2.0.6.pom
[windows-jdk7] [INFO] Downloaded: https://repo.maven.apache.org/maven2/org/apache/maven/reporting/maven-reporting/2.0.6/maven-reporting-2.0.6.pom
(1.4 kB at 144 kB/s)
[windows-jdk7] [INFO] Downloading: https://repo.maven.apache.org/maven2/org/apache/maven/doxia/doxia-sink-api/1.0-alpha-7/doxia-sink-api-1.0-alpha-7.pom
[windows-jdk7] [INFO] Downloaded: https://repo.maven.apache.org/maven2/org/apache/maven/doxia/doxia-sink-api/1.0-alpha-7/doxia-sink-api-1.0-alpha-7.pom
(424 B at 61 kB/s)
[windows-jdk7] [INFO] Downloading: https://repo.maven.apache.org/maven2/org/apache/maven/doxia/doxia/1.0-alpha-7/doxia-1.0-alpha-7.pom
[windows-jdk7] [INFO] Downloaded: https://repo.maven.apache.org/maven2/org/apache/maven/doxia/doxia/1.0-alpha-7/doxia-1.0-alpha-7.pom
(3.9 kB at 559 kB/s)
[windows-jdk7] [INFO] Downloading: https://repo.maven.apache.org/maven2/org/apache/maven/maven-error-diagnostics/2.0.6/maven-error-diagnostics-2.0.6.pom
[windows-jdk7] [INFO] Downloaded: https://repo.maven.apache.org/maven2/org/apache/maven/maven-error-diagnostics/2.0.6/maven-error-diagnostics-2.0.6.pom
(1.7 kB at 213 kB/s)
[windows-jdk7] [INFO] Downloading: https://repo.maven.apache.org/maven2/commons-cli/commons-cli/1.0/commons-cli-1.0.pom
[windows-jdk7] [INFO] Downloaded: https://repo.maven.apache.org/maven2/commons-cli/commons-cli/1.0/commons-cli-1.0.pom
(2.1 kB at 301 kB/s)
[windows-jdk7] [INFO] Downloading: https://repo.maven.apache.org/maven2/org/apache/maven/maven-plugin-api/2.0.6/maven-plugin-api-2.0.6.pom
[windows-jdk7] [INFO] Downloaded: https://repo.maven.apache.org/maven2/org/apache/maven/maven-plugin-api/2.0.6/maven-plugin-api-2.0.6.pom
(1.5 kB at 208 kB/s)
[windows-jdk7] [INFO] Downloading: https://repo.maven.apache.org/maven2/org/apache/maven/maven-plugin-descriptor/2.0.6/maven-plugin-descriptor-2.0.6.pom
[windows-jdk7] [INFO] Downloaded: https://repo.maven.apache.org/maven2/org/apache/maven/maven-plugin-descriptor/2.0.6/maven-plugin-descriptor-2.0.6.pom
(2.0 kB at 224 kB/s)
[windows-jdk7] [INFO] Downloading: https://repo.maven.apache.org/maven2/org/apache/maven/maven-monitor/2.0.6/maven-monitor-2.0.6.pom
[windows-jdk7] [INFO] Downloaded: https://repo.maven.apache.org/maven2/org/apache/maven/maven-monitor/2.0.6/maven-monitor-2.0.6.pom
(1.3 kB at 157 kB/s)
[windows-jdk7] [INFO] Downloading: https://repo.maven.apache.org/maven2/org/codehaus/plexus/plexus-interpolation/1.12/plexus-interpolation-1.12.pom
[windows-jdk7] [INFO] Downloaded: https://repo.maven.apache.org/maven2/org/codehaus/plexus/plexus-interpolation/1.12/plexus-interpolation-1.12.pom
(889 B at 111 kB/s)
[windows-jdk7] [INFO] Downloading: https://repo.maven.apache.org/maven2/org/sonatype/plexus/plexus-build-api/0.0.4/plexus-build-api-0.0.4.pom
[windows-jdk7] [INFO] Downloaded: https://repo.maven.apache.org/maven2/org/sonatype/plexus/plexus-build-api/0.0.4/plexus-build-api-0.0.4.pom
(2.9 kB at 409 kB/s)
[windows-jdk7] [INFO] Downloading: https://repo.maven.apache.org/maven2/org/sonatype/spice/spice-parent/10/spice-parent-10.pom
[windows-jdk7] [INFO] Downloaded: https://repo.maven.apache.org/maven2/org/sonatype/spice/spice-parent/10/spice-parent-10.pom
(3.0 kB at 377 kB/s)
[windows-jdk7] [INFO] Downloading: https://repo.maven.apache.org/maven2/org/sonatype/forge/forge-parent/3/forge-parent-3.pom
[windows-jdk7] [INFO] Downloaded: https://repo.maven.apache.org/maven2/org/sonatype/forge/forge-parent/3/forge-parent-3.pom
(5.0 kB at 719 kB/s)
[windows-jdk7] [INFO] Downloading: https://repo.maven.apache.org/maven2/org/codehaus/plexus/plexus-utils/1.5.8/plexus-utils-1.5.8.pom
[windows-jdk7] [INFO] Downloaded: https://repo.maven.apache.org/maven2/org/codehaus/plexus/plexus-utils/1.5.8/plexus-utils-1.5.8.pom
(8.1 kB at 1.3 MB/s)
[windows-jdk7] [INFO] Downloading: https://repo.maven.apache.org/maven2/org/codehaus/plexus/plexus-resources/1.0-alpha-7/plexus-resources-1.0-alpha-7.pom
[windows-jdk7] [INFO] Downloaded: https://repo.maven.apache.org/maven2/org/codehaus/plexus/plexus-resources/1.0-alpha-7/plexus-resources-1.0-alpha-7.pom
(1.4 kB at 151 kB/s)
[windows-jdk7] [INFO] Downloading: https://repo.maven.apache.org/maven2/org/codehaus/plexus/plexus-components/1.1.17/plexus-components-1.1.17.pom
[windows-jdk7] [INFO] Downloaded: https://repo.maven.apache.org/maven2/org/codehaus/plexus/plexus-components/1.1.17/plexus-components-1.1.17.pom
(5.2 kB at 579 kB/s)
[windows-jdk7] [INFO] Downloading: https://repo.maven.apache.org/maven2/org/codehaus/plexus/plexus/2.0.5/plexus-2.0.5.pom
[windows-jdk7] [INFO] Downloaded: https://repo.maven.apache.org/maven2/org/codehaus/plexus/plexus/2.0.5/plexus-2.0.5.pom
(17 kB at 1.7 MB/s)
[windows-jdk7] [INFO] Downloading: https://repo.maven.apache.org/maven2/org/codehaus/plexus/plexus-resources/1.0-alpha-7/plexus-resources-1.0-alpha-7.jar
[windows-jdk7] [INFO] Downloading: https://repo.maven.apache.org/maven2/org/apache/maven/shared/maven-artifact-resolver/1.0/maven-artifact-resolver-1.0.jar
[windows-jdk7] [INFO] Downloading: https://repo.maven.apache.org/maven2/org/codehaus/plexus/plexus-interpolation/1.12/plexus-interpolation-1.12.jar
[windows-jdk7] [INFO] Downloading: https://repo.maven.apache.org/maven2/org/sonatype/plexus/plexus-build-api/0.0.4/plexus-build-api-0.0.4.jar
[windows-jdk7] [INFO] Downloading: https://repo.maven.apache.org/maven2/org/apache/maven/shared/maven-filtering/1.1/maven-filtering-1.1.jar
[windows-jdk7] [INFO] Downloaded: https://repo.maven.apache.org/maven2/org/apache/maven/shared/maven-artifact-resolver/1.0/maven-artifact-resolver-1.0.jar
(14 kB at 679 kB/s)
[windows-jdk7] [INFO] Downloading: https://repo.maven.apache.org/maven2/org/codehaus/plexus/plexus-utils/1.5.15/plexus-utils-1.5.15.jar
[windows-jdk7] [INFO] Downloaded: https://repo.maven.apache.org/maven2/org/codehaus/plexus/plexus-resources/1.0-alpha-7/plexus-resources-1.0-alpha-7.jar
(23 kB at 1.0 MB/s)
[windows-jdk7] [INFO] Downloaded: https://repo.maven.apache.org/maven2/org/sonatype/plexus/plexus-build-api/0.0.4/plexus-build-api-0.0.4.jar
(6.8 kB at 252 kB/s)
[windows-jdk7] [INFO] Downloaded: https://repo.maven.apache.org/maven2/org/apache/maven/shared/maven-filtering/1.1/maven-filtering-1.1.jar
(43 kB at 1.5 MB/s)
[windows-jdk7] [INFO] Downloaded: https://repo.maven.apache.org/maven2/org/codehaus/plexus/plexus-interpolation/1.12/plexus-interpolation-1.12.jar
(61 kB at 2.1 MB/s)
[windows-jdk7] [INFO] Downloaded: https://repo.maven.apache.org/maven2/org/codehaus/plexus/plexus-utils/1.5.15/plexus-utils-1.5.15.jar
(228 kB at 6.2 MB/s)
[windows-jdk7] [INFO] Downloading: https://repo.maven.apache.org/maven2/org/apache/apache-jar-resource-bundle/1.4/apache-jar-resource-bundle-1.4.jar
[windows-jdk7] [INFO] Downloaded: https://repo.maven.apache.org/maven2/org/apache/apache-jar-resource-bundle/1.4/apache-jar-resource-bundle-1.4.jar
(12 kB at 1.1 MB/s)
[windows-jdk7] [INFO] 
[windows-jdk7] [INFO] --- maven-resources-plugin:2.7:resources (default-resources) @ maven-javadoc-plugin
---
[windows-jdk7] [INFO] Downloading: https://repo.maven.apache.org/maven2/org/codehaus/plexus/plexus-utils/3.0.15/plexus-utils-3.0.15.pom
[windows-jdk7] [INFO] Downloaded: https://repo.maven.apache.org/maven2/org/codehaus/plexus/plexus-utils/3.0.15/plexus-utils-3.0.15.pom
(3.1 kB at 262 kB/s)
[windows-jdk7] [INFO] Downloading: https://repo.maven.apache.org/maven2/org/apache/maven/shared/maven-filtering/1.2/maven-filtering-1.2.pom
[windows-jdk7] [INFO] Downloaded: https://repo.maven.apache.org/maven2/org/apache/maven/shared/maven-filtering/1.2/maven-filtering-1.2.pom
(6.5 kB at 723 kB/s)
[windows-jdk7] [INFO] Downloading: https://repo.maven.apache.org/maven2/org/apache/maven/shared/maven-shared-utils/0.3/maven-shared-utils-0.3.pom
[windows-jdk7] [INFO] Downloaded: https://repo.maven.apache.org/maven2/org/apache/maven/shared/maven-shared-utils/0.3/maven-shared-utils-0.3.pom
(4.0 kB at 450 kB/s)
[windows-jdk7] [INFO] Downloading: https://repo.maven.apache.org/maven2/org/apache/maven/shared/maven-shared-components/18/maven-shared-components-18.pom
[windows-jdk7] [INFO] Downloaded: https://repo.maven.apache.org/maven2/org/apache/maven/shared/maven-shared-components/18/maven-shared-components-18.pom
(4.9 kB at 141 kB/s)
[windows-jdk7] [INFO] Downloading: https://repo.maven.apache.org/maven2/org/apache/maven/maven-parent/22/maven-parent-22.pom
[windows-jdk7] [INFO] Downloaded: https://repo.maven.apache.org/maven2/org/apache/maven/maven-parent/22/maven-parent-22.pom
(30 kB at 959 kB/s)
[windows-jdk7] [INFO] Downloading: https://repo.maven.apache.org/maven2/org/apache/apache/11/apache-11.pom
[windows-jdk7] [INFO] Downloaded: https://repo.maven.apache.org/maven2/org/apache/apache/11/apache-11.pom
(15 kB at 926 kB/s)
[windows-jdk7] [INFO] Downloading: https://repo.maven.apache.org/maven2/org/codehaus/plexus/plexus-interpolation/1.19/plexus-interpolation-1.19.pom
[windows-jdk7] [INFO] Downloaded: https://repo.maven.apache.org/maven2/org/codehaus/plexus/plexus-interpolation/1.19/plexus-interpolation-1.19.pom
(1.0 kB at 74 kB/s)
[windows-jdk7] [INFO] Downloading: https://repo.maven.apache.org/maven2/org/apache/maven/shared/maven-filtering/1.2/maven-filtering-1.2.jar
[windows-jdk7] [INFO] Downloading: https://repo.maven.apache.org/maven2/org/apache/maven/shared/maven-shared-utils/0.3/maven-shared-utils-0.3.jar
[windows-jdk7] [INFO] Downloading: https://repo.maven.apache.org/maven2/org/codehaus/plexus/plexus-interpolation/1.19/plexus-interpolation-1.19.jar
[windows-jdk7] [INFO] Downloading: https://repo.maven.apache.org/maven2/org/codehaus/plexus/plexus-utils/3.0.15/plexus-utils-3.0.15.jar
[windows-jdk7] [INFO] Downloaded: https://repo.maven.apache.org/maven2/org/apache/maven/shared/maven-filtering/1.2/maven-filtering-1.2.jar
(44 kB at 2.3 MB/s)
[windows-jdk7] [INFO] Downloaded: https://repo.maven.apache.org/maven2/org/apache/maven/shared/maven-shared-utils/0.3/maven-shared-utils-0.3.jar
(155 kB at 2.7 MB/s)
[windows-jdk7] [INFO] Downloaded: https://repo.maven.apache.org/maven2/org/codehaus/plexus/plexus-interpolation/1.19/plexus-interpolation-1.19.jar
(62 kB at 1.0 MB/s)
[windows-jdk7] [INFO] Downloaded: https://repo.maven.apache.org/maven2/org/codehaus/plexus/plexus-utils/3.0.15/plexus-utils-3.0.15.jar
(239 kB at 3.4 MB/s)
[windows-jdk7] [INFO] Using 'UTF-8' encoding to copy filtered resources.
[windows-jdk7] [INFO] Copying 21 resources
[windows-jdk7] [INFO] Copying 3 resources
[windows-jdk7] [INFO] 
[windows-jdk7] [INFO] --- maven-compiler-plugin:3.5.1:compile (default-compile) @ maven-javadoc-plugin
---
[windows-jdk7] [INFO] Downloading: https://repo.maven.apache.org/maven2/org/apache/maven/shared/maven-shared-incremental/1.1/maven-shared-incremental-1.1.pom
[windows-jdk7] [INFO] Downloaded: https://repo.maven.apache.org/maven2/org/apache/maven/shared/maven-shared-incremental/1.1/maven-shared-incremental-1.1.pom
(4.7 kB at 339 kB/s)
[windows-jdk7] [INFO] Downloading: https://repo.maven.apache.org/maven2/org/apache/maven/shared/maven-shared-utils/0.1/maven-shared-utils-0.1.pom
[windows-jdk7] [INFO] Downloaded: https://repo.maven.apache.org/maven2/org/apache/maven/shared/maven-shared-utils/0.1/maven-shared-utils-0.1.pom
(4.0 kB at 311 kB/s)
[windows-jdk7] [INFO] Downloading: https://repo.maven.apache.org/maven2/org/codehaus/plexus/plexus-compiler-api/2.7/plexus-compiler-api-2.7.pom
[windows-jdk7] [INFO] Downloaded: https://repo.maven.apache.org/maven2/org/codehaus/plexus/plexus-compiler-api/2.7/plexus-compiler-api-2.7.pom
(891 B at 56 kB/s)
[windows-jdk7] [INFO] Downloading: https://repo.maven.apache.org/maven2/org/codehaus/plexus/plexus-compiler/2.7/plexus-compiler-2.7.pom
[windows-jdk7] [INFO] Downloaded: https://repo.maven.apache.org/maven2/org/codehaus/plexus/plexus-compiler/2.7/plexus-compiler-2.7.pom
(4.9 kB at 40 kB/s)
[windows-jdk7] [INFO] Downloading: https://repo.maven.apache.org/maven2/org/codehaus/plexus/plexus-compiler-manager/2.7/plexus-compiler-manager-2.7.pom
[windows-jdk7] [INFO] Downloaded: https://repo.maven.apache.org/maven2/org/codehaus/plexus/plexus-compiler-manager/2.7/plexus-compiler-manager-2.7.pom
(711 B at 15 kB/s)
[windows-jdk7] [INFO] Downloading: https://repo.maven.apache.org/maven2/org/codehaus/plexus/plexus-compiler-javac/2.7/plexus-compiler-javac-2.7.pom
[windows-jdk7] [INFO] Downloaded: https://repo.maven.apache.org/maven2/org/codehaus/plexus/plexus-compiler-javac/2.7/plexus-compiler-javac-2.7.pom
(792 B at 72 kB/s)
[windows-jdk7] [INFO] Downloading: https://repo.maven.apache.org/maven2/org/codehaus/plexus/plexus-compilers/2.7/plexus-compilers-2.7.pom
[windows-jdk7] [INFO] Downloaded: https://repo.maven.apache.org/maven2/org/codehaus/plexus/plexus-compilers/2.7/plexus-compilers-2.7.pom
(1.4 kB at 154 kB/s)
[windows-jdk7] [INFO] Downloading: https://repo.maven.apache.org/maven2/org/apache/maven/shared/maven-shared-incremental/1.1/maven-shared-incremental-1.1.jar
[windows-jdk7] [INFO] Downloading: https://repo.maven.apache.org/maven2/org/codehaus/plexus/plexus-compiler-api/2.7/plexus-compiler-api-2.7.jar
[windows-jdk7] [INFO] Downloading: https://repo.maven.apache.org/maven2/org/codehaus/plexus/plexus-compiler-manager/2.7/plexus-compiler-manager-2.7.jar
[windows-jdk7] [INFO] Downloading: https://repo.maven.apache.org/maven2/org/codehaus/plexus/plexus-compiler-javac/2.7/plexus-compiler-javac-2.7.jar
[windows-jdk7] [INFO] Downloaded: https://repo.maven.apache.org/maven2/org/apache/maven/shared/maven-shared-incremental/1.1/maven-shared-incremental-1.1.jar
(14 kB at 589 kB/s)
[windows-jdk7] [INFO] Downloaded: https://repo.maven.apache.org/maven2/org/codehaus/plexus/plexus-compiler-manager/2.7/plexus-compiler-manager-2.7.jar
(4.7 kB at 146 kB/s)
[windows-jdk7] [INFO] Downloaded: https://repo.maven.apache.org/maven2/org/codehaus/plexus/plexus-compiler-javac/2.7/plexus-compiler-javac-2.7.jar
(19 kB at 591 kB/s)
[windows-jdk7] [INFO] Downloaded: https://repo.maven.apache.org/maven2/org/codehaus/plexus/plexus-compiler-api/2.7/plexus-compiler-api-2.7.jar
(26 kB at 612 kB/s)
[windows-jdk7] [INFO] Changes detected - recompiling the module!
[windows-jdk7] [INFO] Compiling 36 source files to f:\jenkins\jenkins-slave\workspace\maven-javadoc-plugin_master-XEOGALQNOP5LSNOEDUT42L6QGQHATWO55CM3NEKN4WGK3JAPU26Q\m\target\classes
[windows-jdk7] [INFO] /f:/jenkins/jenkins-slave/workspace/maven-javadoc-plugin_master-XEOGALQNOP5LSNOEDUT42L6QGQHATWO55CM3NEKN4WGK3JAPU26Q/m/src/main/java/org/apache/maven/plugins/javadoc/resolver/ResourceResolver.java:
Some input files use or override a deprecated API.
[windows-jdk7] [INFO] /f:/jenkins/jenkins-slave/workspace/maven-javadoc-plugin_master-XEOGALQNOP5LSNOEDUT42L6QGQHATWO55CM3NEKN4WGK3JAPU26Q/m/src/main/java/org/apache/maven/plugins/javadoc/resolver/ResourceResolver.java:
Recompile with -Xlint:deprecation for details.
[windows-jdk7] [INFO] /f:/jenkins/jenkins-slave/workspace/maven-javadoc-plugin_master-XEOGALQNOP5LSNOEDUT42L6QGQHATWO55CM3NEKN4WGK3JAPU26Q/m/src/main/java/org/apache/maven/plugins/javadoc/AbstractJavadocMojo.java:
Some input files use unchecked or unsafe operations.
[windows-jdk7] [INFO] /f:/jenkins/jenkins-slave/workspace/maven-javadoc-plugin_master-XEOGALQNOP5LSNOEDUT42L6QGQHATWO55CM3NEKN4WGK3JAPU26Q/m/src/main/java/org/apache/maven/plugins/javadoc/AbstractJavadocMojo.java:
Recompile with -Xlint:unchecked for details.
[windows-jdk7] [INFO] 
[windows-jdk7] [INFO] --- maven-plugin-plugin:3.5:descriptor (default-descriptor) @ maven-javadoc-plugin
---
[windows-jdk7] [INFO] Using 'UTF-8' encoding to read mojo source files.
[windows-jdk7] [INFO] java-annotations mojo extractor found 15 mojo descriptors.
[windows-jdk7] [INFO] java-javadoc mojo extractor found 0 mojo descriptor.
[windows-jdk7] [INFO] ------------------------------------------------------------------------
[windows-jdk7] [INFO] BUILD FAILURE
[windows-jdk7] [INFO] ------------------------------------------------------------------------
[windows-jdk7] [INFO] Total time: 32.004 s
[windows-jdk7] [INFO] Finished at: 2017-12-09T19:05:23Z
[windows-jdk7] [INFO] Final Memory: 49M/1233M
[windows-jdk7] [INFO] ------------------------------------------------------------------------
[windows-jdk7] [jenkins-maven-event-spy] INFO generated F:\jenkins\jenkins-slave\workspace\maven-javadoc-plugin_master-XEOGALQNOP5LSNOEDUT42L6QGQHATWO55CM3NEKN4WGK3JAPU26Q@tmp\withMaven0ff571cb\maven-spy-20171209-190450-6327645876636559065342.log
[windows-jdk7] [ERROR] Failed to execute goal org.apache.maven.plugins:maven-plugin-plugin:3.5:descriptor
(default-descriptor) on project maven-javadoc-plugin: Execution default-descriptor of goal
org.apache.maven.plugins:maven-plugin-plugin:3.5:descriptor failed. NoSuchElementException
-> [Help 1]
[windows-jdk7] [ERROR] 
[windows-jdk7] [ERROR] To see the full stack trace of the errors, re-run Maven with the -e
switch.
[windows-jdk7] [ERROR] Re-run Maven using the -X switch to enable full debug logging.
[windows-jdk7] [ERROR] 
[windows-jdk7] [ERROR] For more information about the errors and possible solutions, please
read the following articles:
[windows-jdk7] [ERROR] [Help 1] http://cwiki.apache.org/confluence/display/MAVEN/PluginExecutionException
[windows-jdk7] Picked up JAVA_TOOL_OPTIONS: -Dmaven.ext.class.path="f:\jenkins\jenkins-slave\workspace\maven-javadoc-plugin_master-XEOGALQNOP5LSNOEDUT42L6QGQHATWO55CM3NEKN4WGK3JAPU26Q@tmp\withMaven0ff571cb\pipeline-maven-spy.jar"
-Dorg.jenkinsci.plugins.pipeline.maven.reportsFolder="f:\jenkins\jenkins-slave\workspace\maven-javadoc-plugin_master-XEOGALQNOP5LSNOEDUT42L6QGQHATWO55CM3NEKN4WGK3JAPU26Q@tmp\withMaven0ff571cb"

[Pipeline] [windows-jdk7] }
[Pipeline] [windows-jdk7] // dir
[Pipeline] [windows-jdk7] }
[windows-jdk7] [withMaven] Skip 'Generated Artifacts Publisher' disabled by configuration
[windows-jdk7] [withMaven] Skip 'Findbugs Publisher' disabled by configuration
[windows-jdk7] [withMaven] Skip 'Open Task Scanner Publisher' disabled by configuration
[Pipeline] [windows-jdk7] // withMaven
[Pipeline] [windows-jdk7] }
[Pipeline] [windows-jdk7] // stage
[Pipeline] [windows-jdk7] }
[Pipeline] [windows-jdk7] // node
[windows-jdk8] Running on windows-2012-2 in f:\jenkins\jenkins-slave\workspace\maven-javadoc-plugin_master-XEOGALQNOP5LSNOEDUT42L6QGQHATWO55CM3NEKN4WGK3JAPU26Q
[Pipeline] [windows-jdk7] }
[windows-jdk7] Failed in branch windows-jdk7
[Pipeline] [windows-jdk8] {
[Pipeline] [windows-jdk8] }
[Pipeline] [windows-jdk9] // node
[Pipeline] [windows-jdk8] // node
[Pipeline] [windows-jdk8] }
[windows-jdk8] Failed in branch windows-jdk8
[Pipeline] [windows-jdk9] }
[windows-jdk9] Failed in branch windows-jdk9
[Pipeline] // parallel
[Pipeline] stage
[Pipeline] { (Notifications)
[Pipeline] echo
Build result: FAILURE
[Pipeline] jiraIssueSelector
[Pipeline] emailext
Mime
  • Unnamed multipart/mixed (inline, None, 0 bytes)
View raw message