maven-notifications mailing list archives

Site index · List index
Message view « Date » · « Thread »
Top « Date » · « Thread »
From Apache Jenkins Server <jenk...@builds.apache.org>
Subject Build failed in Jenkins: Maven TLP » maven-release » master #8
Date Sun, 24 Dec 2017 22:53:30 GMT
See https://builds.apache.org/job/maven-box/job/maven-release/job/master/8/

Changes:

* Use latest surefire
* Use latest surefire
* Use latest surefire

No tests ran.

Build log:
[...truncated 753.78 KB...]
[linux-jdk9] [INFO] Downloading from central: https://repo.maven.apache.org/maven2/org/apache/maven/maven-settings/2.0.7/maven-settings-2.0.7.pom
[linux-jdk9] [INFO] Downloaded from central: https://repo.maven.apache.org/maven2/org/apache/maven/maven-settings/2.0.7/maven-settings-2.0.7.pom
(2.0 kB at 182 kB/s)
[linux-jdk9] [INFO] Downloading from central: https://repo.maven.apache.org/maven2/org/apache/maven/maven-model/2.0.7/maven-model-2.0.7.pom
[linux-jdk9] [INFO] Downloaded from central: https://repo.maven.apache.org/maven2/org/apache/maven/maven-model/2.0.7/maven-model-2.0.7.pom
(3.0 kB at 254 kB/s)
[linux-jdk9] [INFO] Downloading from central: https://repo.maven.apache.org/maven2/org/apache/maven/maven-profile/2.0.7/maven-profile-2.0.7.pom
[linux-jdk9] [INFO] Downloaded from central: https://repo.maven.apache.org/maven2/org/apache/maven/maven-profile/2.0.7/maven-profile-2.0.7.pom
(2.0 kB at 198 kB/s)
[linux-jdk9] [INFO] Downloading from central: https://repo.maven.apache.org/maven2/org/apache/maven/maven-artifact-manager/2.0.7/maven-artifact-manager-2.0.7.pom
[linux-jdk9] [INFO] Downloaded from central: https://repo.maven.apache.org/maven2/org/apache/maven/maven-artifact-manager/2.0.7/maven-artifact-manager-2.0.7.pom
(2.6 kB at 238 kB/s)
[linux-jdk9] [INFO] Downloading from central: https://repo.maven.apache.org/maven2/org/apache/maven/maven-repository-metadata/2.0.7/maven-repository-metadata-2.0.7.pom
[linux-jdk9] [INFO] Downloaded from central: https://repo.maven.apache.org/maven2/org/apache/maven/maven-repository-metadata/2.0.7/maven-repository-metadata-2.0.7.pom
(1.9 kB at 185 kB/s)
[linux-jdk9] [INFO] Downloading from central: https://repo.maven.apache.org/maven2/org/apache/maven/maven-artifact/2.0.7/maven-artifact-2.0.7.pom
[linux-jdk9] [INFO] Downloaded from central: https://repo.maven.apache.org/maven2/org/apache/maven/maven-artifact/2.0.7/maven-artifact-2.0.7.pom
(1.6 kB at 143 kB/s)
[linux-jdk9] [INFO] Downloading from central: https://repo.maven.apache.org/maven2/org/apache/maven/maven-plugin-registry/2.0.7/maven-plugin-registry-2.0.7.pom
[linux-jdk9] [INFO] Downloaded from central: https://repo.maven.apache.org/maven2/org/apache/maven/maven-plugin-registry/2.0.7/maven-plugin-registry-2.0.7.pom
(1.9 kB at 177 kB/s)
[linux-jdk9] [INFO] Downloading from central: https://repo.maven.apache.org/maven2/org/codehaus/modello/modello-plugin-converters/1.7/modello-plugin-converters-1.7.pom
[linux-jdk9] [INFO] Downloaded from central: https://repo.maven.apache.org/maven2/org/codehaus/modello/modello-plugin-converters/1.7/modello-plugin-converters-1.7.pom
(1.6 kB at 134 kB/s)
[linux-jdk9] [INFO] Downloading from central: https://repo.maven.apache.org/maven2/org/codehaus/modello/modello-plugins/1.7/modello-plugins-1.7.pom
[linux-jdk9] [INFO] Downloaded from central: https://repo.maven.apache.org/maven2/org/codehaus/modello/modello-plugins/1.7/modello-plugins-1.7.pom
(2.3 kB at 193 kB/s)
[linux-jdk9] [INFO] Downloading from central: https://repo.maven.apache.org/maven2/org/codehaus/modello/modello-plugin-java/1.7/modello-plugin-java-1.7.pom
[linux-jdk9] [INFO] Downloaded from central: https://repo.maven.apache.org/maven2/org/codehaus/modello/modello-plugin-java/1.7/modello-plugin-java-1.7.pom
(2.6 kB at 215 kB/s)
[linux-jdk9] [INFO] Downloading from central: https://repo.maven.apache.org/maven2/org/codehaus/modello/modello-plugin-dom4j/1.7/modello-plugin-dom4j-1.7.pom
[linux-jdk9] [INFO] Downloaded from central: https://repo.maven.apache.org/maven2/org/codehaus/modello/modello-plugin-dom4j/1.7/modello-plugin-dom4j-1.7.pom
(1.6 kB at 131 kB/s)
[linux-jdk9] [INFO] Downloading from central: https://repo.maven.apache.org/maven2/org/codehaus/modello/modello-plugin-xml/1.7/modello-plugin-xml-1.7.pom
[linux-jdk9] [INFO] Downloaded from central: https://repo.maven.apache.org/maven2/org/codehaus/modello/modello-plugin-xml/1.7/modello-plugin-xml-1.7.pom
(1.0 kB at 87 kB/s)
[linux-jdk9] [INFO] Downloading from central: https://repo.maven.apache.org/maven2/org/codehaus/modello/modello-plugin-jdom/1.7/modello-plugin-jdom-1.7.pom
[linux-jdk9] [INFO] Downloaded from central: https://repo.maven.apache.org/maven2/org/codehaus/modello/modello-plugin-jdom/1.7/modello-plugin-jdom-1.7.pom
(1.9 kB at 171 kB/s)
[linux-jdk9] [INFO] Downloading from central: https://repo.maven.apache.org/maven2/org/codehaus/modello/modello-plugin-stax/1.7/modello-plugin-stax-1.7.pom
[linux-jdk9] [INFO] Downloaded from central: https://repo.maven.apache.org/maven2/org/codehaus/modello/modello-plugin-stax/1.7/modello-plugin-stax-1.7.pom
(2.3 kB at 211 kB/s)
[linux-jdk9] [INFO] Downloading from central: https://repo.maven.apache.org/maven2/org/codehaus/modello/modello-plugin-xdoc/1.7/modello-plugin-xdoc-1.7.pom
[linux-jdk9] [INFO] Downloaded from central: https://repo.maven.apache.org/maven2/org/codehaus/modello/modello-plugin-xdoc/1.7/modello-plugin-xdoc-1.7.pom
(1.2 kB at 103 kB/s)
[linux-jdk9] [INFO] Downloading from central: https://repo.maven.apache.org/maven2/org/codehaus/modello/modello-plugin-xsd/1.7/modello-plugin-xsd-1.7.pom
[linux-jdk9] [INFO] Downloaded from central: https://repo.maven.apache.org/maven2/org/codehaus/modello/modello-plugin-xsd/1.7/modello-plugin-xsd-1.7.pom
(1.3 kB at 111 kB/s)
[linux-jdk9] [INFO] Downloading from central: https://repo.maven.apache.org/maven2/org/codehaus/modello/modello-plugin-xpp3/1.7/modello-plugin-xpp3-1.7.pom
[linux-jdk9] [INFO] Downloaded from central: https://repo.maven.apache.org/maven2/org/codehaus/modello/modello-plugin-xpp3/1.7/modello-plugin-xpp3-1.7.pom
(1.4 kB at 119 kB/s)
[linux-jdk9] [INFO] Downloading from central: https://repo.maven.apache.org/maven2/org/apache/maven/maven-plugin-api/2.0.7/maven-plugin-api-2.0.7.jar
[linux-jdk9] [INFO] Downloading from central: https://repo.maven.apache.org/maven2/org/codehaus/modello/modello-core/1.7/modello-core-1.7.jar
[linux-jdk9] [INFO] Downloading from central: https://repo.maven.apache.org/maven2/org/apache/maven/maven-project/2.0.7/maven-project-2.0.7.jar
[linux-jdk9] [INFO] Downloading from central: https://repo.maven.apache.org/maven2/org/apache/maven/maven-settings/2.0.7/maven-settings-2.0.7.jar
[linux-jdk9] [INFO] Downloading from central: https://repo.maven.apache.org/maven2/org/apache/maven/maven-profile/2.0.7/maven-profile-2.0.7.jar
[linux-jdk9] [INFO] Downloaded from central: https://repo.maven.apache.org/maven2/org/apache/maven/maven-plugin-api/2.0.7/maven-plugin-api-2.0.7.jar
(13 kB at 989 kB/s)
[linux-jdk9] [INFO] Downloading from central: https://repo.maven.apache.org/maven2/org/apache/maven/maven-artifact-manager/2.0.7/maven-artifact-manager-2.0.7.jar
[linux-jdk9] [INFO] Downloaded from central: https://repo.maven.apache.org/maven2/org/codehaus/modello/modello-core/1.7/modello-core-1.7.jar
(58 kB at 3.2 MB/s)
[linux-jdk9] [INFO] Downloading from central: https://repo.maven.apache.org/maven2/org/apache/maven/maven-repository-metadata/2.0.7/maven-repository-metadata-2.0.7.jar
[linux-jdk9] [INFO] Downloaded from central: https://repo.maven.apache.org/maven2/org/apache/maven/maven-settings/2.0.7/maven-settings-2.0.7.jar
(49 kB at 2.7 MB/s)
[linux-jdk9] [INFO] Downloading from central: https://repo.maven.apache.org/maven2/org/apache/maven/maven-plugin-registry/2.0.7/maven-plugin-registry-2.0.7.jar
[linux-jdk9] [INFO] Downloaded from central: https://repo.maven.apache.org/maven2/org/apache/maven/maven-project/2.0.7/maven-project-2.0.7.jar
(117 kB at 5.8 MB/s)
[linux-jdk9] [INFO] Downloading from central: https://repo.maven.apache.org/maven2/org/apache/maven/maven-artifact/2.0.7/maven-artifact-2.0.7.jar
[linux-jdk9] [INFO] Downloaded from central: https://repo.maven.apache.org/maven2/org/apache/maven/maven-profile/2.0.7/maven-profile-2.0.7.jar
(35 kB at 1.8 MB/s)
[linux-jdk9] [INFO] Downloading from central: https://repo.maven.apache.org/maven2/org/apache/maven/maven-model/2.0.7/maven-model-2.0.7.jar
[linux-jdk9] [INFO] Downloaded from central: https://repo.maven.apache.org/maven2/org/apache/maven/maven-artifact-manager/2.0.7/maven-artifact-manager-2.0.7.jar
(57 kB at 2.4 MB/s)
[linux-jdk9] [INFO] Downloading from central: https://repo.maven.apache.org/maven2/org/codehaus/plexus/plexus-utils/3.0.9/plexus-utils-3.0.9.jar
[linux-jdk9] [INFO] Downloaded from central: https://repo.maven.apache.org/maven2/org/apache/maven/maven-repository-metadata/2.0.7/maven-repository-metadata-2.0.7.jar
(24 kB at 907 kB/s)
[linux-jdk9] [INFO] Downloading from central: https://repo.maven.apache.org/maven2/org/codehaus/modello/modello-plugin-converters/1.7/modello-plugin-converters-1.7.jar
[linux-jdk9] [INFO] Downloaded from central: https://repo.maven.apache.org/maven2/org/apache/maven/maven-plugin-registry/2.0.7/maven-plugin-registry-2.0.7.jar
(29 kB at 997 kB/s)
[linux-jdk9] [INFO] Downloading from central: https://repo.maven.apache.org/maven2/org/codehaus/modello/modello-plugin-dom4j/1.7/modello-plugin-dom4j-1.7.jar
[linux-jdk9] [INFO] Downloaded from central: https://repo.maven.apache.org/maven2/org/apache/maven/maven-artifact/2.0.7/maven-artifact-2.0.7.jar
(88 kB at 2.8 MB/s)
[linux-jdk9] [INFO] Downloading from central: https://repo.maven.apache.org/maven2/org/codehaus/modello/modello-plugin-xml/1.7/modello-plugin-xml-1.7.jar
[linux-jdk9] [INFO] Downloaded from central: https://repo.maven.apache.org/maven2/org/apache/maven/maven-model/2.0.7/maven-model-2.0.7.jar
(86 kB at 2.7 MB/s)
[linux-jdk9] [INFO] Downloading from central: https://repo.maven.apache.org/maven2/org/codehaus/modello/modello-plugin-java/1.7/modello-plugin-java-1.7.jar
[linux-jdk9] [INFO] Downloaded from central: https://repo.maven.apache.org/maven2/org/codehaus/modello/modello-plugin-converters/1.7/modello-plugin-converters-1.7.jar
(9.4 kB at 248 kB/s)
[linux-jdk9] [INFO] Downloading from central: https://repo.maven.apache.org/maven2/org/codehaus/modello/modello-plugin-jdom/1.7/modello-plugin-jdom-1.7.jar
[linux-jdk9] [INFO] Downloaded from central: https://repo.maven.apache.org/maven2/org/codehaus/plexus/plexus-utils/3.0.9/plexus-utils-3.0.9.jar
(232 kB at 5.5 MB/s)
[linux-jdk9] [INFO] Downloading from central: https://repo.maven.apache.org/maven2/org/codehaus/modello/modello-plugin-stax/1.7/modello-plugin-stax-1.7.jar
[linux-jdk9] [INFO] Downloaded from central: https://repo.maven.apache.org/maven2/org/codehaus/modello/modello-plugin-dom4j/1.7/modello-plugin-dom4j-1.7.jar
(18 kB at 427 kB/s)
[linux-jdk9] [INFO] Downloading from central: https://repo.maven.apache.org/maven2/org/codehaus/modello/modello-plugin-xdoc/1.7/modello-plugin-xdoc-1.7.jar
[linux-jdk9] [INFO] Downloaded from central: https://repo.maven.apache.org/maven2/org/codehaus/modello/modello-plugin-xml/1.7/modello-plugin-xml-1.7.jar
(15 kB at 342 kB/s)
[linux-jdk9] [INFO] Downloading from central: https://repo.maven.apache.org/maven2/org/codehaus/modello/modello-plugin-xpp3/1.7/modello-plugin-xpp3-1.7.jar
[linux-jdk9] [INFO] Downloaded from central: https://repo.maven.apache.org/maven2/org/codehaus/modello/modello-plugin-java/1.7/modello-plugin-java-1.7.jar
(84 kB at 1.7 MB/s)
[linux-jdk9] [INFO] Downloading from central: https://repo.maven.apache.org/maven2/org/codehaus/modello/modello-plugin-xsd/1.7/modello-plugin-xsd-1.7.jar
[linux-jdk9] [INFO] Downloaded from central: https://repo.maven.apache.org/maven2/org/codehaus/modello/modello-plugin-jdom/1.7/modello-plugin-jdom-1.7.jar
(14 kB at 285 kB/s)
[linux-jdk9] [INFO] Downloading from central: https://repo.maven.apache.org/maven2/org/sonatype/plexus/plexus-build-api/0.0.7/plexus-build-api-0.0.7.jar
[linux-jdk9] [INFO] Downloaded from central: https://repo.maven.apache.org/maven2/org/codehaus/modello/modello-plugin-xdoc/1.7/modello-plugin-xdoc-1.7.jar
(14 kB at 251 kB/s)
[linux-jdk9] [INFO] Downloaded from central: https://repo.maven.apache.org/maven2/org/codehaus/modello/modello-plugin-xpp3/1.7/modello-plugin-xpp3-1.7.jar
(29 kB at 504 kB/s)
[linux-jdk9] [INFO] Downloaded from central: https://repo.maven.apache.org/maven2/org/codehaus/modello/modello-plugin-stax/1.7/modello-plugin-stax-1.7.jar
(37 kB at 643 kB/s)
[linux-jdk9] [INFO] Downloaded from central: https://repo.maven.apache.org/maven2/org/codehaus/modello/modello-plugin-xsd/1.7/modello-plugin-xsd-1.7.jar
(14 kB at 242 kB/s)
[linux-jdk9] [INFO] Downloaded from central: https://repo.maven.apache.org/maven2/org/sonatype/plexus/plexus-build-api/0.0.7/plexus-build-api-0.0.7.jar
(8.5 kB at 139 kB/s)
[linux-jdk9] [INFO] outputDirectory: /home/jenkins/jenkins-slave/workspace/en-box_maven-release_master-OCKGULQBCZ67VBKJ7HF6E7KZUCKX7ZC6FX64GH66OHP7A4VAQBIQ/m/maven-release-manager/target/generated-sources/modello
[linux-jdk9] [INFO] Working on model: src/main/mdo/release-descriptor.mdo
[linux-jdk9] [INFO] Generating current version: 3.0.0
[linux-jdk9] [INFO] 
[linux-jdk9] [INFO] --- modello-maven-plugin:1.7:java (default) @ maven-release-manager ---
[linux-jdk9] [INFO] outputDirectory: /home/jenkins/jenkins-slave/workspace/en-box_maven-release_master-OCKGULQBCZ67VBKJ7HF6E7KZUCKX7ZC6FX64GH66OHP7A4VAQBIQ/m/maven-release-manager/target/generated-sources/modello
[linux-jdk9] [INFO] Working on model: src/main/mdo/release-descriptor.mdo
[linux-jdk9] [INFO] Generating current version: 3.0.0
[linux-jdk9] [INFO] 
[linux-jdk9] [INFO] --- modello-maven-plugin:1.7:xpp3-writer (default) @ maven-release-manager
---
[linux-jdk9] [INFO] outputDirectory: /home/jenkins/jenkins-slave/workspace/en-box_maven-release_master-OCKGULQBCZ67VBKJ7HF6E7KZUCKX7ZC6FX64GH66OHP7A4VAQBIQ/m/maven-release-manager/target/generated-sources/modello
[linux-jdk9] [INFO] Working on model: src/main/mdo/release-descriptor.mdo
[linux-jdk9] [INFO] Generating current version: 3.0.0
[linux-jdk9] [INFO] 
[linux-jdk9] [INFO] --- maven-remote-resources-plugin:1.5:process (default) @ maven-release-manager
---
[linux-jdk9] [INFO] 
[linux-jdk9] [INFO] --- maven-resources-plugin:2.7:resources (default-resources) @ maven-release-manager
---
[linux-jdk9] [INFO] Using 'UTF-8' encoding to copy filtered resources.
[linux-jdk9] [INFO] Copying 3 resources
[linux-jdk9] [INFO] Copying 3 resources
[linux-jdk9] [INFO] 
[linux-jdk9] [INFO] --- maven-compiler-plugin:3.2:compile (default-compile) @ maven-release-manager
---
[linux-jdk9] [INFO] Changes detected - recompiling the module!
[linux-jdk9] [INFO] Compiling 103 source files to /home/jenkins/jenkins-slave/workspace/en-box_maven-release_master-OCKGULQBCZ67VBKJ7HF6E7KZUCKX7ZC6FX64GH66OHP7A4VAQBIQ/m/maven-release-manager/target/classes
[linux-jdk7] [INFO] ..SUCCESS (8.8 s)
[linux-jdk7] [INFO] Building: projects/prepare/MRELEASE-966/my-pom.xml
[linux-jdk9] [INFO] /home/jenkins/jenkins-slave/workspace/en-box_maven-release_master-OCKGULQBCZ67VBKJ7HF6E7KZUCKX7ZC6FX64GH66OHP7A4VAQBIQ/m/maven-release-manager/src/main/java/org/apache/maven/shared/release/phase/AbstractReleasePhase.java:
Some input files use or override a deprecated API.
[linux-jdk9] [INFO] /home/jenkins/jenkins-slave/workspace/en-box_maven-release_master-OCKGULQBCZ67VBKJ7HF6E7KZUCKX7ZC6FX64GH66OHP7A4VAQBIQ/m/maven-release-manager/src/main/java/org/apache/maven/shared/release/phase/AbstractReleasePhase.java:
Recompile with -Xlint:deprecation for details.
[linux-jdk9] [INFO] /home/jenkins/jenkins-slave/workspace/en-box_maven-release_master-OCKGULQBCZ67VBKJ7HF6E7KZUCKX7ZC6FX64GH66OHP7A4VAQBIQ/m/maven-release-manager/target/generated-sources/modello/org/apache/maven/shared/release/config/ReleaseDescriptor.java:
Some input files use unchecked or unsafe operations.
[linux-jdk9] [INFO] /home/jenkins/jenkins-slave/workspace/en-box_maven-release_master-OCKGULQBCZ67VBKJ7HF6E7KZUCKX7ZC6FX64GH66OHP7A4VAQBIQ/m/maven-release-manager/target/generated-sources/modello/org/apache/maven/shared/release/config/ReleaseDescriptor.java:
Recompile with -Xlint:unchecked for details.
[linux-jdk9] [INFO] 
[linux-jdk9] [INFO] --- plexus-component-metadata:1.6:generate-metadata (default) @ maven-release-manager
---
[linux-jdk9] [INFO] Downloading from central: https://repo.maven.apache.org/maven2/org/codehaus/plexus/plexus-container-default/1.6/plexus-container-default-1.6.pom
[linux-jdk9] [INFO] Downloaded from central: https://repo.maven.apache.org/maven2/org/codehaus/plexus/plexus-container-default/1.6/plexus-container-default-1.6.pom
(2.7 kB at 205 kB/s)
[linux-jdk9] [INFO] Downloading from central: https://repo.maven.apache.org/maven2/org/codehaus/plexus/plexus-classworlds/2.5.1/plexus-classworlds-2.5.1.pom
[linux-jdk9] [INFO] Downloaded from central: https://repo.maven.apache.org/maven2/org/codehaus/plexus/plexus-classworlds/2.5.1/plexus-classworlds-2.5.1.pom
(5.0 kB at 417 kB/s)
[linux-jdk9] [INFO] Downloading from central: https://repo.maven.apache.org/maven2/org/apache/xbean/xbean-reflect/3.7/xbean-reflect-3.7.pom
[linux-jdk9] [INFO] Downloaded from central: https://repo.maven.apache.org/maven2/org/apache/xbean/xbean-reflect/3.7/xbean-reflect-3.7.pom
(5.1 kB at 463 kB/s)
[linux-jdk9] [INFO] Downloading from central: https://repo.maven.apache.org/maven2/org/apache/xbean/xbean/3.7/xbean-3.7.pom
[linux-jdk9] [INFO] Downloaded from central: https://repo.maven.apache.org/maven2/org/apache/xbean/xbean/3.7/xbean-3.7.pom
(15 kB at 1.4 MB/s)
[linux-jdk9] [INFO] Downloading from central: https://repo.maven.apache.org/maven2/org/apache/geronimo/genesis/genesis-java5-flava/2.0/genesis-java5-flava-2.0.pom
[linux-jdk9] [INFO] Downloaded from central: https://repo.maven.apache.org/maven2/org/apache/geronimo/genesis/genesis-java5-flava/2.0/genesis-java5-flava-2.0.pom
(5.5 kB at 457 kB/s)
[linux-jdk9] [INFO] Downloading from central: https://repo.maven.apache.org/maven2/org/apache/geronimo/genesis/genesis-default-flava/2.0/genesis-default-flava-2.0.pom
[linux-jdk9] [INFO] Downloaded from central: https://repo.maven.apache.org/maven2/org/apache/geronimo/genesis/genesis-default-flava/2.0/genesis-default-flava-2.0.pom
(18 kB at 1.6 MB/s)
[linux-jdk8] [INFO] ..SUCCESS (4.6 s)
[linux-jdk8] [INFO] Building: projects/prepare/forked-basic/pom.xml
[linux-jdk9] [INFO] Downloading from central: https://repo.maven.apache.org/maven2/org/apache/geronimo/genesis/genesis/2.0/genesis-2.0.pom
[linux-jdk9] [INFO] Downloaded from central: https://repo.maven.apache.org/maven2/org/apache/geronimo/genesis/genesis/2.0/genesis-2.0.pom
(18 kB at 1.3 MB/s)
[linux-jdk9] [INFO] Downloading from central: https://repo.maven.apache.org/maven2/org/codehaus/plexus/plexus-component-annotations/1.6/plexus-component-annotations-1.6.pom
[linux-jdk9] [INFO] Downloaded from central: https://repo.maven.apache.org/maven2/org/codehaus/plexus/plexus-component-annotations/1.6/plexus-component-annotations-1.6.pom
(748 B at 68 kB/s)
[linux-jdk9] [INFO] Downloading from central: https://repo.maven.apache.org/maven2/com/thoughtworks/qdox/qdox/2.0-M2/qdox-2.0-M2.pom
[linux-jdk9] [INFO] Downloaded from central: https://repo.maven.apache.org/maven2/com/thoughtworks/qdox/qdox/2.0-M2/qdox-2.0-M2.pom
(18 kB at 1.5 MB/s)
[linux-jdk9] [INFO] Downloading from central: https://repo.maven.apache.org/maven2/jdom/jdom/1.1/jdom-1.1.pom
[linux-jdk9] [INFO] Downloaded from central: https://repo.maven.apache.org/maven2/jdom/jdom/1.1/jdom-1.1.pom
(526 B at 44 kB/s)
[linux-jdk9] [INFO] Downloading from central: https://repo.maven.apache.org/maven2/org/codehaus/plexus/plexus-cli/1.6/plexus-cli-1.6.pom
[linux-jdk9] [INFO] Downloaded from central: https://repo.maven.apache.org/maven2/org/codehaus/plexus/plexus-cli/1.6/plexus-cli-1.6.pom
(1.4 kB at 117 kB/s)
[linux-jdk9] [INFO] Downloading from central: https://repo.maven.apache.org/maven2/org/codehaus/plexus/plexus-components/1.1.20/plexus-components-1.1.20.pom
[linux-jdk9] [INFO] Downloaded from central: https://repo.maven.apache.org/maven2/org/codehaus/plexus/plexus-components/1.1.20/plexus-components-1.1.20.pom
(3.0 kB at 302 kB/s)
[linux-jdk9] [INFO] Downloading from central: https://repo.maven.apache.org/maven2/org/codehaus/plexus/plexus/3.1/plexus-3.1.pom
[linux-jdk9] [INFO] Downloaded from central: https://repo.maven.apache.org/maven2/org/codehaus/plexus/plexus/3.1/plexus-3.1.pom
(19 kB at 1.7 MB/s)
[linux-jdk9] [INFO] Downloading from central: https://repo.maven.apache.org/maven2/org/ow2/asm/asm-all/5.0.2/asm-all-5.0.2.pom
[linux-jdk9] [INFO] Downloaded from central: https://repo.maven.apache.org/maven2/org/ow2/asm/asm-all/5.0.2/asm-all-5.0.2.pom
(2.0 kB at 179 kB/s)
[linux-jdk9] [INFO] Downloading from central: https://repo.maven.apache.org/maven2/org/ow2/asm/asm-parent/5.0.2/asm-parent-5.0.2.pom
[linux-jdk9] [INFO] Downloaded from central: https://repo.maven.apache.org/maven2/org/ow2/asm/asm-parent/5.0.2/asm-parent-5.0.2.pom
(5.5 kB at 500 kB/s)
[linux-jdk9] [INFO] Downloading from central: https://repo.maven.apache.org/maven2/org/codehaus/plexus/plexus-container-default/1.6/plexus-container-default-1.6.jar
[linux-jdk9] [INFO] Downloading from central: https://repo.maven.apache.org/maven2/org/codehaus/plexus/plexus-classworlds/2.5.1/plexus-classworlds-2.5.1.jar
[linux-jdk9] [INFO] Downloading from central: https://repo.maven.apache.org/maven2/org/apache/xbean/xbean-reflect/3.7/xbean-reflect-3.7.jar
[linux-jdk9] [INFO] Downloading from central: https://repo.maven.apache.org/maven2/org/codehaus/plexus/plexus-component-annotations/1.6/plexus-component-annotations-1.6.jar
[linux-jdk9] [INFO] Downloading from central: https://repo.maven.apache.org/maven2/com/thoughtworks/qdox/qdox/2.0-M2/qdox-2.0-M2.jar
[linux-jdk9] [INFO] Downloaded from central: https://repo.maven.apache.org/maven2/org/codehaus/plexus/plexus-component-annotations/1.6/plexus-component-annotations-1.6.jar
(4.3 kB at 251 kB/s)
[linux-jdk9] [INFO] Downloaded from central: https://repo.maven.apache.org/maven2/org/codehaus/plexus/plexus-classworlds/2.5.1/plexus-classworlds-2.5.1.jar
(50 kB at 2.9 MB/s)
[linux-jdk9] [INFO] Downloading from central: https://repo.maven.apache.org/maven2/org/codehaus/plexus/plexus-cli/1.6/plexus-cli-1.6.jar
[linux-jdk9] [INFO] Downloading from central: https://repo.maven.apache.org/maven2/org/ow2/asm/asm-all/5.0.2/asm-all-5.0.2.jar
[linux-jdk9] [INFO] Downloaded from central: https://repo.maven.apache.org/maven2/org/apache/xbean/xbean-reflect/3.7/xbean-reflect-3.7.jar
(148 kB at 8.2 MB/s)
[linux-jdk9] [INFO] Downloaded from central: https://repo.maven.apache.org/maven2/org/codehaus/plexus/plexus-container-default/1.6/plexus-container-default-1.6.jar
(224 kB at 11 MB/s)
[linux-jdk9] [INFO] Downloaded from central: https://repo.maven.apache.org/maven2/org/codehaus/plexus/plexus-cli/1.6/plexus-cli-1.6.jar
(7.4 kB at 255 kB/s)
[linux-jdk9] [INFO] Downloaded from central: https://repo.maven.apache.org/maven2/com/thoughtworks/qdox/qdox/2.0-M2/qdox-2.0-M2.jar
(292 kB at 9.4 MB/s)
[linux-jdk9] [INFO] Downloaded from central: https://repo.maven.apache.org/maven2/org/ow2/asm/asm-all/5.0.2/asm-all-5.0.2.jar
(242 kB at 6.5 MB/s)
[linux-jdk9] [INFO] ------------------------------------------------------------------------
[linux-jdk9] [INFO] Reactor Summary:
[linux-jdk9] [INFO] 
[linux-jdk9] [INFO] Maven Release ...................................... SUCCESS [ 10.804
s]
[linux-jdk9] [INFO] Maven Release APIs ................................. SUCCESS [  2.808
s]
[linux-jdk9] [INFO] Maven Release Manager .............................. FAILURE [ 26.697
s]
[linux-jdk9] [INFO] Maven Release Plugin ............................... SKIPPED
[linux-jdk9] [INFO] Maven Release Odd-Even Policy ...................... SKIPPED
[linux-jdk9] [INFO] ------------------------------------------------------------------------
[linux-jdk9] [INFO] BUILD FAILURE
[linux-jdk9] [INFO] ------------------------------------------------------------------------
[linux-jdk9] [INFO] Total time: 41.276 s
[linux-jdk9] [INFO] Finished at: 2017-12-24T22:53:01Z
[linux-jdk9] [INFO] Final Memory: 36M/120M
[linux-jdk9] [INFO] ------------------------------------------------------------------------
[linux-jdk9] [jenkins-maven-event-spy] INFO generated /home/jenkins/jenkins-slave/workspace/en-box_maven-release_master-OCKGULQBCZ67VBKJ7HF6E7KZUCKX7ZC6FX64GH66OHP7A4VAQBIQ@tmp/withMavenbaef3a31/maven-spy-20171224-225219-92913608460219471389197.log
[linux-jdk9] [ERROR] Failed to execute goal org.codehaus.plexus:plexus-component-metadata:1.6:generate-metadata
(default) on project maven-release-manager: Error generating metadata: Failed to extract descriptors:
IllegalArgumentException -> [Help 1]
[linux-jdk9] [ERROR] 
[linux-jdk9] [ERROR] To see the full stack trace of the errors, re-run Maven with the -e switch.
[linux-jdk9] [ERROR] Re-run Maven using the -X switch to enable full debug logging.
[linux-jdk9] [ERROR] 
[linux-jdk9] [ERROR] For more information about the errors and possible solutions, please
read the following articles:
[linux-jdk9] [ERROR] [Help 1] http://cwiki.apache.org/confluence/display/MAVEN/MojoExecutionException
[linux-jdk9] [ERROR] 
[linux-jdk9] [ERROR] After correcting the problems, you can resume the build with the command
[linux-jdk9] [ERROR]   mvn <goals> -rf :maven-release-manager
[Pipeline] [linux-jdk9] }
[Pipeline] [linux-jdk9] // dir
[linux-jdk8] [INFO] ..SUCCESS (7.8 s)
[linux-jdk8] [INFO] Building: projects/prepare/MRELEASE-966/my-pom.xml
[Pipeline] [linux-jdk9] }
[linux-jdk9] [withMaven] Skip 'Generated Artifacts Publisher' disabled by configuration
[linux-jdk9] [withMaven] junitPublisher - Archive test results for Maven artifact org.apache.maven.release:maven-release-api:3.0.0-SNAPSHOT
generated by maven-surefire-plugin:test (default-test): m/maven-release-api/target/surefire-reports/*.xml
[linux-jdk9] [withMaven] junitPublisher - Jenkins JUnit Attachments Plugin not found, can't
publish test attachments.Recording test results
[linux-jdk9] None of the test reports contained any result
[linux-jdk9] [withMaven] Skip 'Findbugs Publisher' disabled by configuration
[linux-jdk9] [withMaven] Skip 'Open Task Scanner Publisher' disabled by configuration
[Pipeline] [linux-jdk9] // withMaven
[linux-jdk7] [INFO] run script verify.groovy
[linux-jdk7] [INFO] ..SUCCESS (11.9 s)
[linux-jdk7] [INFO] Building: projects/prepare/invoker-basic/pom.xml
[Pipeline] [linux-jdk9] }
[Pipeline] [linux-jdk9] // stage
[Pipeline] [linux-jdk9] }
[Pipeline] [linux-jdk9] // node
[Pipeline] [linux-jdk9] }
[linux-jdk8] Sending interrupt signal to process
[linux-jdk7] Sending interrupt signal to process
[linux-jdk9] Failed in branch linux-jdk9
[linux-jdk8] [INFO] ..FAILED (3.7 s)
[linux-jdk8] [INFO]   The build exited with code 143. See /home/jenkins/jenkins-slave/workspace/en-box_maven-release_master-OCKGULQBCZ67VBKJ7HF6E7KZUCKX7ZC6FX64GH66OHP7A4VAQBIQ@2/m/maven-release-plugin/target/it/projects/prepare/MRELEASE-966/build.log
for details.
[linux-jdk8] [INFO] Building: projects/prepare/invoker-basic/pom.xml
[linux-jdk8] Terminated
[linux-jdk7] [INFO] ..FAILED (0.8 s)
[linux-jdk7] [INFO]   The build exited with code 143. See /home/jenkins/jenkins-slave/workspace/en-box_maven-release_master-OCKGULQBCZ67VBKJ7HF6E7KZUCKX7ZC6FX64GH66OHP7A4VAQBIQ/m/maven-release-plugin/target/it/projects/prepare/invoker-basic/build.log
for details.
[linux-jdk7] [INFO] Building: projects/prepare/MRELEASE-571_M3/pom.xml
[linux-jdk7] /home/jenkins/jenkins-slave/workspace/en-box_maven-release_master-OCKGULQBCZ67VBKJ7HF6E7KZUCKX7ZC6FX64GH66OHP7A4VAQBIQ/m@tmp/durable-350d5c17/script.sh:
line 2:  7632 Terminated              mvn -P+run-its -Dmaven.test.failure.ignore=true -Dfindbugs.failOnError=false
clean verify
[Pipeline] [windows-jdk7] // node
[Pipeline] [windows-jdk8] // node
[Pipeline] [windows-jdk9] // node
[Pipeline] [windows-jdk7] }
[windows-jdk7] Failed in branch windows-jdk7
[Pipeline] [windows-jdk8] }
[windows-jdk8] Failed in branch windows-jdk8
[Pipeline] [windows-jdk9] }
[windows-jdk9] Failed in branch windows-jdk9
[Pipeline] [linux-jdk8] }
[Pipeline] [linux-jdk7] }
[Pipeline] [linux-jdk8] // dir
[Pipeline] [linux-jdk7] // dir
[Pipeline] [linux-jdk8] }
[linux-jdk8] [withMaven] One or multiple Maven executions have been ignored by the Jenkins
Pipeline Maven Plugin because they have been interrupted before completion (2). See Pipeline
Maven Plugin FAQ for more details.
[Pipeline] [linux-jdk7] }
[linux-jdk7] [withMaven] One or multiple Maven executions have been ignored by the Jenkins
Pipeline Maven Plugin because they have been interrupted before completion (2). See Pipeline
Maven Plugin FAQ for more details.
[Pipeline] [linux-jdk8] // withMaven
[Pipeline] [linux-jdk7] // withMaven
[Pipeline] [linux-jdk8] }
[Pipeline] [linux-jdk7] }
[Pipeline] [linux-jdk8] // stage
[Pipeline] [linux-jdk7] // stage
[Pipeline] [linux-jdk7] }
[Pipeline] [linux-jdk8] }
[Pipeline] [linux-jdk7] // node
[Pipeline] [linux-jdk8] // node
[Pipeline] [linux-jdk7] }
[linux-jdk7] Failed in branch linux-jdk7
[Pipeline] [linux-jdk8] }
[linux-jdk8] Failed in branch linux-jdk8
[Pipeline] // parallel
[Pipeline] stage
[Pipeline] { (Notifications)
[Pipeline] echo
Build result: FAILURE
[Pipeline] jiraIssueSelector
[Pipeline] emailext
Mime
  • Unnamed multipart/mixed (inline, None, 0 bytes)
View raw message