maven-notifications mailing list archives

Site index · List index
Message view « Date » · « Thread »
Top « Date » · « Thread »
From Apache Jenkins Server <jenk...@builds.apache.org>
Subject Build unstable in Jenkins: Maven TLP » maven-javadoc-plugin » master #2
Date Fri, 29 Dec 2017 11:11:09 GMT
See https://builds.apache.org/job/maven-box/job/maven-javadoc-plugin/job/master/2/

Changes:

* Noting INFRA-15651
* Typowq
* [MJAVADOC-508] option to fail the build in case of javadoc warnings
* [MJAVADOC-508] add it test and fix bloody checkstyle :-)
* [MJAVADOC-508] option to fail the build in case of javadoc warnings
* [MJAVADOC-508] add it test and fix bloody checkstyle :-)
* [MJAVADOC-508] option to fail the build in case of javadoc warnings
* [MJAVADOC-508] add it test and fix bloody checkstyle :-)
* [MJAVADOC-508] option to fail the build in case of javadoc warnings
* [MJAVADOC-508] add it test and fix bloody checkstyle :-)

17 tests failed.
FAILED:  org.apache.maven.plugins.javadoc.JavadocReportTest.testJavadocResources

Error Message:
This bug appeared in JDK8 and was planned to be fixed in JDK9, see JDK-8032205

Stack Trace:
junit.framework.AssertionFailedError: This bug appeared in JDK8 and was planned to be fixed in JDK9, see JDK-8032205
	at org.apache.maven.plugins.javadoc.JavadocReportTest.testJavadocResources(JavadocReportTest.java:637)


FAILED:  org.apache.maven.plugins.javadoc.FixJavadocMojoTest.testFix

Error Message:
Error occurred during initialization of VM, try to reduce the Java heap size for the MAVEN_OPTS environnement variable using -Xms:<size> and -Xmx:<size>.

Stack Trace:
org.apache.maven.shared.invoker.MavenInvocationException: Error occurred during initialization of VM, try to reduce the Java heap size for the MAVEN_OPTS environnement variable using -Xms:<size> and -Xmx:<size>.
	at org.apache.maven.plugins.javadoc.FixJavadocMojoTest.invokeCompileGoal(FixJavadocMojoTest.java:655)
	at org.apache.maven.plugins.javadoc.FixJavadocMojoTest.executeMojoAndTest(FixJavadocMojoTest.java:612)
	at org.apache.maven.plugins.javadoc.FixJavadocMojoTest.testFix(FixJavadocMojoTest.java:141)


FAILED:  org.apache.maven.plugins.javadoc.FixJavadocMojoTest.testFixJdk5

Error Message:
Error occurred during initialization of VM, try to reduce the Java heap size for the MAVEN_OPTS environnement variable using -Xms:<size> and -Xmx:<size>.

Stack Trace:
org.apache.maven.shared.invoker.MavenInvocationException: Error occurred during initialization of VM, try to reduce the Java heap size for the MAVEN_OPTS environnement variable using -Xms:<size> and -Xmx:<size>.
	at org.apache.maven.plugins.javadoc.FixJavadocMojoTest.invokeCompileGoal(FixJavadocMojoTest.java:655)
	at org.apache.maven.plugins.javadoc.FixJavadocMojoTest.executeMojoAndTest(FixJavadocMojoTest.java:612)
	at org.apache.maven.plugins.javadoc.FixJavadocMojoTest.testFixJdk5(FixJavadocMojoTest.java:152)


FAILED:  org.apache.maven.plugins.javadoc.FixJavadocMojoTest.testFixJdk6

Error Message:
Error occurred during initialization of VM, try to reduce the Java heap size for the MAVEN_OPTS environnement variable using -Xms:<size> and -Xmx:<size>.

Stack Trace:
org.apache.maven.shared.invoker.MavenInvocationException: Error occurred during initialization of VM, try to reduce the Java heap size for the MAVEN_OPTS environnement variable using -Xms:<size> and -Xmx:<size>.
	at org.apache.maven.plugins.javadoc.FixJavadocMojoTest.invokeCompileGoal(FixJavadocMojoTest.java:655)
	at org.apache.maven.plugins.javadoc.FixJavadocMojoTest.executeMojoAndTest(FixJavadocMojoTest.java:612)
	at org.apache.maven.plugins.javadoc.FixJavadocMojoTest.testFixJdk6(FixJavadocMojoTest.java:163)


FAILED:  org.apache.maven.plugins.javadoc.FixJavadocMojoTest.testFix

Error Message:
Error occurred during initialization of VM, try to reduce the Java heap size for the MAVEN_OPTS environnement variable using -Xms:<size> and -Xmx:<size>.

Stack Trace:
org.apache.maven.shared.invoker.MavenInvocationException: Error occurred during initialization of VM, try to reduce the Java heap size for the MAVEN_OPTS environnement variable using -Xms:<size> and -Xmx:<size>.
	at org.apache.maven.plugins.javadoc.FixJavadocMojoTest.invokeCompileGoal(FixJavadocMojoTest.java:655)
	at org.apache.maven.plugins.javadoc.FixJavadocMojoTest.executeMojoAndTest(FixJavadocMojoTest.java:612)
	at org.apache.maven.plugins.javadoc.FixJavadocMojoTest.testFix(FixJavadocMojoTest.java:141)


FAILED:  org.apache.maven.plugins.javadoc.FixJavadocMojoTest.testFixJdk5

Error Message:
Error occurred during initialization of VM, try to reduce the Java heap size for the MAVEN_OPTS environnement variable using -Xms:<size> and -Xmx:<size>.

Stack Trace:
org.apache.maven.shared.invoker.MavenInvocationException: Error occurred during initialization of VM, try to reduce the Java heap size for the MAVEN_OPTS environnement variable using -Xms:<size> and -Xmx:<size>.
	at org.apache.maven.plugins.javadoc.FixJavadocMojoTest.invokeCompileGoal(FixJavadocMojoTest.java:655)
	at org.apache.maven.plugins.javadoc.FixJavadocMojoTest.executeMojoAndTest(FixJavadocMojoTest.java:612)
	at org.apache.maven.plugins.javadoc.FixJavadocMojoTest.testFixJdk5(FixJavadocMojoTest.java:152)


FAILED:  org.apache.maven.plugins.javadoc.FixJavadocMojoTest.testFixJdk6

Error Message:
Error occurred during initialization of VM, try to reduce the Java heap size for the MAVEN_OPTS environnement variable using -Xms:<size> and -Xmx:<size>.

Stack Trace:
org.apache.maven.shared.invoker.MavenInvocationException: Error occurred during initialization of VM, try to reduce the Java heap size for the MAVEN_OPTS environnement variable using -Xms:<size> and -Xmx:<size>.
	at org.apache.maven.plugins.javadoc.FixJavadocMojoTest.invokeCompileGoal(FixJavadocMojoTest.java:655)
	at org.apache.maven.plugins.javadoc.FixJavadocMojoTest.executeMojoAndTest(FixJavadocMojoTest.java:612)
	at org.apache.maven.plugins.javadoc.FixJavadocMojoTest.testFixJdk6(FixJavadocMojoTest.java:163)


FAILED:  org.apache.maven.plugins.javadoc.JavadocReportTest.testDefaultConfiguration

Error Message:
null

Stack Trace:
junit.framework.AssertionFailedError
	at org.apache.maven.plugins.javadoc.JavadocReportTest.testDefaultConfiguration(JavadocReportTest.java:225)


FAILED:  org.apache.maven.plugins.javadoc.JavadocReportTest.testDefaultConfiguration

Error Message:
null

Stack Trace:
junit.framework.AssertionFailedError
	at org.apache.maven.plugins.javadoc.JavadocReportTest.testDefaultConfiguration(JavadocReportTest.java:225)


FAILED:  org.apache.maven.plugins.javadoc.JavadocReportTest.testJdk5

Error Message:
An error has occurred in Javadoc report generation: 
Exit code: 2 - Picked up JAVA_TOOL_OPTIONS: -Dmaven.ext.class.path="f:\jenkins\jenkins-slave\workspace\maven-javadoc-plugin_master-XEOGALQNOP5LSNOEDUT42L6QGQHATWO55CM3NEKN4WGK3JAPU26Q@tmp\withMaven52e77c27\pipeline-maven-spy.jar" -Dorg.jenkinsci.plugins.pipeline.maven.reportsFolder="f:\jenkins\jenkins-slave\workspace\maven-javadoc-plugin_master-XEOGALQNOP5LSNOEDUT42L6QGQHATWO55CM3NEKN4WGK3JAPU26Q@tmp\withMaven52e77c27" 
error: Source option 1.5 is no longer supported. Use 1.6 or later.

Command line was: f:\jenkins\tools\java\latest9\bin\javadoc.exe @options @packages

Refer to the generated Javadoc files in 'f:\jenkins\jenkins-slave\workspace\maven-javadoc-plugin_master-XEOGALQNOP5LSNOEDUT42L6QGQHATWO55CM3NEKN4WGK3JAPU26Q\m\target\test\unit\jdk5-test\target\site\apidocs' dir.


Stack Trace:
org.apache.maven.plugin.MojoExecutionException: 
An error has occurred in Javadoc report generation: 
Exit code: 2 - Picked up JAVA_TOOL_OPTIONS: -Dmaven.ext.class.path="f:\jenkins\jenkins-slave\workspace\maven-javadoc-plugin_master-XEOGALQNOP5LSNOEDUT42L6QGQHATWO55CM3NEKN4WGK3JAPU26Q@tmp\withMaven52e77c27\pipeline-maven-spy.jar" -Dorg.jenkinsci.plugins.pipeline.maven.reportsFolder="f:\jenkins\jenkins-slave\workspace\maven-javadoc-plugin_master-XEOGALQNOP5LSNOEDUT42L6QGQHATWO55CM3NEKN4WGK3JAPU26Q@tmp\withMaven52e77c27" 
error: Source option 1.5 is no longer supported. Use 1.6 or later.

Command line was: f:\jenkins\tools\java\latest9\bin\javadoc.exe @options @packages

Refer to the generated Javadoc files in 'f:\jenkins\jenkins-slave\workspace\maven-javadoc-plugin_master-XEOGALQNOP5LSNOEDUT42L6QGQHATWO55CM3NEKN4WGK3JAPU26Q\m\target\test\unit\jdk5-test\target\site\apidocs' dir.

	at org.apache.maven.plugins.javadoc.JavadocReportTest.testJdk5(JavadocReportTest.java:558)
Caused by: org.apache.maven.reporting.MavenReportException: 

Exit code: 2 - Picked up JAVA_TOOL_OPTIONS: -Dmaven.ext.class.path="f:\jenkins\jenkins-slave\workspace\maven-javadoc-plugin_master-XEOGALQNOP5LSNOEDUT42L6QGQHATWO55CM3NEKN4WGK3JAPU26Q@tmp\withMaven52e77c27\pipeline-maven-spy.jar" -Dorg.jenkinsci.plugins.pipeline.maven.reportsFolder="f:\jenkins\jenkins-slave\workspace\maven-javadoc-plugin_master-XEOGALQNOP5LSNOEDUT42L6QGQHATWO55CM3NEKN4WGK3JAPU26Q@tmp\withMaven52e77c27" 
error: Source option 1.5 is no longer supported. Use 1.6 or later.

Command line was: f:\jenkins\tools\java\latest9\bin\javadoc.exe @options @packages

Refer to the generated Javadoc files in 'f:\jenkins\jenkins-slave\workspace\maven-javadoc-plugin_master-XEOGALQNOP5LSNOEDUT42L6QGQHATWO55CM3NEKN4WGK3JAPU26Q\m\target\test\unit\jdk5-test\target\site\apidocs' dir.

	at org.apache.maven.plugins.javadoc.JavadocReportTest.testJdk5(JavadocReportTest.java:558)


FAILED:  org.apache.maven.plugins.javadoc.JavadocReportTest.testDefaultConfiguration

Error Message:
null

Stack Trace:
junit.framework.AssertionFailedError
	at org.apache.maven.plugins.javadoc.JavadocReportTest.testDefaultConfiguration(JavadocReportTest.java:225)


FAILED:  org.apache.maven.plugins.javadoc.JavadocReportTest.testDocfiles

Error Message:
null

Stack Trace:
junit.framework.AssertionFailedError
	at org.apache.maven.plugins.javadoc.JavadocReportTest.testDocfiles(JavadocReportTest.java:307)


FAILED:  org.apache.maven.plugins.javadoc.JavadocReportTest.testJdk5

Error Message:
An error has occurred in Javadoc report generation: 
Exit code: 2 - Picked up JAVA_TOOL_OPTIONS: -Dmaven.ext.class.path="/home/jenkins/jenkins-slave/workspace/maven-javadoc-plugin_master-XEOGALQNOP5LSNOEDUT42L6QGQHATWO55CM3NEKN4WGK3JAPU26Q@tmp/withMaven9928b1e5/pipeline-maven-spy.jar" -Dorg.jenkinsci.plugins.pipeline.maven.reportsFolder="/home/jenkins/jenkins-slave/workspace/maven-javadoc-plugin_master-XEOGALQNOP5LSNOEDUT42L6QGQHATWO55CM3NEKN4WGK3JAPU26Q@tmp/withMaven9928b1e5" 
error: Source option 1.5 is no longer supported. Use 1.6 or later.

Command line was: /home/jenkins/tools/java/latest1.9/bin/javadoc @options @packages

Refer to the generated Javadoc files in '/home/jenkins/jenkins-slave/workspace/maven-javadoc-plugin_master-XEOGALQNOP5LSNOEDUT42L6QGQHATWO55CM3NEKN4WGK3JAPU26Q/m/target/test/unit/jdk5-test/target/site/apidocs' dir.


Stack Trace:
org.apache.maven.plugin.MojoExecutionException: 
An error has occurred in Javadoc report generation: 
Exit code: 2 - Picked up JAVA_TOOL_OPTIONS: -Dmaven.ext.class.path="/home/jenkins/jenkins-slave/workspace/maven-javadoc-plugin_master-XEOGALQNOP5LSNOEDUT42L6QGQHATWO55CM3NEKN4WGK3JAPU26Q@tmp/withMaven9928b1e5/pipeline-maven-spy.jar" -Dorg.jenkinsci.plugins.pipeline.maven.reportsFolder="/home/jenkins/jenkins-slave/workspace/maven-javadoc-plugin_master-XEOGALQNOP5LSNOEDUT42L6QGQHATWO55CM3NEKN4WGK3JAPU26Q@tmp/withMaven9928b1e5" 
error: Source option 1.5 is no longer supported. Use 1.6 or later.

Command line was: /home/jenkins/tools/java/latest1.9/bin/javadoc @options @packages

Refer to the generated Javadoc files in '/home/jenkins/jenkins-slave/workspace/maven-javadoc-plugin_master-XEOGALQNOP5LSNOEDUT42L6QGQHATWO55CM3NEKN4WGK3JAPU26Q/m/target/test/unit/jdk5-test/target/site/apidocs' dir.

	at org.apache.maven.plugins.javadoc.JavadocReportTest.testJdk5(JavadocReportTest.java:558)
Caused by: org.apache.maven.reporting.MavenReportException: 

Exit code: 2 - Picked up JAVA_TOOL_OPTIONS: -Dmaven.ext.class.path="/home/jenkins/jenkins-slave/workspace/maven-javadoc-plugin_master-XEOGALQNOP5LSNOEDUT42L6QGQHATWO55CM3NEKN4WGK3JAPU26Q@tmp/withMaven9928b1e5/pipeline-maven-spy.jar" -Dorg.jenkinsci.plugins.pipeline.maven.reportsFolder="/home/jenkins/jenkins-slave/workspace/maven-javadoc-plugin_master-XEOGALQNOP5LSNOEDUT42L6QGQHATWO55CM3NEKN4WGK3JAPU26Q@tmp/withMaven9928b1e5" 
error: Source option 1.5 is no longer supported. Use 1.6 or later.

Command line was: /home/jenkins/tools/java/latest1.9/bin/javadoc @options @packages

Refer to the generated Javadoc files in '/home/jenkins/jenkins-slave/workspace/maven-javadoc-plugin_master-XEOGALQNOP5LSNOEDUT42L6QGQHATWO55CM3NEKN4WGK3JAPU26Q/m/target/test/unit/jdk5-test/target/site/apidocs' dir.

	at org.apache.maven.plugins.javadoc.JavadocReportTest.testJdk5(JavadocReportTest.java:558)


FAILED:  org.apache.maven.plugins.javadoc.JavadocReportTest.testDefaultConfiguration

Error Message:
null

Stack Trace:
junit.framework.AssertionFailedError
	at org.apache.maven.plugins.javadoc.JavadocReportTest.testDefaultConfiguration(JavadocReportTest.java:225)


FAILED:  org.apache.maven.plugins.javadoc.JavadocReportTest.testDocfiles

Error Message:
null

Stack Trace:
junit.framework.AssertionFailedError
	at org.apache.maven.plugins.javadoc.JavadocReportTest.testDocfiles(JavadocReportTest.java:307)


FAILED:  org.apache.maven.plugins.javadoc.TestJavadocReportTest.testTestJavadoc

Error Message:
An error has occurred in Test Javadoc report generation: 
Exit code: 1 - Picked up JAVA_TOOL_OPTIONS: -Dmaven.ext.class.path="f:\jenkins\jenkins-slave\workspace\maven-javadoc-plugin_master-XEOGALQNOP5LSNOEDUT42L6QGQHATWO55CM3NEKN4WGK3JAPU26Q@tmp\withMaven52e77c27\pipeline-maven-spy.jar" -Dorg.jenkinsci.plugins.pipeline.maven.reportsFolder="f:\jenkins\jenkins-slave\workspace\maven-javadoc-plugin_master-XEOGALQNOP5LSNOEDUT42L6QGQHATWO55CM3NEKN4WGK3JAPU26Q@tmp\withMaven52e77c27" 
f:\jenkins\jenkins-slave\workspace\maven-javadoc-plugin_master-XEOGALQNOP5LSNOEDUT42L6QGQHATWO55CM3NEKN4WGK3JAPU26Q\m\src\test\resources\unit\test-javadoc-test\src\test\java\maven\AppTest.java:22: error: package junit.framework does not exist
import junit.framework.Test;
                      ^
f:\jenkins\jenkins-slave\workspace\maven-javadoc-plugin_master-XEOGALQNOP5LSNOEDUT42L6QGQHATWO55CM3NEKN4WGK3JAPU26Q\m\src\test\resources\unit\test-javadoc-test\src\test\java\maven\AppTest.java:23: error: package junit.framework does not exist
import junit.framework.TestCase;
                      ^
f:\jenkins\jenkins-slave\workspace\maven-javadoc-plugin_master-XEOGALQNOP5LSNOEDUT42L6QGQHATWO55CM3NEKN4WGK3JAPU26Q\m\src\test\resources\unit\test-javadoc-test\src\test\java\maven\AppTest.java:24: error: package junit.framework does not exist
import junit.framework.TestSuite;
                      ^
f:\jenkins\jenkins-slave\workspace\maven-javadoc-plugin_master-XEOGALQNOP5LSNOEDUT42L6QGQHATWO55CM3NEKN4WGK3JAPU26Q\m\src\test\resources\unit\test-javadoc-test\src\test\java\maven\AppTest.java:30: error: cannot find symbol
    extends TestCase
            ^
  symbol: class TestCase
f:\jenkins\jenkins-slave\workspace\maven-javadoc-plugin_master-XEOGALQNOP5LSNOEDUT42L6QGQHATWO55CM3NEKN4WGK3JAPU26Q\m\src\test\resources\unit\test-javadoc-test\src\test\java\maven\AppTest.java:45: error: cannot find symbol
    public static Test suite()
                  ^
  symbol:   class Test
  location: class AppTest

Command line was: f:\jenkins\tools\java\latest9\bin\javadoc.exe @options @packages

Refer to the generated Javadoc files in 'f:\jenkins\jenkins-slave\workspace\maven-javadoc-plugin_master-XEOGALQNOP5LSNOEDUT42L6QGQHATWO55CM3NEKN4WGK3JAPU26Q\m\target\test\unit\test-javadoc-test\target\site\apidocs' dir.


Stack Trace:
org.apache.maven.plugin.MojoExecutionException: 
An error has occurred in Test Javadoc report generation: 
Exit code: 1 - Picked up JAVA_TOOL_OPTIONS: -Dmaven.ext.class.path="f:\jenkins\jenkins-slave\workspace\maven-javadoc-plugin_master-XEOGALQNOP5LSNOEDUT42L6QGQHATWO55CM3NEKN4WGK3JAPU26Q@tmp\withMaven52e77c27\pipeline-maven-spy.jar" -Dorg.jenkinsci.plugins.pipeline.maven.reportsFolder="f:\jenkins\jenkins-slave\workspace\maven-javadoc-plugin_master-XEOGALQNOP5LSNOEDUT42L6QGQHATWO55CM3NEKN4WGK3JAPU26Q@tmp\withMaven52e77c27" 
f:\jenkins\jenkins-slave\workspace\maven-javadoc-plugin_master-XEOGALQNOP5LSNOEDUT42L6QGQHATWO55CM3NEKN4WGK3JAPU26Q\m\src\test\resources\unit\test-javadoc-test\src\test\java\maven\AppTest.java:22: error: package junit.framework does not exist
import junit.framework.Test;
                      ^
f:\jenkins\jenkins-slave\workspace\maven-javadoc-plugin_master-XEOGALQNOP5LSNOEDUT42L6QGQHATWO55CM3NEKN4WGK3JAPU26Q\m\src\test\resources\unit\test-javadoc-test\src\test\java\maven\AppTest.java:23: error: package junit.framework does not exist
import junit.framework.TestCase;
                      ^
f:\jenkins\jenkins-slave\workspace\maven-javadoc-plugin_master-XEOGALQNOP5LSNOEDUT42L6QGQHATWO55CM3NEKN4WGK3JAPU26Q\m\src\test\resources\unit\test-javadoc-test\src\test\java\maven\AppTest.java:24: error: package junit.framework does not exist
import junit.framework.TestSuite;
                      ^
f:\jenkins\jenkins-slave\workspace\maven-javadoc-plugin_master-XEOGALQNOP5LSNOEDUT42L6QGQHATWO55CM3NEKN4WGK3JAPU26Q\m\src\test\resources\unit\test-javadoc-test\src\test\java\maven\AppTest.java:30: error: cannot find symbol
    extends TestCase
            ^
  symbol: class TestCase
f:\jenkins\jenkins-slave\workspace\maven-javadoc-plugin_master-XEOGALQNOP5LSNOEDUT42L6QGQHATWO55CM3NEKN4WGK3JAPU26Q\m\src\test\resources\unit\test-javadoc-test\src\test\java\maven\AppTest.java:45: error: cannot find symbol
    public static Test suite()
                  ^
  symbol:   class Test
  location: class AppTest

Command line was: f:\jenkins\tools\java\latest9\bin\javadoc.exe @options @packages

Refer to the generated Javadoc files in 'f:\jenkins\jenkins-slave\workspace\maven-javadoc-plugin_master-XEOGALQNOP5LSNOEDUT42L6QGQHATWO55CM3NEKN4WGK3JAPU26Q\m\target\test\unit\test-javadoc-test\target\site\apidocs' dir.

	at org.apache.maven.plugins.javadoc.TestJavadocReportTest.testTestJavadoc(TestJavadocReportTest.java:53)
Caused by: org.apache.maven.reporting.MavenReportException: 

Exit code: 1 - Picked up JAVA_TOOL_OPTIONS: -Dmaven.ext.class.path="f:\jenkins\jenkins-slave\workspace\maven-javadoc-plugin_master-XEOGALQNOP5LSNOEDUT42L6QGQHATWO55CM3NEKN4WGK3JAPU26Q@tmp\withMaven52e77c27\pipeline-maven-spy.jar" -Dorg.jenkinsci.plugins.pipeline.maven.reportsFolder="f:\jenkins\jenkins-slave\workspace\maven-javadoc-plugin_master-XEOGALQNOP5LSNOEDUT42L6QGQHATWO55CM3NEKN4WGK3JAPU26Q@tmp\withMaven52e77c27" 
f:\jenkins\jenkins-slave\workspace\maven-javadoc-plugin_master-XEOGALQNOP5LSNOEDUT42L6QGQHATWO55CM3NEKN4WGK3JAPU26Q\m\src\test\resources\unit\test-javadoc-test\src\test\java\maven\AppTest.java:22: error: package junit.framework does not exist
import junit.framework.Test;
                      ^
f:\jenkins\jenkins-slave\workspace\maven-javadoc-plugin_master-XEOGALQNOP5LSNOEDUT42L6QGQHATWO55CM3NEKN4WGK3JAPU26Q\m\src\test\resources\unit\test-javadoc-test\src\test\java\maven\AppTest.java:23: error: package junit.framework does not exist
import junit.framework.TestCase;
                      ^
f:\jenkins\jenkins-slave\workspace\maven-javadoc-plugin_master-XEOGALQNOP5LSNOEDUT42L6QGQHATWO55CM3NEKN4WGK3JAPU26Q\m\src\test\resources\unit\test-javadoc-test\src\test\java\maven\AppTest.java:24: error: package junit.framework does not exist
import junit.framework.TestSuite;
                      ^
f:\jenkins\jenkins-slave\workspace\maven-javadoc-plugin_master-XEOGALQNOP5LSNOEDUT42L6QGQHATWO55CM3NEKN4WGK3JAPU26Q\m\src\test\resources\unit\test-javadoc-test\src\test\java\maven\AppTest.java:30: error: cannot find symbol
    extends TestCase
            ^
  symbol: class TestCase
f:\jenkins\jenkins-slave\workspace\maven-javadoc-plugin_master-XEOGALQNOP5LSNOEDUT42L6QGQHATWO55CM3NEKN4WGK3JAPU26Q\m\src\test\resources\unit\test-javadoc-test\src\test\java\maven\AppTest.java:45: error: cannot find symbol
    public static Test suite()
                  ^
  symbol:   class Test
  location: class AppTest

Command line was: f:\jenkins\tools\java\latest9\bin\javadoc.exe @options @packages

Refer to the generated Javadoc files in 'f:\jenkins\jenkins-slave\workspace\maven-javadoc-plugin_master-XEOGALQNOP5LSNOEDUT42L6QGQHATWO55CM3NEKN4WGK3JAPU26Q\m\target\test\unit\test-javadoc-test\target\site\apidocs' dir.

	at org.apache.maven.plugins.javadoc.TestJavadocReportTest.testTestJavadoc(TestJavadocReportTest.java:53)


FAILED:  org.apache.maven.plugins.javadoc.TestJavadocReportTest.testTestJavadoc

Error Message:
An error has occurred in Test Javadoc report generation: 
Exit code: 1 - Picked up JAVA_TOOL_OPTIONS: -Dmaven.ext.class.path="/home/jenkins/jenkins-slave/workspace/maven-javadoc-plugin_master-XEOGALQNOP5LSNOEDUT42L6QGQHATWO55CM3NEKN4WGK3JAPU26Q@tmp/withMaven9928b1e5/pipeline-maven-spy.jar" -Dorg.jenkinsci.plugins.pipeline.maven.reportsFolder="/home/jenkins/jenkins-slave/workspace/maven-javadoc-plugin_master-XEOGALQNOP5LSNOEDUT42L6QGQHATWO55CM3NEKN4WGK3JAPU26Q@tmp/withMaven9928b1e5" 
/home/jenkins/jenkins-slave/workspace/maven-javadoc-plugin_master-XEOGALQNOP5LSNOEDUT42L6QGQHATWO55CM3NEKN4WGK3JAPU26Q/m/src/test/resources/unit/test-javadoc-test/src/test/java/maven/AppTest.java:22: error: package junit.framework does not exist
import junit.framework.Test;
                      ^
/home/jenkins/jenkins-slave/workspace/maven-javadoc-plugin_master-XEOGALQNOP5LSNOEDUT42L6QGQHATWO55CM3NEKN4WGK3JAPU26Q/m/src/test/resources/unit/test-javadoc-test/src/test/java/maven/AppTest.java:23: error: package junit.framework does not exist
import junit.framework.TestCase;
                      ^
/home/jenkins/jenkins-slave/workspace/maven-javadoc-plugin_master-XEOGALQNOP5LSNOEDUT42L6QGQHATWO55CM3NEKN4WGK3JAPU26Q/m/src/test/resources/unit/test-javadoc-test/src/test/java/maven/AppTest.java:24: error: package junit.framework does not exist
import junit.framework.TestSuite;
                      ^
/home/jenkins/jenkins-slave/workspace/maven-javadoc-plugin_master-XEOGALQNOP5LSNOEDUT42L6QGQHATWO55CM3NEKN4WGK3JAPU26Q/m/src/test/resources/unit/test-javadoc-test/src/test/java/maven/AppTest.java:30: error: cannot find symbol
    extends TestCase
            ^
  symbol: class TestCase
/home/jenkins/jenkins-slave/workspace/maven-javadoc-plugin_master-XEOGALQNOP5LSNOEDUT42L6QGQHATWO55CM3NEKN4WGK3JAPU26Q/m/src/test/resources/unit/test-javadoc-test/src/test/java/maven/AppTest.java:45: error: cannot find symbol
    public static Test suite()
                  ^
  symbol:   class Test
  location: class AppTest

Command line was: /home/jenkins/tools/java/latest1.9/bin/javadoc @options @packages

Refer to the generated Javadoc files in '/home/jenkins/jenkins-slave/workspace/maven-javadoc-plugin_master-XEOGALQNOP5LSNOEDUT42L6QGQHATWO55CM3NEKN4WGK3JAPU26Q/m/target/test/unit/test-javadoc-test/target/site/apidocs' dir.


Stack Trace:
org.apache.maven.plugin.MojoExecutionException: 
An error has occurred in Test Javadoc report generation: 
Exit code: 1 - Picked up JAVA_TOOL_OPTIONS: -Dmaven.ext.class.path="/home/jenkins/jenkins-slave/workspace/maven-javadoc-plugin_master-XEOGALQNOP5LSNOEDUT42L6QGQHATWO55CM3NEKN4WGK3JAPU26Q@tmp/withMaven9928b1e5/pipeline-maven-spy.jar" -Dorg.jenkinsci.plugins.pipeline.maven.reportsFolder="/home/jenkins/jenkins-slave/workspace/maven-javadoc-plugin_master-XEOGALQNOP5LSNOEDUT42L6QGQHATWO55CM3NEKN4WGK3JAPU26Q@tmp/withMaven9928b1e5" 
/home/jenkins/jenkins-slave/workspace/maven-javadoc-plugin_master-XEOGALQNOP5LSNOEDUT42L6QGQHATWO55CM3NEKN4WGK3JAPU26Q/m/src/test/resources/unit/test-javadoc-test/src/test/java/maven/AppTest.java:22: error: package junit.framework does not exist
import junit.framework.Test;
                      ^
/home/jenkins/jenkins-slave/workspace/maven-javadoc-plugin_master-XEOGALQNOP5LSNOEDUT42L6QGQHATWO55CM3NEKN4WGK3JAPU26Q/m/src/test/resources/unit/test-javadoc-test/src/test/java/maven/AppTest.java:23: error: package junit.framework does not exist
import junit.framework.TestCase;
                      ^
/home/jenkins/jenkins-slave/workspace/maven-javadoc-plugin_master-XEOGALQNOP5LSNOEDUT42L6QGQHATWO55CM3NEKN4WGK3JAPU26Q/m/src/test/resources/unit/test-javadoc-test/src/test/java/maven/AppTest.java:24: error: package junit.framework does not exist
import junit.framework.TestSuite;
                      ^
/home/jenkins/jenkins-slave/workspace/maven-javadoc-plugin_master-XEOGALQNOP5LSNOEDUT42L6QGQHATWO55CM3NEKN4WGK3JAPU26Q/m/src/test/resources/unit/test-javadoc-test/src/test/java/maven/AppTest.java:30: error: cannot find symbol
    extends TestCase
            ^
  symbol: class TestCase
/home/jenkins/jenkins-slave/workspace/maven-javadoc-plugin_master-XEOGALQNOP5LSNOEDUT42L6QGQHATWO55CM3NEKN4WGK3JAPU26Q/m/src/test/resources/unit/test-javadoc-test/src/test/java/maven/AppTest.java:45: error: cannot find symbol
    public static Test suite()
                  ^
  symbol:   class Test
  location: class AppTest

Command line was: /home/jenkins/tools/java/latest1.9/bin/javadoc @options @packages

Refer to the generated Javadoc files in '/home/jenkins/jenkins-slave/workspace/maven-javadoc-plugin_master-XEOGALQNOP5LSNOEDUT42L6QGQHATWO55CM3NEKN4WGK3JAPU26Q/m/target/test/unit/test-javadoc-test/target/site/apidocs' dir.

	at org.apache.maven.plugins.javadoc.TestJavadocReportTest.testTestJavadoc(TestJavadocReportTest.java:53)
Caused by: org.apache.maven.reporting.MavenReportException: 

Exit code: 1 - Picked up JAVA_TOOL_OPTIONS: -Dmaven.ext.class.path="/home/jenkins/jenkins-slave/workspace/maven-javadoc-plugin_master-XEOGALQNOP5LSNOEDUT42L6QGQHATWO55CM3NEKN4WGK3JAPU26Q@tmp/withMaven9928b1e5/pipeline-maven-spy.jar" -Dorg.jenkinsci.plugins.pipeline.maven.reportsFolder="/home/jenkins/jenkins-slave/workspace/maven-javadoc-plugin_master-XEOGALQNOP5LSNOEDUT42L6QGQHATWO55CM3NEKN4WGK3JAPU26Q@tmp/withMaven9928b1e5" 
/home/jenkins/jenkins-slave/workspace/maven-javadoc-plugin_master-XEOGALQNOP5LSNOEDUT42L6QGQHATWO55CM3NEKN4WGK3JAPU26Q/m/src/test/resources/unit/test-javadoc-test/src/test/java/maven/AppTest.java:22: error: package junit.framework does not exist
import junit.framework.Test;
                      ^
/home/jenkins/jenkins-slave/workspace/maven-javadoc-plugin_master-XEOGALQNOP5LSNOEDUT42L6QGQHATWO55CM3NEKN4WGK3JAPU26Q/m/src/test/resources/unit/test-javadoc-test/src/test/java/maven/AppTest.java:23: error: package junit.framework does not exist
import junit.framework.TestCase;
                      ^
/home/jenkins/jenkins-slave/workspace/maven-javadoc-plugin_master-XEOGALQNOP5LSNOEDUT42L6QGQHATWO55CM3NEKN4WGK3JAPU26Q/m/src/test/resources/unit/test-javadoc-test/src/test/java/maven/AppTest.java:24: error: package junit.framework does not exist
import junit.framework.TestSuite;
                      ^
/home/jenkins/jenkins-slave/workspace/maven-javadoc-plugin_master-XEOGALQNOP5LSNOEDUT42L6QGQHATWO55CM3NEKN4WGK3JAPU26Q/m/src/test/resources/unit/test-javadoc-test/src/test/java/maven/AppTest.java:30: error: cannot find symbol
    extends TestCase
            ^
  symbol: class TestCase
/home/jenkins/jenkins-slave/workspace/maven-javadoc-plugin_master-XEOGALQNOP5LSNOEDUT42L6QGQHATWO55CM3NEKN4WGK3JAPU26Q/m/src/test/resources/unit/test-javadoc-test/src/test/java/maven/AppTest.java:45: error: cannot find symbol
    public static Test suite()
                  ^
  symbol:   class Test
  location: class AppTest

Command line was: /home/jenkins/tools/java/latest1.9/bin/javadoc @options @packages

Refer to the generated Javadoc files in '/home/jenkins/jenkins-slave/workspace/maven-javadoc-plugin_master-XEOGALQNOP5LSNOEDUT42L6QGQHATWO55CM3NEKN4WGK3JAPU26Q/m/target/test/unit/test-javadoc-test/target/site/apidocs' dir.

	at org.apache.maven.plugins.javadoc.TestJavadocReportTest.testTestJavadoc(TestJavadocReportTest.java:53)




Build log:
[...truncated 2.50 MB...]
[linux-jdk9] [withMaven] Skip 'Findbugs Publisher' disabled by configuration
[linux-jdk9] [withMaven] Skip 'Open Task Scanner Publisher' disabled by configuration
[linux-jdk9] [withMaven] Skip 'Generated Artifacts Publisher' disabled by configuration
[linux-jdk9] [withMaven] Skip 'Findbugs Publisher' disabled by configuration
[linux-jdk9] [withMaven] Skip 'Open Task Scanner Publisher' disabled by configuration
[linux-jdk9] [withMaven] Skip 'Generated Artifacts Publisher' disabled by configuration
[linux-jdk9] [withMaven] Skip 'Findbugs Publisher' disabled by configuration
[linux-jdk9] [withMaven] Skip 'Open Task Scanner Publisher' disabled by configuration
[linux-jdk9] [withMaven] Skip 'Generated Artifacts Publisher' disabled by configuration
[linux-jdk9] [withMaven] Skip 'Findbugs Publisher' disabled by configuration
[linux-jdk9] [withMaven] Skip 'Open Task Scanner Publisher' disabled by configuration
[linux-jdk9] [withMaven] Skip 'Generated Artifacts Publisher' disabled by configuration
[linux-jdk9] [withMaven] junitPublisher - Archive test results for Maven artifact org.apache.maven.plugins.javadoc.it:foo:1.0-SNAPSHOT generated by maven-surefire-plugin:test (default-test): m/target/it/MJAVADOC-498_mm_modulepath/foo/target/surefire-reports/*.xml
[linux-jdk9] [withMaven] junitPublisher - Jenkins JUnit Attachments Plugin not found, can't publish test attachments.Recording test results
[linux-jdk9] None of the test reports contained any result
[linux-jdk9] [withMaven] junitPublisher - Archive test results for Maven artifact org.apache.maven.plugins.javadoc.it:bar:1.0-SNAPSHOT generated by maven-surefire-plugin:test (default-test): m/target/it/MJAVADOC-498_mm_modulepath/bar/target/surefire-reports/*.xml
[linux-jdk9] [withMaven] junitPublisher - Jenkins JUnit Attachments Plugin not found, can't publish test attachments.Recording test results
[linux-jdk9] None of the test reports contained any result
[linux-jdk9] [withMaven] Skip 'Findbugs Publisher' disabled by configuration
[linux-jdk9] [withMaven] Skip 'Open Task Scanner Publisher' disabled by configuration
[Pipeline] [windows-jdk9] }
[Pipeline] [linux-jdk7] // node
[Pipeline] [windows-jdk7] // withMaven
[Pipeline] [linux-jdk9] // withMaven
[Pipeline] [windows-jdk9] // node
[Pipeline] [linux-jdk7] }
[Pipeline] [windows-jdk9] }
[Pipeline] [windows-jdk7] }
[Pipeline] [linux-jdk9] }
[Pipeline] [windows-jdk8] }
[Pipeline] [windows-jdk7] // stage
[Pipeline] [linux-jdk9] // stage
[Pipeline] [windows-jdk8] // dir
[Pipeline] [linux-jdk9] }
[Pipeline] [windows-jdk7] }
[Pipeline] [windows-jdk8] }
[windows-jdk8] [withMaven] Skip 'Generated Artifacts Publisher' disabled by configuration
[windows-jdk8] [withMaven] junitPublisher - Archive test results for Maven artifact org.apache.maven.plugins:maven-javadoc-plugin:3.0.1-SNAPSHOT generated by maven-surefire-plugin:test (default-test): m\target\surefire-reports\*.xml
[windows-jdk8] [withMaven] junitPublisher - Jenkins JUnit Attachments Plugin not found, can't publish test attachments.Recording test results
[windows-jdk8] [withMaven] Skip 'Findbugs Publisher' disabled by configuration
[windows-jdk8] [withMaven] Skip 'Open Task Scanner Publisher' disabled by configuration
[windows-jdk8] [withMaven] Skip 'Generated Artifacts Publisher' disabled by configuration
[windows-jdk8] [withMaven] Skip 'Findbugs Publisher' disabled by configuration
[windows-jdk8] [withMaven] Skip 'Open Task Scanner Publisher' disabled by configuration
[windows-jdk8] [withMaven] Skip 'Generated Artifacts Publisher' disabled by configuration
[windows-jdk8] [withMaven] Skip 'Findbugs Publisher' disabled by configuration
[windows-jdk8] [withMaven] Skip 'Open Task Scanner Publisher' disabled by configuration
[windows-jdk8] [withMaven] Skip 'Generated Artifacts Publisher' disabled by configuration
[windows-jdk8] [withMaven] Skip 'Findbugs Publisher' disabled by configuration
[windows-jdk8] [withMaven] Skip 'Open Task Scanner Publisher' disabled by configuration
[windows-jdk8] [withMaven] Skip 'Generated Artifacts Publisher' disabled by configuration
[windows-jdk8] [withMaven] Skip 'Findbugs Publisher' disabled by configuration
[windows-jdk8] [withMaven] Skip 'Open Task Scanner Publisher' disabled by configuration
[windows-jdk8] [withMaven] Skip 'Generated Artifacts Publisher' disabled by configuration
[windows-jdk8] [withMaven] Skip 'Findbugs Publisher' disabled by configuration
[windows-jdk8] [withMaven] Skip 'Open Task Scanner Publisher' disabled by configuration
[windows-jdk8] [withMaven] Skip 'Generated Artifacts Publisher' disabled by configuration
[windows-jdk8] [withMaven] Skip 'Findbugs Publisher' disabled by configuration
[windows-jdk8] [withMaven] Skip 'Open Task Scanner Publisher' disabled by configuration
[windows-jdk8] [withMaven] Skip 'Generated Artifacts Publisher' disabled by configuration
[windows-jdk8] [withMaven] Skip 'Findbugs Publisher' disabled by configuration
[windows-jdk8] [withMaven] Skip 'Open Task Scanner Publisher' disabled by configuration
[windows-jdk8] [withMaven] Skip 'Generated Artifacts Publisher' disabled by configuration
[windows-jdk8] [withMaven] Skip 'Findbugs Publisher' disabled by configuration
[windows-jdk8] [withMaven] Skip 'Open Task Scanner Publisher' disabled by configuration
[windows-jdk8] [withMaven] Skip 'Generated Artifacts Publisher' disabled by configuration
[windows-jdk8] [withMaven] junitPublisher - Archive test results for Maven artifact org.apache.maven.plugins.maven-javadoc-plugin.it:MJAVADOC-280-1-modA:1.0-SNAPSHOT generated by maven-surefire-plugin:test (default-test): m\target\it\dependencySource-1\MJAVADOC-280-1-modA\target\surefire-reports\*.xml
[windows-jdk8] [withMaven] junitPublisher - Jenkins JUnit Attachments Plugin not found, can't publish test attachments.Recording test results
[windows-jdk8] [withMaven] junitPublisher - Archive test results for Maven artifact org.apache.maven.plugins.maven-javadoc-plugin.it:MJAVADOC-280-1-modB:1.0-SNAPSHOT generated by maven-surefire-plugin:test (default-test): m\target\it\dependencySource-1\MJAVADOC-280-1-modB\target\surefire-reports\*.xml
[windows-jdk8] [withMaven] junitPublisher - Jenkins JUnit Attachments Plugin not found, can't publish test attachments.Recording test results
[windows-jdk8] [withMaven] junitPublisher - Archive test results for Maven artifact org.apache.maven.plugins.maven-javadoc-plugin.it:MJAVADOC-280-1-distro:1.0-SNAPSHOT generated by maven-surefire-plugin:test (default-test): m\target\it\dependencySource-1\MJAVADOC-280-1-distro\target\surefire-reports\*.xml
[windows-jdk8] [withMaven] junitPublisher - Jenkins JUnit Attachments Plugin not found, can't publish test attachments.Recording test results
[windows-jdk8] None of the test reports contained any result
[windows-jdk8] [withMaven] Skip 'Findbugs Publisher' disabled by configuration
[windows-jdk8] [withMaven] Skip 'Open Task Scanner Publisher' disabled by configuration
[windows-jdk8] [withMaven] Skip 'Generated Artifacts Publisher' disabled by configuration
[windows-jdk8] [withMaven] junitPublisher - Archive test results for Maven artifact org.apache.maven.plugins.maven-javadoc-plugin.it:MJAVADOC-280-2-modA:1.0-SNAPSHOT generated by maven-surefire-plugin:test (default-test): m\target\it\dependencySource-2\MJAVADOC-280-2-projects\MJAVADOC-280-2-modA\target\surefire-reports\*.xml
[windows-jdk8] [withMaven] junitPublisher - Jenkins JUnit Attachments Plugin not found, can't publish test attachments.Recording test results
[windows-jdk8] [withMaven] junitPublisher - Archive test results for Maven artifact org.apache.maven.plugins.maven-javadoc-plugin.it:MJAVADOC-280-2-modB:1.0-SNAPSHOT generated by maven-surefire-plugin:test (default-test): m\target\it\dependencySource-2\MJAVADOC-280-2-projects\MJAVADOC-280-2-modB\target\surefire-reports\*.xml
[windows-jdk8] [withMaven] junitPublisher - Jenkins JUnit Attachments Plugin not found, can't publish test attachments.Recording test results
[windows-jdk8] [withMaven] Skip 'Findbugs Publisher' disabled by configuration
[windows-jdk8] [withMaven] Skip 'Open Task Scanner Publisher' disabled by configuration
[windows-jdk8] [withMaven] Skip 'Generated Artifacts Publisher' disabled by configuration
[windows-jdk8] [withMaven] junitPublisher - Archive test results for Maven artifact org.apache.maven.plugins.maven-javadoc-plugin.it:MJAVADOC-280-2-distro:1.0-SNAPSHOT generated by maven-surefire-plugin:test (default-test): m\target\it\dependencySource-2\MJAVADOC-280-2-distro\target\surefire-reports\*.xml
[windows-jdk8] [withMaven] junitPublisher - Jenkins JUnit Attachments Plugin not found, can't publish test attachments.Recording test results
[windows-jdk8] None of the test reports contained any result
[windows-jdk8] [withMaven] Skip 'Findbugs Publisher' disabled by configuration
[windows-jdk8] [withMaven] Skip 'Open Task Scanner Publisher' disabled by configuration
[windows-jdk8] [withMaven] Skip 'Generated Artifacts Publisher' disabled by configuration
[windows-jdk8] [withMaven] junitPublisher - Archive test results for Maven artifact org.apache.maven.plugins.maven-javadoc-plugin.it:MJAVADOC-280-3-modA:1.0-SNAPSHOT generated by maven-surefire-plugin:test (default-test): m\target\it\dependencySource-3\MJAVADOC-280-3-modA\target\surefire-reports\*.xml
[windows-jdk8] [withMaven] junitPublisher - Jenkins JUnit Attachments Plugin not found, can't publish test attachments.Recording test results
[windows-jdk8] [withMaven] junitPublisher - Archive test results for Maven artifact org.apache.maven.plugins.maven-javadoc-plugin.it:MJAVADOC-280-3-modB:1.0-SNAPSHOT generated by maven-surefire-plugin:test (default-test): m\target\it\dependencySource-3\MJAVADOC-280-3-modB\target\surefire-reports\*.xml
[windows-jdk8] [withMaven] junitPublisher - Jenkins JUnit Attachments Plugin not found, can't publish test attachments.Recording test results
[windows-jdk8] [withMaven] junitPublisher - Archive test results for Maven artifact org.apache.maven.plugins.maven-javadoc-plugin.it:MJAVADOC-280-3-distro:1.0-SNAPSHOT generated by maven-surefire-plugin:test (default-test): m\target\it\dependencySource-3\MJAVADOC-280-3-distro\target\surefire-reports\*.xml
[windows-jdk8] [withMaven] junitPublisher - Jenkins JUnit Attachments Plugin not found, can't publish test attachments.Recording test results
[windows-jdk8] None of the test reports contained any result
[windows-jdk8] [withMaven] Skip 'Findbugs Publisher' disabled by configuration
[windows-jdk8] [withMaven] Skip 'Open Task Scanner Publisher' disabled by configuration
[windows-jdk8] [withMaven] Skip 'Generated Artifacts Publisher' disabled by configuration
[windows-jdk8] [withMaven] junitPublisher - Archive test results for Maven artifact org.apache.maven.plugins.maven-javadoc-plugin.it:MJAVADOC-280-4-modA:1.0-SNAPSHOT generated by maven-surefire-plugin:test (default-test): m\target\it\dependencySource-4\MJAVADOC-280-4-projects\MJAVADOC-280-4-modA\target\surefire-reports\*.xml
[windows-jdk8] [withMaven] junitPublisher - Jenkins JUnit Attachments Plugin not found, can't publish test attachments.Recording test results
[windows-jdk8] [withMaven] junitPublisher - Archive test results for Maven artifact org.apache.maven.plugins.maven-javadoc-plugin.it:MJAVADOC-280-4-modB:1.0-SNAPSHOT generated by maven-surefire-plugin:test (default-test): m\target\it\dependencySource-4\MJAVADOC-280-4-projects\MJAVADOC-280-4-modB\target\surefire-reports\*.xml
[windows-jdk8] [withMaven] junitPublisher - Jenkins JUnit Attachments Plugin not found, can't publish test attachments.Recording test results
[windows-jdk8] [withMaven] Skip 'Findbugs Publisher' disabled by configuration
[windows-jdk8] [withMaven] Skip 'Open Task Scanner Publisher' disabled by configuration
[windows-jdk8] [withMaven] Skip 'Generated Artifacts Publisher' disabled by configuration
[windows-jdk8] [withMaven] junitPublisher - Archive test results for Maven artifact org.apache.maven.plugins.maven-javadoc-plugin.it:MJAVADOC-280-4-distro:1.0-SNAPSHOT generated by maven-surefire-plugin:test (default-test): m\target\it\dependencySource-4\MJAVADOC-280-4-distro\target\surefire-reports\*.xml
[windows-jdk8] [withMaven] junitPublisher - Jenkins JUnit Attachments Plugin not found, can't publish test attachments.Recording test results
[windows-jdk8] None of the test reports contained any result
[windows-jdk8] [withMaven] Skip 'Findbugs Publisher' disabled by configuration
[windows-jdk8] [withMaven] Skip 'Open Task Scanner Publisher' disabled by configuration
[windows-jdk8] [withMaven] Skip 'Generated Artifacts Publisher' disabled by configuration
[windows-jdk8] [withMaven] Skip 'Findbugs Publisher' disabled by configuration
[windows-jdk8] [withMaven] Skip 'Open Task Scanner Publisher' disabled by configuration
[windows-jdk8] [withMaven] Skip 'Generated Artifacts Publisher' disabled by configuration
[windows-jdk8] [withMaven] Skip 'Findbugs Publisher' disabled by configuration
[windows-jdk8] [withMaven] Skip 'Open Task Scanner Publisher' disabled by configuration
[windows-jdk8] [withMaven] Skip 'Generated Artifacts Publisher' disabled by configuration
[windows-jdk8] [withMaven] junitPublisher - Archive test results for Maven artifact org.apache.maven.plugins.maven-javadoc-plugin.it:test-module:1.0-SNAPSHOT generated by maven-surefire-plugin:test (default-test): m\target\it\MJAVADOC-110\test-module\target\surefire-reports\*.xml
[windows-jdk8] [withMaven] junitPublisher - Jenkins JUnit Attachments Plugin not found, can't publish test attachments.Recording test results
[windows-jdk8] None of the test reports contained any result
[windows-jdk8] [withMaven] Skip 'Findbugs Publisher' disabled by configuration
[windows-jdk8] [withMaven] Skip 'Open Task Scanner Publisher' disabled by configuration
[windows-jdk8] [withMaven] Skip 'Generated Artifacts Publisher' disabled by configuration
[windows-jdk8] [withMaven] junitPublisher - Archive test results for Maven artifact org.apache.maven.plugins.maven-javadoc-plugin.it:res1:1.0-SNAPSHOT generated by maven-surefire-plugin:test (default-test): m\target\it\MJAVADOC-126\res1\target\surefire-reports\*.xml
[windows-jdk8] [withMaven] junitPublisher - Jenkins JUnit Attachments Plugin not found, can't publish test attachments.Recording test results
[windows-jdk8] None of the test reports contained any result
[windows-jdk8] [withMaven] junitPublisher - Archive test results for Maven artifact org.apache.maven.plugins.maven-javadoc-plugin.it:res2:1.0-SNAPSHOT generated by maven-surefire-plugin:test (default-test): m\target\it\MJAVADOC-126\res2\target\surefire-reports\*.xml
[windows-jdk8] [withMaven] junitPublisher - Jenkins JUnit Attachments Plugin not found, can't publish test attachments.Recording test results
[windows-jdk8] None of the test reports contained any result
[windows-jdk8] [withMaven] junitPublisher - Archive test results for Maven artifact org.apache.maven.plugins.maven-javadoc-plugin.it:org.apache.maven.plugins.maven-javadoc-plugin.it:1.0-SNAPSHOT generated by maven-surefire-plugin:test (default-test): m\target\it\MJAVADOC-126\test\target\surefire-reports\*.xml
[windows-jdk8] [withMaven] junitPublisher - Jenkins JUnit Attachments Plugin not found, can't publish test attachments.Recording test results
[windows-jdk8] None of the test reports contained any result
[windows-jdk8] [withMaven] Skip 'Findbugs Publisher' disabled by configuration
[windows-jdk8] [withMaven] Skip 'Open Task Scanner Publisher' disabled by configuration
[windows-jdk8] [withMaven] Skip 'Generated Artifacts Publisher' disabled by configuration
[windows-jdk8] [withMaven] Skip 'Findbugs Publisher' disabled by configuration
[windows-jdk8] [withMaven] Skip 'Open Task Scanner Publisher' disabled by configuration
[windows-jdk8] [withMaven] Skip 'Generated Artifacts Publisher' disabled by configuration
[windows-jdk8] [withMaven] junitPublisher - Archive test results for Maven artifact org.apache.maven.plugins.maven-javadoc-plugin.it:test-module1:1.0-SNAPSHOT generated by maven-surefire-plugin:test (default-test): m\target\it\MJAVADOC-172\test-module1\target\surefire-reports\*.xml
[windows-jdk8] [withMaven] junitPublisher - Jenkins JUnit Attachments Plugin not found, can't publish test attachments.Recording test results
[windows-jdk8] None of the test reports contained any result
[windows-jdk8] [withMaven] junitPublisher - Archive test results for Maven artifact org.apache.maven.plugins.maven-javadoc-plugin.it:test-module2:1.0-SNAPSHOT generated by maven-surefire-plugin:test (default-test): m\target\it\MJAVADOC-172\test-module2\target\surefire-reports\*.xml
[windows-jdk8] [withMaven] junitPublisher - Jenkins JUnit Attachments Plugin not found, can't publish test attachments.Recording test results
[windows-jdk8] None of the test reports contained any result
[windows-jdk8] [withMaven] Skip 'Findbugs Publisher' disabled by configuration
[windows-jdk8] [withMaven] Skip 'Open Task Scanner Publisher' disabled by configuration
[windows-jdk8] [withMaven] Skip 'Generated Artifacts Publisher' disabled by configuration
[windows-jdk8] [withMaven] Skip 'Findbugs Publisher' disabled by configuration
[windows-jdk8] [withMaven] Skip 'Open Task Scanner Publisher' disabled by configuration
[windows-jdk8] [withMaven] Skip 'Generated Artifacts Publisher' disabled by configuration
[windows-jdk8] [withMaven] Skip 'Findbugs Publisher' disabled by configuration
[windows-jdk8] [withMaven] Skip 'Open Task Scanner Publisher' disabled by configuration
[windows-jdk8] [withMaven] Skip 'Generated Artifacts Publisher' disabled by configuration
[windows-jdk8] [withMaven] Skip 'Findbugs Publisher' disabled by configuration
[windows-jdk8] [withMaven] Skip 'Open Task Scanner Publisher' disabled by configuration
[windows-jdk8] [withMaven] Skip 'Generated Artifacts Publisher' disabled by configuration
[windows-jdk8] [withMaven] Skip 'Findbugs Publisher' disabled by configuration
[windows-jdk8] [withMaven] Skip 'Open Task Scanner Publisher' disabled by configuration
[windows-jdk8] [withMaven] Skip 'Generated Artifacts Publisher' disabled by configuration
[windows-jdk8] [withMaven] Skip 'Findbugs Publisher' disabled by configuration
[windows-jdk8] [withMaven] Skip 'Open Task Scanner Publisher' disabled by configuration
[windows-jdk8] [withMaven] Skip 'Generated Artifacts Publisher' disabled by configuration
[windows-jdk8] [withMaven] Skip 'Findbugs Publisher' disabled by configuration
[windows-jdk8] [withMaven] Skip 'Open Task Scanner Publisher' disabled by configuration
[windows-jdk8] [withMaven] Skip 'Generated Artifacts Publisher' disabled by configuration
[windows-jdk8] [withMaven] Skip 'Findbugs Publisher' disabled by configuration
[windows-jdk8] [withMaven] Skip 'Open Task Scanner Publisher' disabled by configuration
[windows-jdk8] [withMaven] Skip 'Generated Artifacts Publisher' disabled by configuration
[windows-jdk8] [withMaven] junitPublisher - Archive test results for Maven artifact org.apache.maven.its.javadoc:MJAVADOC-275-mod-a:0.1 generated by maven-surefire-plugin:test (default-test): m\target\it\MJAVADOC-275\mod-a\target\surefire-reports\*.xml
[windows-jdk8] [withMaven] junitPublisher - Jenkins JUnit Attachments Plugin not found, can't publish test attachments.Recording test results
[windows-jdk8] None of the test reports contained any result
[windows-jdk8] [withMaven] junitPublisher - Archive test results for Maven artifact org.apache.maven.its.javadoc:MJAVADOC-275-mod-b:0.1 generated by maven-surefire-plugin:test (default-test): m\target\it\MJAVADOC-275\mod-b\target\surefire-reports\*.xml
[windows-jdk8] [withMaven] junitPublisher - Jenkins JUnit Attachments Plugin not found, can't publish test attachments.Recording test results
[windows-jdk8] None of the test reports contained any result
[windows-jdk8] [withMaven] junitPublisher - Archive test results for Maven artifact org.apache.maven.its.javadoc:MJAVADOC-275-mod-c:0.1 generated by maven-surefire-plugin:test (default-test): m\target\it\MJAVADOC-275\mod-c\target\surefire-reports\*.xml
[windows-jdk8] [withMaven] junitPublisher - Jenkins JUnit Attachments Plugin not found, can't publish test attachments.Recording test results
[windows-jdk8] None of the test reports contained any result
[windows-jdk8] [withMaven] Skip 'Findbugs Publisher' disabled by configuration
[windows-jdk8] [withMaven] Skip 'Open Task Scanner Publisher' disabled by configuration
[windows-jdk8] [withMaven] Skip 'Generated Artifacts Publisher' disabled by configuration
[windows-jdk8] [withMaven] Skip 'Findbugs Publisher' disabled by configuration
[windows-jdk8] [withMaven] Skip 'Open Task Scanner Publisher' disabled by configuration
[windows-jdk8] [withMaven] Skip 'Generated Artifacts Publisher' disabled by configuration
[windows-jdk8] [withMaven] junitPublisher - Archive test results for Maven artifact org.apache.maven.plugins.maven-javadoc-plugin.it:module1:1.0-SNAPSHOT generated by maven-surefire-plugin:test (default-test): m\target\it\MJAVADOC-320\module1\target\surefire-reports\*.xml
[windows-jdk8] [withMaven] junitPublisher - Jenkins JUnit Attachments Plugin not found, can't publish test attachments.Recording test results
[windows-jdk8] None of the test reports contained any result
[windows-jdk8] [withMaven] junitPublisher - Archive test results for Maven artifact org.apache.maven.plugins.maven-javadoc-plugin.it:module3:1.0-SNAPSHOT generated by maven-surefire-plugin:test (default-test): m\target\it\MJAVADOC-320\module3\target\surefire-reports\*.xml
[windows-jdk8] [withMaven] junitPublisher - Jenkins JUnit Attachments Plugin not found, can't publish test attachments.Recording test results
[windows-jdk8] None of the test reports contained any result
[windows-jdk8] [withMaven] junitPublisher - Archive test results for Maven artifact org.apache.maven.plugins.maven-javadoc-plugin.it:module2:1.0-SNAPSHOT generated by maven-surefire-plugin:test (default-test): m\target\it\MJAVADOC-320\module2\target\surefire-reports\*.xml
[windows-jdk8] [withMaven] junitPublisher - Jenkins JUnit Attachments Plugin not found, can't publish test attachments.Recording test results
[windows-jdk8] None of the test reports contained any result
[windows-jdk8] [withMaven] Skip 'Findbugs Publisher' disabled by configuration
[windows-jdk8] [withMaven] Skip 'Open Task Scanner Publisher' disabled by configuration
[windows-jdk8] [withMaven] Skip 'Generated Artifacts Publisher' disabled by configuration
[windows-jdk8] [withMaven] Skip 'Findbugs Publisher' disabled by configuration
[windows-jdk8] [withMaven] Skip 'Open Task Scanner Publisher' disabled by configuration
[windows-jdk8] [withMaven] Skip 'Generated Artifacts Publisher' disabled by configuration
[windows-jdk8] [withMaven] Skip 'Findbugs Publisher' disabled by configuration
[windows-jdk8] [withMaven] Skip 'Open Task Scanner Publisher' disabled by configuration
[windows-jdk8] [withMaven] Skip 'Generated Artifacts Publisher' disabled by configuration
[windows-jdk8] [withMaven] junitPublisher - Archive test results for Maven artifact org.apache.maven.plugins.maven-javadoc-plugin.it:mjavadoc-369:1.0-SNAPSHOT generated by maven-surefire-plugin:test (default-test): m\target\it\MJAVADOC-369\target\surefire-reports\*.xml
[windows-jdk8] [withMaven] junitPublisher - Jenkins JUnit Attachments Plugin not found, can't publish test attachments.Recording test results
[windows-jdk8] [withMaven] Skip 'Findbugs Publisher' disabled by configuration
[windows-jdk8] [withMaven] Skip 'Open Task Scanner Publisher' disabled by configuration
[windows-jdk8] [withMaven] Skip 'Generated Artifacts Publisher' disabled by configuration
[windows-jdk8] [withMaven] Skip 'Findbugs Publisher' disabled by configuration
[windows-jdk8] [withMaven] Skip 'Open Task Scanner Publisher' disabled by configuration
[windows-jdk8] [withMaven] Skip 'Generated Artifacts Publisher' disabled by configuration
[windows-jdk8] [withMaven] Skip 'Findbugs Publisher' disabled by configuration
[windows-jdk8] [withMaven] Skip 'Open Task Scanner Publisher' disabled by configuration
[windows-jdk8] [withMaven] Skip 'Generated Artifacts Publisher' disabled by configuration
[windows-jdk8] [withMaven] Skip 'Findbugs Publisher' disabled by configuration
[windows-jdk8] [withMaven] Skip 'Open Task Scanner Publisher' disabled by configuration
[windows-jdk8] [withMaven] Skip 'Generated Artifacts Publisher' disabled by configuration
[windows-jdk8] [withMaven] Skip 'Findbugs Publisher' disabled by configuration
[windows-jdk8] [withMaven] Skip 'Open Task Scanner Publisher' disabled by configuration
[windows-jdk8] [withMaven] Skip 'Generated Artifacts Publisher' disabled by configuration
[windows-jdk8] [withMaven] Skip 'Findbugs Publisher' disabled by configuration
[windows-jdk8] [withMaven] Skip 'Open Task Scanner Publisher' disabled by configuration
[windows-jdk8] [withMaven] Skip 'Generated Artifacts Publisher' disabled by configuration
[windows-jdk8] [withMaven] Skip 'Findbugs Publisher' disabled by configuration
[windows-jdk8] [withMaven] Skip 'Open Task Scanner Publisher' disabled by configuration
[windows-jdk8] [withMaven] Skip 'Generated Artifacts Publisher' disabled by configuration
[windows-jdk8] [withMaven] Skip 'Findbugs Publisher' disabled by configuration
[windows-jdk8] [withMaven] Skip 'Open Task Scanner Publisher' disabled by configuration
[windows-jdk8] [withMaven] Skip 'Generated Artifacts Publisher' disabled by configuration
[windows-jdk8] [withMaven] Skip 'Findbugs Publisher' disabled by configuration
[windows-jdk8] [withMaven] Skip 'Open Task Scanner Publisher' disabled by configuration
[Pipeline] [linux-jdk9] // node
[Pipeline] [windows-jdk7] // node
[Pipeline] [windows-jdk8] // withMaven
[Pipeline] [linux-jdk9] }
[Pipeline] [windows-jdk7] }
[Pipeline] [windows-jdk8] }
[Pipeline] [windows-jdk8] // stage
[Pipeline] [windows-jdk8] }
[Pipeline] [windows-jdk8] // node
[Pipeline] [windows-jdk8] }
[Pipeline] // parallel
[Pipeline] stage
[Pipeline] { (Notifications)
[Pipeline] echo
Build result: UNSTABLE
[Pipeline] jiraIssueSelector
[Pipeline] jiraComment
[Pipeline] jiraComment
[Pipeline] emailext
Mime
  • Unnamed multipart/mixed (inline, None, 0 bytes)
View raw message