maven-notifications mailing list archives

Site index · List index
Message view « Date » · « Thread »
Top « Date » · « Thread »
From Apache Jenkins Server <jenk...@builds.apache.org>
Subject Build failed in Jenkins: maven-plugins-windows #2124
Date Sat, 02 Dec 2017 11:40:30 GMT
See <https://builds.apache.org/job/maven-plugins-windows/2124/display/redirect?page=changes>

Changes:

[Robert Scholte] session is required parameter, so cannot be null. Fix related unittests

------------------------------------------
[...truncated 560.82 KB...]
Tests run: 8, Failures: 0, Errors: 0, Skipped: 0, Time elapsed: 0.026 sec - in org.apache.maven.plugins.dependency.utils.filters.TestDestFileFilter
Running org.apache.maven.plugins.dependency.utils.filters.TestMarkerFileFilter
Tests run: 5, Failures: 0, Errors: 0, Skipped: 0, Time elapsed: 0.011 sec - in org.apache.maven.plugins.dependency.utils.filters.TestMarkerFileFilter
Running org.apache.maven.plugins.dependency.utils.filters.TestResolveMarkerFileFilter
Tests run: 1, Failures: 0, Errors: 0, Skipped: 0, Time elapsed: 0.002 sec - in org.apache.maven.plugins.dependency.utils.filters.TestResolveMarkerFileFilter
Running org.apache.maven.plugins.dependency.utils.markers.TestDefaultMarkerFileHandler
Tests run: 6, Failures: 0, Errors: 0, Skipped: 0, Time elapsed: 0.012 sec - in org.apache.maven.plugins.dependency.utils.markers.TestDefaultMarkerFileHandler
Running org.apache.maven.plugins.dependency.utils.markers.TestSourcesMarkerFileHandler
Tests run: 10, Failures: 0, Errors: 0, Skipped: 0, Time elapsed: 0.015 sec - in org.apache.maven.plugins.dependency.utils.markers.TestSourcesMarkerFileHandler
Running org.apache.maven.plugins.dependency.utils.markers.TestUnpackMarkerFileHandler
Tests run: 9, Failures: 0, Errors: 0, Skipped: 0, Time elapsed: 1.138 sec - in org.apache.maven.plugins.dependency.utils.markers.TestUnpackMarkerFileHandler
Running org.apache.maven.plugins.dependency.utils.TestDependencyStatusSets
Tests run: 2, Failures: 0, Errors: 0, Skipped: 0, Time elapsed: 0.262 sec - in org.apache.maven.plugins.dependency.utils.TestDependencyStatusSets
Running org.apache.maven.plugins.dependency.utils.TestDependencyUtil
Tests run: 9, Failures: 0, Errors: 0, Skipped: 0, Time elapsed: 0.005 sec - in org.apache.maven.plugins.dependency.utils.TestDependencyUtil
Running org.apache.maven.plugins.dependency.utils.TestSilentLog
Tests run: 2, Failures: 0, Errors: 0, Skipped: 0, Time elapsed: 0 sec - in org.apache.maven.plugins.dependency.utils.TestSilentLog
Running org.apache.maven.plugins.dependency.utils.translators.TestClassifierTypeTranslator
Tests run: 6, Failures: 0, Errors: 0, Skipped: 0, Time elapsed: 0.68 sec - in org.apache.maven.plugins.dependency.utils.translators.TestClassifierTypeTranslator

Results :

Tests run: 244, Failures: 0, Errors: 0, Skipped: 0

[JENKINS] Recording test results
[INFO] 
[INFO] --- maven-jar-plugin:3.0.0:jar (default-jar) @ maven-dependency-plugin ---
[INFO] Building jar: F:\jenkins\jenkins-slave\workspace\maven-plugins-windows\maven-dependency-plugin\target\maven-dependency-plugin-3.0.3-SNAPSHOT.jar
[INFO] 
[INFO] --- maven-plugin-plugin:3.4:addPluginArtifactMetadata (default-addPluginArtifactMetadata)
@ maven-dependency-plugin ---
[INFO] 
[INFO] --- maven-site-plugin:3.5.1:attach-descriptor (attach-descriptor) @ maven-dependency-plugin
---
[INFO] 
[INFO] --- maven-checkstyle-plugin:2.15:check (checkstyle-check) @ maven-dependency-plugin
---
[INFO] There is 1 error reported by Checkstyle 6.1.1 with config/maven_checks.xml ruleset.
[INFO] Ignored 1 error, 0 violation remaining.
[INFO] 
[INFO] --- maven-install-plugin:2.5.2:install (default-install) @ maven-dependency-plugin
---
[INFO] Installing F:\jenkins\jenkins-slave\workspace\maven-plugins-windows\maven-dependency-plugin\target\maven-dependency-plugin-3.0.3-SNAPSHOT.jar
to f:\jenkins\jenkins-slave\maven-repositories\0\org\apache\maven\plugins\maven-dependency-plugin\3.0.3-SNAPSHOT\maven-dependency-plugin-3.0.3-SNAPSHOT.jar
[INFO] Installing F:\jenkins\jenkins-slave\workspace\maven-plugins-windows\maven-dependency-plugin\pom.xml
to f:\jenkins\jenkins-slave\maven-repositories\0\org\apache\maven\plugins\maven-dependency-plugin\3.0.3-SNAPSHOT\maven-dependency-plugin-3.0.3-SNAPSHOT.pom
[INFO]                                                                         
[INFO] ------------------------------------------------------------------------
[INFO] Building Apache Maven Plugins Aggregator 1-SNAPSHOT
[INFO] ------------------------------------------------------------------------
[INFO] 
[INFO] --- maven-clean-plugin:3.0.0:clean (default-clean) @ maven-plugins-aggregator ---
[INFO] Deleting <https://builds.apache.org/job/maven-plugins-windows/ws/target>
[INFO] 
[INFO] --- maven-enforcer-plugin:1.4.1:enforce (enforce-bytecode-version) @ maven-plugins-aggregator
---
[INFO] 
[INFO] --- maven-enforcer-plugin:1.4.1:enforce (ban-known-bad-maven-versions) @ maven-plugins-aggregator
---
[INFO] 
[INFO] --- apache-rat-plugin:0.11:check (rat-check) @ maven-plugins-aggregator ---
[INFO] 91 implicit excludes (use -debug for more details).
[INFO] Exclude: DEPENDENCIES
[INFO] 236 resources included (use -debug for more details)
[INFO] Rat check: Summary of files. Unapproved: 0 unknown: 0 generated: 0 approved: 212 licence.
[INFO] 
[INFO] --- maven-remote-resources-plugin:1.5:process (process-resource-bundles) @ maven-plugins-aggregator
---
[INFO] 
[INFO] --- maven-site-plugin:3.5.1:attach-descriptor (attach-descriptor) @ maven-plugins-aggregator
---
[INFO] 
[INFO] --- maven-checkstyle-plugin:2.15:check (checkstyle-check) @ maven-plugins-aggregator
---
[INFO] 
[INFO] --- maven-install-plugin:2.5.2:install (default-install) @ maven-plugins-aggregator
---
[INFO] Installing <https://builds.apache.org/job/maven-plugins-windows/ws/pom.xml> to
f:\jenkins\jenkins-slave\maven-repositories\0\org\apache\maven\plugins\maven-plugins-aggregator\1-SNAPSHOT\maven-plugins-aggregator-1-SNAPSHOT.pom
[INFO] ------------------------------------------------------------------------
[INFO] Reactor Summary:
[INFO] 
[INFO] Apache Maven ACR Plugin ............................ SUCCESS [ 17.447 s]
[INFO] Apache Maven AntRun Plugin ......................... SUCCESS [ 17.765 s]
[INFO] Apache Maven Changelog Plugin ...................... SUCCESS [ 17.625 s]
[INFO] Apache Maven Changes Plugin ........................ SUCCESS [ 38.969 s]
[INFO] Apache Maven Clean Plugin .......................... SUCCESS [ 10.390 s]
[INFO] Apache Maven Compiler Plugin ....................... SUCCESS [ 20.454 s]
[INFO] Apache Maven Deploy Plugin ......................... SUCCESS [ 13.891 s]
[INFO] Apache Maven Documentation Checker Plugin .......... SUCCESS [  5.328 s]
[INFO] Apache Maven EAR Plugin ............................ SUCCESS [ 11.640 s]
[INFO] Apache Maven EJB Plugin ............................ SUCCESS [ 13.625 s]
[INFO] Apache Maven Help Plugin ........................... SUCCESS [ 15.219 s]
[INFO] Apache Maven Install Plugin ........................ SUCCESS [ 13.766 s]
[INFO] Apache Maven Jarsigner Plugin ...................... SUCCESS [  5.531 s]
[INFO] Apache Maven JDeps Plugin .......................... SUCCESS [  6.735 s]
[INFO] Apache Maven Linkcheck Plugin ...................... SUCCESS [  5.703 s]
[INFO] Apache Maven Patch Plugin .......................... SUCCESS [  3.672 s]
[INFO] Apache Maven PDF Plugin ............................ SUCCESS [ 22.078 s]
[INFO] Apache Maven RAR Plugin ............................ SUCCESS [ 10.407 s]
[INFO] Apache Maven Repository Plugin ..................... SUCCESS [  9.016 s]
[INFO] Apache Maven Resources Plugin ...................... SUCCESS [ 14.531 s]
[INFO] Apache Maven Site Plugin ........................... SUCCESS [ 29.195 s]
[INFO] Apache Maven Source Plugin ......................... SUCCESS [ 12.480 s]
[INFO] Apache Maven Stage Plugin .......................... SUCCESS [  7.873 s]
[INFO] Apache Maven Toolchains Plugin ..................... SUCCESS [  4.101 s]
[INFO] Apache Maven Verifier Plugin ....................... SUCCESS [  7.096 s]
[INFO] Apache Maven WAR Plugin ............................ SUCCESS [ 25.759 s]
[INFO] Apache Maven DOAP Plugin ........................... SUCCESS [ 12.038 s]
[INFO] Apache Maven Invoker Plugin ........................ SUCCESS [ 16.605 s]
[INFO] Apache Maven JAR Plugin ............................ SUCCESS [ 25.087 s]
[INFO] Apache Maven Assembly Plugin ....................... SUCCESS [ 28.458 s]
[INFO] Apache Maven Checkstyle Plugin ..................... SUCCESS [ 42.368 s]
[INFO] Apache Maven Javadoc Plugin ........................ SUCCESS [02:40 min]
[INFO] Apache Maven PMD Plugin ............................ SUCCESS [ 30.631 s]
[INFO] Apache Maven JLink Plugin .......................... SUCCESS [  9.443 s]
[INFO] Apache Maven JMod Plugin ........................... SUCCESS [  5.585 s]
[INFO] Apache Maven Project Info Reports Plugin ........... FAILURE [  3.395 s]
[INFO] Apache Maven Remote Resources Plugin ............... SUCCESS [ 11.937 s]
[INFO] Apache Maven Shade Plugin .......................... SUCCESS [ 15.067 s]
[INFO] Apache Maven SCM Publish Plugin .................... SUCCESS [  7.889 s]
[INFO] Apache Maven Dependency Plugin ..................... SUCCESS [01:11 min]
[INFO] Apache Maven Plugins Aggregator .................... SUCCESS [ 25.737 s]
[INFO] ------------------------------------------------------------------------
[INFO] BUILD FAILURE
[INFO] ------------------------------------------------------------------------
[INFO] Total time: 14:04 min
[INFO] Finished at: 2017-12-02T11:40:09+00:00
[INFO] Final Memory: 114M/605M
[INFO] ------------------------------------------------------------------------
[ERROR] Failed to execute goal org.codehaus.mojo:keytool-maven-plugin:1.0:genkey (init) on
project maven-project-info-reports-plugin: Result of cmd.exe /X /C '""C:\Program Files\Java\jre1.8.0_121\..\bin\keytool.exe"
-genkey -dname "cn=jetty, ou=jetty, L=Unknown, ST=Unknown, o=Apache, c=Unknown" -alias apache
-keypass apache -keystore F:\jenkins\jenkins-slave\workspace\maven-plugins-windows\maven-project-info-reports-plugin/target/jetty.jks
-storepass apache -validity 365 -keyalg RSA"' execution is: '1': The system cannot find the
path specified.. -> [Help 1]
org.apache.maven.lifecycle.LifecycleExecutionException: Failed to execute goal org.codehaus.mojo:keytool-maven-plugin:1.0:genkey
(init) on project maven-project-info-reports-plugin: Result of cmd.exe /X /C '""C:\Program
Files\Java\jre1.8.0_121\..\bin\keytool.exe" -genkey -dname "cn=jetty, ou=jetty, L=Unknown,
ST=Unknown, o=Apache, c=Unknown" -alias apache -keypass apache -keystore F:\jenkins\jenkins-slave\workspace\maven-plugins-windows\maven-project-info-reports-plugin/target/jetty.jks
-storepass apache -validity 365 -keyalg RSA"' execution is: '1': The system cannot find the
path specified..
	at org.apache.maven.lifecycle.internal.MojoExecutor.execute(MojoExecutor.java:212)
	at org.apache.maven.lifecycle.internal.MojoExecutor.execute(MojoExecutor.java:153)
	at org.apache.maven.lifecycle.internal.MojoExecutor.execute(MojoExecutor.java:145)
	at org.apache.maven.lifecycle.internal.LifecycleModuleBuilder.buildProject(LifecycleModuleBuilder.java:116)
	at org.apache.maven.lifecycle.internal.LifecycleModuleBuilder.buildProject(LifecycleModuleBuilder.java:80)
	at org.apache.maven.lifecycle.internal.builder.singlethreaded.SingleThreadedBuilder.build(SingleThreadedBuilder.java:51)
	at org.apache.maven.lifecycle.internal.LifecycleStarter.execute(LifecycleStarter.java:128)
	at org.apache.maven.DefaultMaven.doExecute(DefaultMaven.java:307)
	at org.apache.maven.DefaultMaven.doExecute(DefaultMaven.java:193)
	at org.apache.maven.DefaultMaven.execute(DefaultMaven.java:106)
	at org.jvnet.hudson.maven3.launcher.Maven33Launcher.main(Maven33Launcher.java:129)
	at sun.reflect.NativeMethodAccessorImpl.invoke0(Native Method)
	at sun.reflect.NativeMethodAccessorImpl.invoke(Unknown Source)
	at sun.reflect.DelegatingMethodAccessorImpl.invoke(Unknown Source)
	at java.lang.reflect.Method.invoke(Unknown Source)
	at org.codehaus.plexus.classworlds.launcher.Launcher.launchStandard(Launcher.java:330)
	at org.codehaus.plexus.classworlds.launcher.Launcher.launch(Launcher.java:238)
	at jenkins.maven3.agent.Maven33Main.launch(Maven33Main.java:176)
	at sun.reflect.NativeMethodAccessorImpl.invoke0(Native Method)
	at sun.reflect.NativeMethodAccessorImpl.invoke(Unknown Source)
	at sun.reflect.DelegatingMethodAccessorImpl.invoke(Unknown Source)
	at java.lang.reflect.Method.invoke(Unknown Source)
	at hudson.maven.Maven3Builder.call(Maven3Builder.java:139)
	at hudson.maven.Maven3Builder.call(Maven3Builder.java:70)
	at hudson.remoting.UserRequest.perform(UserRequest.java:153)
	at hudson.remoting.UserRequest.perform(UserRequest.java:50)
	at hudson.remoting.Request$2.run(Request.java:336)
	at hudson.remoting.InterceptingExecutorService$1.call(InterceptingExecutorService.java:68)
	at java.util.concurrent.FutureTask.run(Unknown Source)
	at java.util.concurrent.ThreadPoolExecutor.runWorker(Unknown Source)
	at java.util.concurrent.ThreadPoolExecutor$Worker.run(Unknown Source)
	at java.lang.Thread.run(Unknown Source)
Caused by: org.apache.maven.plugin.MojoExecutionException: Result of cmd.exe /X /C '""C:\Program
Files\Java\jre1.8.0_121\..\bin\keytool.exe" -genkey -dname "cn=jetty, ou=jetty, L=Unknown,
ST=Unknown, o=Apache, c=Unknown" -alias apache -keypass apache -keystore F:\jenkins\jenkins-slave\workspace\maven-plugins-windows\maven-project-info-reports-plugin/target/jetty.jks
-storepass apache -validity 365 -keyalg RSA"' execution is: '1': The system cannot find the
path specified..
	at org.codehaus.mojo.keytool.GenkeyMojo.execute(GenkeyMojo.java:207)
	at org.apache.maven.plugin.DefaultBuildPluginManager.executeMojo(DefaultBuildPluginManager.java:134)
	at org.apache.maven.lifecycle.internal.MojoExecutor.execute(MojoExecutor.java:207)
	... 31 more
[ERROR] 
[ERROR] Re-run Maven using the -X switch to enable full debug logging.
[ERROR] 
[ERROR] For more information about the errors and possible solutions, please read the following
articles:
[ERROR] [Help 1] http://cwiki.apache.org/confluence/display/MAVEN/MojoExecutionException
[ERROR] 
[ERROR] After correcting the problems, you can resume the build with the command
[ERROR]   mvn <goals> -rf :maven-project-info-reports-plugin
[JENKINS] Archiving F:\jenkins\jenkins-slave\workspace\maven-plugins-windows\maven-antrun-plugin\pom.xml
to org.apache.maven.plugins/maven-antrun-plugin/3.0.0-SNAPSHOT/maven-antrun-plugin-3.0.0-SNAPSHOT.pom
[JENKINS] Archiving F:\jenkins\jenkins-slave\workspace\maven-plugins-windows\maven-antrun-plugin\target\maven-antrun-plugin-3.0.0-SNAPSHOT.jar
to org.apache.maven.plugins/maven-antrun-plugin/3.0.0-SNAPSHOT/maven-antrun-plugin-3.0.0-SNAPSHOT.jar
[JENKINS] Archiving F:\jenkins\jenkins-slave\workspace\maven-plugins-windows\maven-linkcheck-plugin\pom.xml
to org.apache.maven.plugins/maven-linkcheck-plugin/1.3-SNAPSHOT/maven-linkcheck-plugin-1.3-SNAPSHOT.pom
[JENKINS] Archiving F:\jenkins\jenkins-slave\workspace\maven-plugins-windows\maven-linkcheck-plugin\target\maven-linkcheck-plugin-1.3-SNAPSHOT.jar
to org.apache.maven.plugins/maven-linkcheck-plugin/1.3-SNAPSHOT/maven-linkcheck-plugin-1.3-SNAPSHOT.jar
[JENKINS] Archiving F:\jenkins\jenkins-slave\workspace\maven-plugins-windows\maven-scm-publish-plugin\pom.xml
to org.apache.maven.plugins/maven-scm-publish-plugin/1.2-SNAPSHOT/maven-scm-publish-plugin-1.2-SNAPSHOT.pom
[JENKINS] Archiving F:\jenkins\jenkins-slave\workspace\maven-plugins-windows\maven-scm-publish-plugin\target\maven-scm-publish-plugin-1.2-SNAPSHOT.jar
to org.apache.maven.plugins/maven-scm-publish-plugin/1.2-SNAPSHOT/maven-scm-publish-plugin-1.2-SNAPSHOT.jar
[JENKINS] Archiving F:\jenkins\jenkins-slave\workspace\maven-plugins-windows\maven-acr-plugin\pom.xml
to org.apache.maven.plugins/maven-acr-plugin/3.0.1-SNAPSHOT/maven-acr-plugin-3.0.1-SNAPSHOT.pom
[JENKINS] Archiving F:\jenkins\jenkins-slave\workspace\maven-plugins-windows\maven-acr-plugin\target\maven-acr-plugin-3.0.1-SNAPSHOT.jar
to org.apache.maven.plugins/maven-acr-plugin/3.0.1-SNAPSHOT/maven-acr-plugin-3.0.1-SNAPSHOT.jar
[JENKINS] Archiving F:\jenkins\jenkins-slave\workspace\maven-plugins-windows\maven-install-plugin\pom.xml
to org.apache.maven.plugins/maven-install-plugin/3.0.0-SNAPSHOT/maven-install-plugin-3.0.0-SNAPSHOT.pom
[JENKINS] Archiving F:\jenkins\jenkins-slave\workspace\maven-plugins-windows\maven-install-plugin\target\maven-install-plugin-3.0.0-SNAPSHOT.jar
to org.apache.maven.plugins/maven-install-plugin/3.0.0-SNAPSHOT/maven-install-plugin-3.0.0-SNAPSHOT.jar
[JENKINS] Archiving F:\jenkins\jenkins-slave\workspace\maven-plugins-windows\maven-assembly-plugin\pom.xml
to org.apache.maven.plugins/maven-assembly-plugin/3.1.1-SNAPSHOT/maven-assembly-plugin-3.1.1-SNAPSHOT.pom
[JENKINS] Archiving F:\jenkins\jenkins-slave\workspace\maven-plugins-windows\maven-assembly-plugin\target\maven-assembly-plugin-3.1.1-SNAPSHOT.jar
to org.apache.maven.plugins/maven-assembly-plugin/3.1.1-SNAPSHOT/maven-assembly-plugin-3.1.1-SNAPSHOT.jar
[JENKINS] Archiving F:\jenkins\jenkins-slave\workspace\maven-plugins-windows\maven-docck-plugin\pom.xml
to org.apache.maven.plugins/maven-docck-plugin/1.2-SNAPSHOT/maven-docck-plugin-1.2-SNAPSHOT.pom
[JENKINS] Archiving F:\jenkins\jenkins-slave\workspace\maven-plugins-windows\maven-docck-plugin\target\maven-docck-plugin-1.2-SNAPSHOT.jar
to org.apache.maven.plugins/maven-docck-plugin/1.2-SNAPSHOT/maven-docck-plugin-1.2-SNAPSHOT.jar
[JENKINS] Archiving <https://builds.apache.org/job/maven-plugins-windows/ws/pom.xml>
to org.apache.maven.plugins/maven-plugins-aggregator/1-SNAPSHOT/maven-plugins-aggregator-1-SNAPSHOT.pom
[JENKINS] Archiving F:\jenkins\jenkins-slave\workspace\maven-plugins-windows\maven-clean-plugin\pom.xml
to org.apache.maven.plugins/maven-clean-plugin/3.0.1-SNAPSHOT/maven-clean-plugin-3.0.1-SNAPSHOT.pom
[JENKINS] Archiving F:\jenkins\jenkins-slave\workspace\maven-plugins-windows\maven-clean-plugin\target\maven-clean-plugin-3.0.1-SNAPSHOT.jar
to org.apache.maven.plugins/maven-clean-plugin/3.0.1-SNAPSHOT/maven-clean-plugin-3.0.1-SNAPSHOT.jar
[JENKINS] Archiving F:\jenkins\jenkins-slave\workspace\maven-plugins-windows\maven-resources-plugin\pom.xml
to org.apache.maven.plugins/maven-resources-plugin/3.0.3-SNAPSHOT/maven-resources-plugin-3.0.3-SNAPSHOT.pom
[JENKINS] Archiving F:\jenkins\jenkins-slave\workspace\maven-plugins-windows\maven-resources-plugin\target\maven-resources-plugin-3.0.3-SNAPSHOT.jar
to org.apache.maven.plugins/maven-resources-plugin/3.0.3-SNAPSHOT/maven-resources-plugin-3.0.3-SNAPSHOT.jar
[JENKINS] Archiving F:\jenkins\jenkins-slave\workspace\maven-plugins-windows\maven-pmd-plugin\pom.xml
to org.apache.maven.plugins/maven-pmd-plugin/3.9.0-SNAPSHOT/maven-pmd-plugin-3.9.0-SNAPSHOT.pom
[JENKINS] Archiving F:\jenkins\jenkins-slave\workspace\maven-plugins-windows\maven-pmd-plugin\target\maven-pmd-plugin-3.9.0-SNAPSHOT.jar
to org.apache.maven.plugins/maven-pmd-plugin/3.9.0-SNAPSHOT/maven-pmd-plugin-3.9.0-SNAPSHOT.jar
[JENKINS] Archiving F:\jenkins\jenkins-slave\workspace\maven-plugins-windows\maven-shade-plugin\pom.xml
to org.apache.maven.plugins/maven-shade-plugin/3.1.1-SNAPSHOT/maven-shade-plugin-3.1.1-SNAPSHOT.pom
[JENKINS] Archiving F:\jenkins\jenkins-slave\workspace\maven-plugins-windows\maven-shade-plugin\target\maven-shade-plugin-3.1.1-SNAPSHOT.jar
to org.apache.maven.plugins/maven-shade-plugin/3.1.1-SNAPSHOT/maven-shade-plugin-3.1.1-SNAPSHOT.jar
[JENKINS] Archiving F:\jenkins\jenkins-slave\workspace\maven-plugins-windows\maven-toolchains-plugin\pom.xml
to org.apache.maven.plugins/maven-toolchains-plugin/3.0.0-SNAPSHOT/maven-toolchains-plugin-3.0.0-SNAPSHOT.pom
[JENKINS] Archiving F:\jenkins\jenkins-slave\workspace\maven-plugins-windows\maven-toolchains-plugin\target\maven-toolchains-plugin-3.0.0-SNAPSHOT.jar
to org.apache.maven.plugins/maven-toolchains-plugin/3.0.0-SNAPSHOT/maven-toolchains-plugin-3.0.0-SNAPSHOT.jar
[JENKINS] Archiving F:\jenkins\jenkins-slave\workspace\maven-plugins-windows\maven-remote-resources-plugin\pom.xml
to org.apache.maven.plugins/maven-remote-resources-plugin/1.6-SNAPSHOT/maven-remote-resources-plugin-1.6-SNAPSHOT.pom
[JENKINS] Archiving F:\jenkins\jenkins-slave\workspace\maven-plugins-windows\maven-remote-resources-plugin\target\maven-remote-resources-plugin-1.6-SNAPSHOT.jar
to org.apache.maven.plugins/maven-remote-resources-plugin/1.6-SNAPSHOT/maven-remote-resources-plugin-1.6-SNAPSHOT.jar
[JENKINS] Archiving F:\jenkins\jenkins-slave\workspace\maven-plugins-windows\maven-project-info-reports-plugin\pom.xml
to org.apache.maven.plugins/maven-project-info-reports-plugin/2.10-SNAPSHOT/maven-project-info-reports-plugin-2.10-SNAPSHOT.pom
[JENKINS] Archiving F:\jenkins\jenkins-slave\workspace\maven-plugins-windows\maven-patch-plugin\pom.xml
to org.apache.maven.plugins/maven-patch-plugin/1.3-SNAPSHOT/maven-patch-plugin-1.3-SNAPSHOT.pom
[JENKINS] Archiving F:\jenkins\jenkins-slave\workspace\maven-plugins-windows\maven-patch-plugin\target\maven-patch-plugin-1.3-SNAPSHOT.jar
to org.apache.maven.plugins/maven-patch-plugin/1.3-SNAPSHOT/maven-patch-plugin-1.3-SNAPSHOT.jar
[JENKINS] Archiving F:\jenkins\jenkins-slave\workspace\maven-plugins-windows\maven-compiler-plugin\pom.xml
to org.apache.maven.plugins/maven-compiler-plugin/3.7.1-SNAPSHOT/maven-compiler-plugin-3.7.1-SNAPSHOT.pom
[JENKINS] Archiving F:\jenkins\jenkins-slave\workspace\maven-plugins-windows\maven-compiler-plugin\target\maven-compiler-plugin-3.7.1-SNAPSHOT.jar
to org.apache.maven.plugins/maven-compiler-plugin/3.7.1-SNAPSHOT/maven-compiler-plugin-3.7.1-SNAPSHOT.jar
[JENKINS] Archiving F:\jenkins\jenkins-slave\workspace\maven-plugins-windows\maven-stage-plugin\pom.xml
to org.apache.maven.plugins/maven-stage-plugin/1.1-SNAPSHOT/maven-stage-plugin-1.1-SNAPSHOT.pom
[JENKINS] Archiving F:\jenkins\jenkins-slave\workspace\maven-plugins-windows\maven-stage-plugin\target\maven-stage-plugin-1.1-SNAPSHOT.jar
to org.apache.maven.plugins/maven-stage-plugin/1.1-SNAPSHOT/maven-stage-plugin-1.1-SNAPSHOT.jar
[JENKINS] Archiving F:\jenkins\jenkins-slave\workspace\maven-plugins-windows\maven-verifier-plugin\pom.xml
to org.apache.maven.plugins/maven-verifier-plugin/3.0.0-SNAPSHOT/maven-verifier-plugin-3.0.0-SNAPSHOT.pom
[JENKINS] Archiving F:\jenkins\jenkins-slave\workspace\maven-plugins-windows\maven-verifier-plugin\target\maven-verifier-plugin-3.0.0-SNAPSHOT.jar
to org.apache.maven.plugins/maven-verifier-plugin/3.0.0-SNAPSHOT/maven-verifier-plugin-3.0.0-SNAPSHOT.jar
[JENKINS] Archiving F:\jenkins\jenkins-slave\workspace\maven-plugins-windows\maven-jmod-plugin\pom.xml
to org.apache.maven.plugins/maven-jmod-plugin/3.0.0-alpha-2-SNAPSHOT/maven-jmod-plugin-3.0.0-alpha-2-SNAPSHOT.pom
[JENKINS] Archiving F:\jenkins\jenkins-slave\workspace\maven-plugins-windows\maven-jmod-plugin\target\maven-jmod-plugin-3.0.0-alpha-2-SNAPSHOT.jar
to org.apache.maven.plugins/maven-jmod-plugin/3.0.0-alpha-2-SNAPSHOT/maven-jmod-plugin-3.0.0-alpha-2-SNAPSHOT.jar
[JENKINS] Archiving F:\jenkins\jenkins-slave\workspace\maven-plugins-windows\maven-jarsigner-plugin\pom.xml
to org.apache.maven.plugins/maven-jarsigner-plugin/1.5-SNAPSHOT/maven-jarsigner-plugin-1.5-SNAPSHOT.pom
[JENKINS] Archiving F:\jenkins\jenkins-slave\workspace\maven-plugins-windows\maven-jarsigner-plugin\target\maven-jarsigner-plugin-1.5-SNAPSHOT.jar
to org.apache.maven.plugins/maven-jarsigner-plugin/1.5-SNAPSHOT/maven-jarsigner-plugin-1.5-SNAPSHOT.jar
[JENKINS] Archiving F:\jenkins\jenkins-slave\workspace\maven-plugins-windows\maven-ejb-plugin\pom.xml
to org.apache.maven.plugins/maven-ejb-plugin/3.0.1-SNAPSHOT/maven-ejb-plugin-3.0.1-SNAPSHOT.pom
[JENKINS] Archiving F:\jenkins\jenkins-slave\workspace\maven-plugins-windows\maven-ejb-plugin\target\maven-ejb-plugin-3.0.1-SNAPSHOT.jar
to org.apache.maven.plugins/maven-ejb-plugin/3.0.1-SNAPSHOT/maven-ejb-plugin-3.0.1-SNAPSHOT.jar
[JENKINS] Archiving F:\jenkins\jenkins-slave\workspace\maven-plugins-windows\maven-jlink-plugin\pom.xml
to org.apache.maven.plugins/maven-jlink-plugin/3.0.0-alpha-2-SNAPSHOT/maven-jlink-plugin-3.0.0-alpha-2-SNAPSHOT.pom
[JENKINS] Archiving F:\jenkins\jenkins-slave\workspace\maven-plugins-windows\maven-jlink-plugin\target\maven-jlink-plugin-3.0.0-alpha-2-SNAPSHOT.jar
to org.apache.maven.plugins/maven-jlink-plugin/3.0.0-alpha-2-SNAPSHOT/maven-jlink-plugin-3.0.0-alpha-2-SNAPSHOT.jar
[JENKINS] Archiving F:\jenkins\jenkins-slave\workspace\maven-plugins-windows\maven-changelog-plugin\pom.xml
to org.apache.maven.plugins/maven-changelog-plugin/2.4-SNAPSHOT/maven-changelog-plugin-2.4-SNAPSHOT.pom
[JENKINS] Archiving F:\jenkins\jenkins-slave\workspace\maven-plugins-windows\maven-changelog-plugin\target\maven-changelog-plugin-2.4-SNAPSHOT.jar
to org.apache.maven.plugins/maven-changelog-plugin/2.4-SNAPSHOT/maven-changelog-plugin-2.4-SNAPSHOT.jar
[JENKINS] Archiving F:\jenkins\jenkins-slave\workspace\maven-plugins-windows\maven-help-plugin\pom.xml
to org.apache.maven.plugins/maven-help-plugin/3.0.0-SNAPSHOT/maven-help-plugin-3.0.0-SNAPSHOT.pom
[JENKINS] Archiving F:\jenkins\jenkins-slave\workspace\maven-plugins-windows\maven-help-plugin\target\maven-help-plugin-3.0.0-SNAPSHOT.jar
to org.apache.maven.plugins/maven-help-plugin/3.0.0-SNAPSHOT/maven-help-plugin-3.0.0-SNAPSHOT.jar
[JENKINS] Archiving F:\jenkins\jenkins-slave\workspace\maven-plugins-windows\maven-war-plugin\pom.xml
to org.apache.maven.plugins/maven-war-plugin/3.2.1-SNAPSHOT/maven-war-plugin-3.2.1-SNAPSHOT.pom
[JENKINS] Archiving F:\jenkins\jenkins-slave\workspace\maven-plugins-windows\maven-war-plugin\target\maven-war-plugin-3.2.1-SNAPSHOT.jar
to org.apache.maven.plugins/maven-war-plugin/3.2.1-SNAPSHOT/maven-war-plugin-3.2.1-SNAPSHOT.jar
[JENKINS] Archiving F:\jenkins\jenkins-slave\workspace\maven-plugins-windows\maven-ear-plugin\pom.xml
to org.apache.maven.plugins/maven-ear-plugin/3.0.0-SNAPSHOT/maven-ear-plugin-3.0.0-SNAPSHOT.pom
[JENKINS] Archiving F:\jenkins\jenkins-slave\workspace\maven-plugins-windows\maven-ear-plugin\target\maven-ear-plugin-3.0.0-SNAPSHOT.jar
to org.apache.maven.plugins/maven-ear-plugin/3.0.0-SNAPSHOT/maven-ear-plugin-3.0.0-SNAPSHOT.jar
[JENKINS] Archiving F:\jenkins\jenkins-slave\workspace\maven-plugins-windows\maven-invoker-plugin\pom.xml
to org.apache.maven.plugins/maven-invoker-plugin/3.0.2-SNAPSHOT/maven-invoker-plugin-3.0.2-SNAPSHOT.pom
[JENKINS] Archiving F:\jenkins\jenkins-slave\workspace\maven-plugins-windows\maven-invoker-plugin\target\maven-invoker-plugin-3.0.2-SNAPSHOT.jar
to org.apache.maven.plugins/maven-invoker-plugin/3.0.2-SNAPSHOT/maven-invoker-plugin-3.0.2-SNAPSHOT.jar
[JENKINS] Archiving F:\jenkins\jenkins-slave\workspace\maven-plugins-windows\maven-jdeps-plugin\pom.xml
to org.apache.maven.plugins/maven-jdeps-plugin/3.1.1-SNAPSHOT/maven-jdeps-plugin-3.1.1-SNAPSHOT.pom
[JENKINS] Archiving F:\jenkins\jenkins-slave\workspace\maven-plugins-windows\maven-jdeps-plugin\target\maven-jdeps-plugin-3.1.1-SNAPSHOT.jar
to org.apache.maven.plugins/maven-jdeps-plugin/3.1.1-SNAPSHOT/maven-jdeps-plugin-3.1.1-SNAPSHOT.jar
[JENKINS] Archiving F:\jenkins\jenkins-slave\workspace\maven-plugins-windows\maven-doap-plugin\pom.xml
to org.apache.maven.plugins/maven-doap-plugin/1.3-SNAPSHOT/maven-doap-plugin-1.3-SNAPSHOT.pom
[JENKINS] Archiving F:\jenkins\jenkins-slave\workspace\maven-plugins-windows\maven-doap-plugin\target\maven-doap-plugin-1.3-SNAPSHOT.jar
to org.apache.maven.plugins/maven-doap-plugin/1.3-SNAPSHOT/maven-doap-plugin-1.3-SNAPSHOT.jar
[JENKINS] Archiving F:\jenkins\jenkins-slave\workspace\maven-plugins-windows\maven-site-plugin\dependency-reduced-pom.xml
to org.apache.maven.plugins/maven-site-plugin/3.7-SNAPSHOT/maven-site-plugin-3.7-SNAPSHOT.pom
[JENKINS] Archiving F:\jenkins\jenkins-slave\workspace\maven-plugins-windows\maven-site-plugin\target\maven-site-plugin-3.7-SNAPSHOT.jar
to org.apache.maven.plugins/maven-site-plugin/3.7-SNAPSHOT/maven-site-plugin-3.7-SNAPSHOT.jar
[JENKINS] Archiving F:\jenkins\jenkins-slave\workspace\maven-plugins-windows\maven-changes-plugin\pom.xml
to org.apache.maven.plugins/maven-changes-plugin/3.0.0-SNAPSHOT/maven-changes-plugin-3.0.0-SNAPSHOT.pom
[JENKINS] Archiving F:\jenkins\jenkins-slave\workspace\maven-plugins-windows\maven-changes-plugin\target\maven-changes-plugin-3.0.0-SNAPSHOT.jar
to org.apache.maven.plugins/maven-changes-plugin/3.0.0-SNAPSHOT/maven-changes-plugin-3.0.0-SNAPSHOT.jar
[JENKINS] Archiving F:\jenkins\jenkins-slave\workspace\maven-plugins-windows\maven-deploy-plugin\pom.xml
to org.apache.maven.plugins/maven-deploy-plugin/3.0.0-SNAPSHOT/maven-deploy-plugin-3.0.0-SNAPSHOT.pom
[JENKINS] Archiving F:\jenkins\jenkins-slave\workspace\maven-plugins-windows\maven-deploy-plugin\target\maven-deploy-plugin-3.0.0-SNAPSHOT.jar
to org.apache.maven.plugins/maven-deploy-plugin/3.0.0-SNAPSHOT/maven-deploy-plugin-3.0.0-SNAPSHOT.jar
[JENKINS] Archiving F:\jenkins\jenkins-slave\workspace\maven-plugins-windows\maven-repository-plugin\pom.xml
to org.apache.maven.plugins/maven-repository-plugin/2.5-SNAPSHOT/maven-repository-plugin-2.5-SNAPSHOT.pom
[JENKINS] Archiving F:\jenkins\jenkins-slave\workspace\maven-plugins-windows\maven-repository-plugin\target\maven-repository-plugin-2.5-SNAPSHOT.jar
to org.apache.maven.plugins/maven-repository-plugin/2.5-SNAPSHOT/maven-repository-plugin-2.5-SNAPSHOT.jar
[JENKINS] Archiving F:\jenkins\jenkins-slave\workspace\maven-plugins-windows\maven-source-plugin\pom.xml
to org.apache.maven.plugins/maven-source-plugin/3.0.2-SNAPSHOT/maven-source-plugin-3.0.2-SNAPSHOT.pom
[JENKINS] Archiving F:\jenkins\jenkins-slave\workspace\maven-plugins-windows\maven-source-plugin\target\maven-source-plugin-3.0.2-SNAPSHOT.jar
to org.apache.maven.plugins/maven-source-plugin/3.0.2-SNAPSHOT/maven-source-plugin-3.0.2-SNAPSHOT.jar
[JENKINS] Archiving F:\jenkins\jenkins-slave\workspace\maven-plugins-windows\maven-pdf-plugin\pom.xml
to org.apache.maven.plugins/maven-pdf-plugin/1.4-SNAPSHOT/maven-pdf-plugin-1.4-SNAPSHOT.pom
[JENKINS] Archiving F:\jenkins\jenkins-slave\workspace\maven-plugins-windows\maven-pdf-plugin\target\maven-pdf-plugin-1.4-SNAPSHOT.jar
to org.apache.maven.plugins/maven-pdf-plugin/1.4-SNAPSHOT/maven-pdf-plugin-1.4-SNAPSHOT.jar
[JENKINS] Archiving F:\jenkins\jenkins-slave\workspace\maven-plugins-windows\maven-jar-plugin\pom.xml
to org.apache.maven.plugins/maven-jar-plugin/3.0.3-SNAPSHOT/maven-jar-plugin-3.0.3-SNAPSHOT.pom
[JENKINS] Archiving F:\jenkins\jenkins-slave\workspace\maven-plugins-windows\maven-jar-plugin\target\maven-jar-plugin-3.0.3-SNAPSHOT.jar
to org.apache.maven.plugins/maven-jar-plugin/3.0.3-SNAPSHOT/maven-jar-plugin-3.0.3-SNAPSHOT.jar
[JENKINS] Archiving F:\jenkins\jenkins-slave\workspace\maven-plugins-windows\maven-javadoc-plugin\pom.xml
to org.apache.maven.plugins/maven-javadoc-plugin/3.0.1-SNAPSHOT/maven-javadoc-plugin-3.0.1-SNAPSHOT.pom
[JENKINS] Archiving F:\jenkins\jenkins-slave\workspace\maven-plugins-windows\maven-javadoc-plugin\target\maven-javadoc-plugin-3.0.1-SNAPSHOT.jar
to org.apache.maven.plugins/maven-javadoc-plugin/3.0.1-SNAPSHOT/maven-javadoc-plugin-3.0.1-SNAPSHOT.jar
[Fast Archiver] Compressed 421.11 KB of artifacts by 38.0% relative to #2123
[JENKINS] Archiving F:\jenkins\jenkins-slave\workspace\maven-plugins-windows\maven-dependency-plugin\pom.xml
to org.apache.maven.plugins/maven-dependency-plugin/3.0.3-SNAPSHOT/maven-dependency-plugin-3.0.3-SNAPSHOT.pom
[JENKINS] Archiving F:\jenkins\jenkins-slave\workspace\maven-plugins-windows\maven-dependency-plugin\target\maven-dependency-plugin-3.0.3-SNAPSHOT.jar
to org.apache.maven.plugins/maven-dependency-plugin/3.0.3-SNAPSHOT/maven-dependency-plugin-3.0.3-SNAPSHOT.jar
[JENKINS] Archiving F:\jenkins\jenkins-slave\workspace\maven-plugins-windows\maven-rar-plugin\pom.xml
to org.apache.maven.plugins/maven-rar-plugin/3.0.0-SNAPSHOT/maven-rar-plugin-3.0.0-SNAPSHOT.pom
[JENKINS] Archiving F:\jenkins\jenkins-slave\workspace\maven-plugins-windows\maven-rar-plugin\target\maven-rar-plugin-3.0.0-SNAPSHOT.jar
to org.apache.maven.plugins/maven-rar-plugin/3.0.0-SNAPSHOT/maven-rar-plugin-3.0.0-SNAPSHOT.jar
[JENKINS] Archiving F:\jenkins\jenkins-slave\workspace\maven-plugins-windows\maven-checkstyle-plugin\pom.xml
to org.apache.maven.plugins/maven-checkstyle-plugin/3.0.0-SNAPSHOT/maven-checkstyle-plugin-3.0.0-SNAPSHOT.pom
[JENKINS] Archiving F:\jenkins\jenkins-slave\workspace\maven-plugins-windows\maven-checkstyle-plugin\target\maven-checkstyle-plugin-3.0.0-SNAPSHOT.jar
to org.apache.maven.plugins/maven-checkstyle-plugin/3.0.0-SNAPSHOT/maven-checkstyle-plugin-3.0.0-SNAPSHOT.jar
Sending e-mails to: notifications@maven.apache.org
channel stopped
Java HotSpot(TM) 64-Bit Server VM warning: ignoring option MaxPermSize=512m; support was removed
in 8.0
[WARNINGS] Skipping publisher since build result is FAILURE

Mime
View raw message