maven-notifications mailing list archives

Site index · List index
Message view « Date » · « Thread »
Top « Date » · « Thread »
From Apache Jenkins Server <jenk...@builds.apache.org>
Subject Build unstable in Jenkins: Maven TLP » maven-archiver » MSHARED-668-test #4
Date Wed, 27 Dec 2017 12:31:18 GMT
See https://builds.apache.org/job/maven-box/job/maven-archiver/job/MSHARED-668-test/4/

No changes.

1 tests failed.
FAILED:  org.apache.maven.archiver.MavenArchiverTest.testRecreation

Error Message:
expected:<1514377867000> but was:<1514377807000>

Stack Trace:
java.lang.AssertionError: expected:<1514377867000> but was:<1514377807000>
	at org.apache.maven.archiver.MavenArchiverTest.testRecreation(MavenArchiverTest.java:248)




Build log:
[...truncated 152.56 KB...]
[linux-jdk9] Class-Path:
[linux-jdk9] lib/dummy1-1.0.jar lib/dummy2-1.5.jar lib/dummy3-2.0.jar
[linux-jdk9] [INFO] Building jar: /home/jenkins/jenkins-slave/workspace/n-archiver_MSHARED-668-test-WG4DQP6EJS2N73J3VGM2JH6SMRRHF477RDRLQRWF4WAHIMWMG5OA/m/target/test/dummy-custom-layout-simple.jar
[linux-jdk9] Class-Path:
[linux-jdk9] lib/dummy1-1.0.jar lib/dummy2-1.5.jar lib/dummy3-2.0.jar
[linux-jdk9] Class-Path:
[linux-jdk9] lib/org/apache/dummy/dummy1/1.0.1/dummy1-1.0.jar lib/org/apache/dummy/foo/dummy2/1.5/dummy2-1.5.jar
lib/org/apache/dummy/bar/dummy3/2.0/dummy3-2.0.jar
[linux-jdk9] [INFO] Building jar: /home/jenkins/jenkins-slave/workspace/n-archiver_MSHARED-668-test-WG4DQP6EJS2N73J3VGM2JH6SMRRHF477RDRLQRWF4WAHIMWMG5OA/m/target/test/dummy-custom-layout-repo.jar
[linux-jdk9] Class-Path:
[linux-jdk9] lib/org/apache/dummy/dummy1/1.0.1/dummy1-1.0.jar lib/org/apache/dummy/foo/dummy2/1.5/dummy2-1.5.jar
lib/org/apache/dummy/bar/dummy3/2.0/dummy3-2.0.jar
[linux-jdk9] Class-Path:
[linux-jdk9] org/apache/dummy/dummy1/1.0.1/dummy1-1.0.jar org/apache/dummy/foo/dummy2/1.5/dummy2-1.5.jar
org/apache/dummy/bar/dummy3/2.0/dummy3-2.0.jar
[linux-jdk9] [INFO] Building jar: /home/jenkins/jenkins-slave/workspace/n-archiver_MSHARED-668-test-WG4DQP6EJS2N73J3VGM2JH6SMRRHF477RDRLQRWF4WAHIMWMG5OA/m/target/test/dummy.jar
[linux-jdk9] Class-Path:
[linux-jdk9] org/apache/dummy/dummy1/1.0.1/dummy1-1.0.jar org/apache/dummy/foo/dummy2/1.5/dummy2-1.5.jar
org/apache/dummy/bar/dummy3/2.0/dummy3-2.0.jar
[linux-jdk9] Class-Path:
[linux-jdk9] lib/dummy1-1.0.1.jar lib/dummy2-1.5.jar lib/dummy3-2.0.jar
[linux-jdk9] [INFO] Building jar: /home/jenkins/jenkins-slave/workspace/n-archiver_MSHARED-668-test-WG4DQP6EJS2N73J3VGM2JH6SMRRHF477RDRLQRWF4WAHIMWMG5OA/m/target/test/dummy-custom-layout-simple-non-unique.jar
[linux-jdk9] Class-Path:
[linux-jdk9] lib/dummy1-1.0.1.jar lib/dummy2-1.5.jar lib/dummy3-2.0.jar
[linux-jdk9] Class-Path:
[linux-jdk9] maven-archiver-test-17685844326495523775.jar
[linux-jdk9] [INFO] Building jar: /home/jenkins/jenkins-slave/workspace/n-archiver_MSHARED-668-test-WG4DQP6EJS2N73J3VGM2JH6SMRRHF477RDRLQRWF4WAHIMWMG5OA/m/target/test/dummy.jar
[linux-jdk9] [INFO] Building jar: /home/jenkins/jenkins-slave/workspace/n-archiver_MSHARED-668-test-WG4DQP6EJS2N73J3VGM2JH6SMRRHF477RDRLQRWF4WAHIMWMG5OA/m/target/test/dummy.jar
[linux-jdk9] Class-Path:
[linux-jdk9] dummy1-1.1-20081022.112233-1.jar dummy2-1.5.jar dummy3-2.0.jar
[linux-jdk9] [INFO] Building jar: /home/jenkins/jenkins-slave/workspace/n-archiver_MSHARED-668-test-WG4DQP6EJS2N73J3VGM2JH6SMRRHF477RDRLQRWF4WAHIMWMG5OA/m/target/test/dummy.jar
[linux-jdk9] [ERROR] Tests run: 27, Failures: 1, Errors: 0, Skipped: 0, Time elapsed: 1.132
s <<< FAILURE! - in org.apache.maven.archiver.MavenArchiverTest
[linux-jdk9] [ERROR] testRecreation(org.apache.maven.archiver.MavenArchiverTest)  Time elapsed:
0.47 s  <<< FAILURE!
[linux-jdk9] java.lang.AssertionError: expected:<1514377867000> but was:<1514377807000>
[linux-jdk9] 	at org.apache.maven.archiver.MavenArchiverTest.testRecreation(MavenArchiverTest.java:248)
[linux-jdk9] 
[linux-jdk9] [INFO] 
[linux-jdk9] [INFO] Results:
[linux-jdk9] [INFO] 
[linux-jdk9] [ERROR] Failures: 
[linux-jdk9] [ERROR]   MavenArchiverTest.testRecreation:248 expected:<1514377867000>
but was:<1514377807000>
[linux-jdk9] [INFO] 
[linux-jdk9] [ERROR] Tests run: 34, Failures: 1, Errors: 0, Skipped: 0
[linux-jdk9] [INFO] 
[linux-jdk9] [ERROR] There are test failures.
[linux-jdk9] 
[linux-jdk9] Please refer to /home/jenkins/jenkins-slave/workspace/n-archiver_MSHARED-668-test-WG4DQP6EJS2N73J3VGM2JH6SMRRHF477RDRLQRWF4WAHIMWMG5OA/m/target/surefire-reports
for the individual test results.
[linux-jdk9] Please refer to dump files (if any exist) [date]-jvmRun[N].dump, [date].dumpstream
and [date]-jvmRun[N].dumpstream.
[linux-jdk9] [INFO] 
[linux-jdk9] [INFO] --- maven-jar-plugin:3.0.0:jar (default-jar) @ maven-archiver ---
[linux-jdk9] [INFO] Building jar: /home/jenkins/jenkins-slave/workspace/n-archiver_MSHARED-668-test-WG4DQP6EJS2N73J3VGM2JH6SMRRHF477RDRLQRWF4WAHIMWMG5OA/m/target/maven-archiver-3.2.1-SNAPSHOT.jar
[windows-jdk9] [INFO] 
[windows-jdk9] [INFO] --- maven-resources-plugin:2.7:testResources (default-testResources)
@ maven-archiver ---
[windows-jdk9] [INFO] Using 'UTF-8' encoding to copy filtered resources.
[windows-jdk9] [INFO] Copying 7 resources
[windows-jdk9] [INFO] Copying 3 resources
[windows-jdk9] [INFO] 
[windows-jdk9] [INFO] --- maven-compiler-plugin:3.5.1:testCompile (default-testCompile) @
maven-archiver ---
[windows-jdk9] [INFO] Changes detected - recompiling the module!
[windows-jdk9] [INFO] Compiling 4 source files to f:\jenkins\jenkins-slave\workspace\n-archiver_MSHARED-668-test-WG4DQP6EJS2N73J3VGM2JH6SMRRHF477RDRLQRWF4WAHIMWMG5OA\m\target\test-classes
[windows-jdk9] [INFO] /F:/jenkins/jenkins-slave/workspace/n-archiver_MSHARED-668-test-WG4DQP6EJS2N73J3VGM2JH6SMRRHF477RDRLQRWF4WAHIMWMG5OA/m/src/test/java/org/apache/maven/archiver/MockArtifact.java:
Some input files use or override a deprecated API.
[windows-jdk9] [INFO] /F:/jenkins/jenkins-slave/workspace/n-archiver_MSHARED-668-test-WG4DQP6EJS2N73J3VGM2JH6SMRRHF477RDRLQRWF4WAHIMWMG5OA/m/src/test/java/org/apache/maven/archiver/MockArtifact.java:
Recompile with -Xlint:deprecation for details.
[windows-jdk9] [INFO] 
[windows-jdk9] [INFO] --- maven-surefire-plugin:2.20.1:test (default-test) @ maven-archiver
---
[windows-jdk9] [INFO] 
[windows-jdk9] [INFO] -------------------------------------------------------
[windows-jdk9] [INFO]  T E S T S
[windows-jdk9] [INFO] -------------------------------------------------------
[Pipeline] [linux-jdk7] }
[Pipeline] [windows-jdk8] }
[windows-jdk8] [withMaven] Skip 'Generated Artifacts Publisher' disabled by configuration
[windows-jdk8] [withMaven] junitPublisher - Archive test results for Maven artifact org.apache.maven:maven-archiver:3.2.1-SNAPSHOT
generated by maven-surefire-plugin:test (default-test): m\target\surefire-reports\*.xml
[windows-jdk8] [withMaven] junitPublisher - Jenkins JUnit Attachments Plugin not found, can't
publish test attachments.Recording test results
[windows-jdk8] [withMaven] Skip 'Findbugs Publisher' disabled by configuration
[windows-jdk8] [withMaven] Skip 'Open Task Scanner Publisher' disabled by configuration
[Pipeline] [linux-jdk8] }
[linux-jdk8] [withMaven] Skip 'Generated Artifacts Publisher' disabled by configuration
[linux-jdk8] [withMaven] junitPublisher - Archive test results for Maven artifact org.apache.maven:maven-archiver:3.2.1-SNAPSHOT
generated by maven-surefire-plugin:test (default-test): m/target/surefire-reports/*.xml
[linux-jdk8] [withMaven] junitPublisher - Jenkins JUnit Attachments Plugin not found, can't
publish test attachments.Recording test results
[linux-jdk8] [withMaven] Skip 'Findbugs Publisher' disabled by configuration
[linux-jdk8] [withMaven] Skip 'Open Task Scanner Publisher' disabled by configuration
[Pipeline] [linux-jdk7] // node
[Pipeline] [windows-jdk8] // withMaven
[Pipeline] [linux-jdk8] // withMaven
[Pipeline] [linux-jdk7] }
[Pipeline] [windows-jdk8] }
[Pipeline] [linux-jdk8] }
[Pipeline] [windows-jdk8] // stage
[Pipeline] [linux-jdk8] // stage
[Pipeline] [linux-jdk8] }
[Pipeline] [windows-jdk8] }
[Pipeline] [linux-jdk8] // node
[Pipeline] [windows-jdk8] // node
[Pipeline] [linux-jdk8] }
[Pipeline] [windows-jdk8] }
[linux-jdk9] [INFO] 
[linux-jdk9] [INFO] --- maven-site-plugin:3.5.1:attach-descriptor (attach-descriptor) @ maven-archiver
---
[windows-jdk9] [INFO] Running org.apache.maven.archiver.ManifestConfigurationTest
[windows-jdk9] [INFO] Tests run: 4, Failures: 0, Errors: 0, Skipped: 0, Time elapsed: 0.195
s - in org.apache.maven.archiver.ManifestConfigurationTest
[windows-jdk9] [INFO] Running org.apache.maven.archiver.MavenArchiveConfigurationTest
[windows-jdk9] [INFO] Tests run: 3, Failures: 0, Errors: 0, Skipped: 0, Time elapsed: 0 s
- in org.apache.maven.archiver.MavenArchiveConfigurationTest
[windows-jdk9] [INFO] Running org.apache.maven.archiver.MavenArchiverTest
[windows-jdk9] [INFO] Building jar: f:\jenkins\jenkins-slave\workspace\n-archiver_MSHARED-668-test-WG4DQP6EJS2N73J3VGM2JH6SMRRHF477RDRLQRWF4WAHIMWMG5OA\m\target\test\dummy.jar
[linux-jdk9] [INFO] 
[linux-jdk9] [INFO] --- maven-checkstyle-plugin:2.15:check (checkstyle-check) @ maven-archiver
---
[windows-jdk9] [INFO] Building jar: f:\jenkins\jenkins-slave\workspace\n-archiver_MSHARED-668-test-WG4DQP6EJS2N73J3VGM2JH6SMRRHF477RDRLQRWF4WAHIMWMG5OA\m\target\test\dummy.jar
[windows-jdk9] Class-Path:
[windows-jdk9] lib/dummy1-1.0.jar lib/dummy2-1.5.jar lib/dummy3-2.0.jar
[windows-jdk9] [INFO] Building jar: f:\jenkins\jenkins-slave\workspace\n-archiver_MSHARED-668-test-WG4DQP6EJS2N73J3VGM2JH6SMRRHF477RDRLQRWF4WAHIMWMG5OA\m\target\test\dummy-defaults.jar
[windows-jdk9] Class-Path:
[windows-jdk9] lib/dummy1-1.0.jar lib/dummy2-1.5.jar lib/dummy3-2.0.jar
[windows-jdk9] Class-Path:
[windows-jdk9] lib/dummy1-1.0.jar lib/dummy2-1.5.jar lib/dummy3-2.0.jar
[windows-jdk9] [INFO] Building jar: f:\jenkins\jenkins-slave\workspace\n-archiver_MSHARED-668-test-WG4DQP6EJS2N73J3VGM2JH6SMRRHF477RDRLQRWF4WAHIMWMG5OA\m\target\test\dummy-explicit-simple.jar
[windows-jdk9] Class-Path:
[windows-jdk9] lib/dummy1-1.0.jar lib/dummy2-1.5.jar lib/dummy3-2.0.jar
[windows-jdk9] Class-Path:
[windows-jdk9] org/apache/dummy/dummy1/1.0/TEST-dummy1-1.0.jar org/apache/dummy/foo/dummy2/1.5/TEST-dummy2-1.5.jar
org/apache/dummy/bar/dummy3/2.0/TEST-dummy3-2.0.jar
[windows-jdk9] [INFO] Building jar: f:\jenkins\jenkins-slave\workspace\n-archiver_MSHARED-668-test-WG4DQP6EJS2N73J3VGM2JH6SMRRHF477RDRLQRWF4WAHIMWMG5OA\m\target\test\dummy.jar
[windows-jdk9] Class-Path:
[windows-jdk9] org/apache/dummy/dummy1/1.0/TEST-dummy1-1.0.jar org/apache/dummy/foo/dummy2/1.5/TEST-dummy2-1.5.jar
org/apache/dummy/bar/dummy3/2.0/TEST-dummy3-2.0.jar
[windows-jdk9] [INFO] Building jar: f:\jenkins\jenkins-slave\workspace\n-archiver_MSHARED-668-test-WG4DQP6EJS2N73J3VGM2JH6SMRRHF477RDRLQRWF4WAHIMWMG5OA\m\target\test\dummy.jar
[windows-jdk9] Class-Path:
[windows-jdk9] org/apache/dummy/dummy1/1.1-SNAPSHOT/TEST-dummy1-1.1-SNAPSHOT.jar org/apache/dummy/foo/dummy2/1.5/TEST-dummy2-1.5.jar
org/apache/dummy/bar/dummy3/2.0/TEST-dummy3-2.0.jar
[windows-jdk9] [INFO] Building jar: f:\jenkins\jenkins-slave\workspace\n-archiver_MSHARED-668-test-WG4DQP6EJS2N73J3VGM2JH6SMRRHF477RDRLQRWF4WAHIMWMG5OA\m\target\test\dummy.jar
[windows-jdk9] Class-Path:
[windows-jdk9] org/apache/dummy/dummy1/1.1-SNAPSHOT/TEST-dummy1-1.1-SNAPSHOT.jar org/apache/dummy/foo/dummy2/1.5/TEST-dummy2-1.5.jar
org/apache/dummy/bar/dummy3/2.0/TEST-dummy3-2.0.jar
[windows-jdk9] [INFO] Building jar: f:\jenkins\jenkins-slave\workspace\n-archiver_MSHARED-668-test-WG4DQP6EJS2N73J3VGM2JH6SMRRHF477RDRLQRWF4WAHIMWMG5OA\m\target\test\dummy.jar
[windows-jdk9] [INFO] Building jar: f:\jenkins\jenkins-slave\workspace\n-archiver_MSHARED-668-test-WG4DQP6EJS2N73J3VGM2JH6SMRRHF477RDRLQRWF4WAHIMWMG5OA\m\target\test\dummy.jar
[windows-jdk9] [INFO] Building jar: f:\jenkins\jenkins-slave\workspace\n-archiver_MSHARED-668-test-WG4DQP6EJS2N73J3VGM2JH6SMRRHF477RDRLQRWF4WAHIMWMG5OA\m\target\test\dummy.jar
[windows-jdk9] Class-Path:
[windows-jdk9] org/apache/dummy/dummy1/1.1-SNAPSHOT/TEST-dummy1-1.1-20081022.112233-1.jar
org/apache/dummy/foo/dummy2/1.5/TEST-dummy2-1.5.jar org/apache/dummy/bar/dummy3/2.0/TEST-dummy3-2.0.jar
[windows-jdk9] [INFO] Building jar: f:\jenkins\jenkins-slave\workspace\n-archiver_MSHARED-668-test-WG4DQP6EJS2N73J3VGM2JH6SMRRHF477RDRLQRWF4WAHIMWMG5OA\m\target\test\dummy.jar
[windows-jdk9] Class-Path:
[windows-jdk9] org/apache/dummy/dummy1/1.1-SNAPSHOT/TEST-dummy1-1.1-20081022.112233-1.jar
org/apache/dummy/foo/dummy2/1.5/TEST-dummy2-1.5.jar org/apache/dummy/bar/dummy3/2.0/TEST-dummy3-2.0.jar
[windows-jdk9] Class-Path:
[windows-jdk9] org/apache/dummy/dummy1/1.1-SNAPSHOT/dummy1-1.1-20081022.112233-1.jar org/apache/dummy/foo/dummy2/1.5/dummy2-1.5.jar
org/apache/dummy/bar/dummy3/2.0/dummy3-2.0.jar
[windows-jdk9] [INFO] Building jar: f:\jenkins\jenkins-slave\workspace\n-archiver_MSHARED-668-test-WG4DQP6EJS2N73J3VGM2JH6SMRRHF477RDRLQRWF4WAHIMWMG5OA\m\target\test\dummy.jar
[windows-jdk9] Class-Path:
[windows-jdk9] org/apache/dummy/dummy1/1.1-SNAPSHOT/dummy1-1.1-20081022.112233-1.jar org/apache/dummy/foo/dummy2/1.5/dummy2-1.5.jar
org/apache/dummy/bar/dummy3/2.0/dummy3-2.0.jar
[windows-jdk9] [INFO] Building jar: f:\jenkins\jenkins-slave\workspace\n-archiver_MSHARED-668-test-WG4DQP6EJS2N73J3VGM2JH6SMRRHF477RDRLQRWF4WAHIMWMG5OA\m\target\test\dummy.jar
[windows-jdk9] Class-Path:
[windows-jdk9] lib/org/apache/dummy/dummy1/1.0.1/dummy1-1.0.1.jar lib/org/apache/dummy/foo/dummy2/1.5/dummy2-1.5.jar
lib/org/apache/dummy/bar/dummy3/2.0/dummy3-2.0.jar
[windows-jdk9] [INFO] Building jar: f:\jenkins\jenkins-slave\workspace\n-archiver_MSHARED-668-test-WG4DQP6EJS2N73J3VGM2JH6SMRRHF477RDRLQRWF4WAHIMWMG5OA\m\target\test\dummy-custom-layout-repo-non-unique.jar
[windows-jdk9] Class-Path:
[windows-jdk9] lib/org/apache/dummy/dummy1/1.0.1/dummy1-1.0.1.jar lib/org/apache/dummy/foo/dummy2/1.5/dummy2-1.5.jar
lib/org/apache/dummy/bar/dummy3/2.0/dummy3-2.0.jar
[windows-jdk9] [INFO] Building jar: f:\jenkins\jenkins-slave\workspace\n-archiver_MSHARED-668-test-WG4DQP6EJS2N73J3VGM2JH6SMRRHF477RDRLQRWF4WAHIMWMG5OA\m\target\test\dummy.jar
[windows-jdk9] Class-Path:
[windows-jdk9] ./lib/dummy.dot-1.5.jar ./lib/dummy1-1.1-20081022.112233-1.jar ./lib/dummy2-1.5.jar
./lib/dummy3-2.0.jar
[windows-jdk9] [INFO] Building jar: f:\jenkins\jenkins-slave\workspace\n-archiver_MSHARED-668-test-WG4DQP6EJS2N73J3VGM2JH6SMRRHF477RDRLQRWF4WAHIMWMG5OA\m\target\test\dummyWithDashes.jar
[windows-jdk9] Class-Path:
[windows-jdk9] ./lib/dummy.dot-1.5.jar ./lib/dummy1-1.1-20081022.112233-1.jar ./lib/dummy2-1.5.jar
./lib/dummy3-2.0.jar
[windows-jdk9] [INFO] Building jar: f:\jenkins\jenkins-slave\workspace\n-archiver_MSHARED-668-test-WG4DQP6EJS2N73J3VGM2JH6SMRRHF477RDRLQRWF4WAHIMWMG5OA\m\target\test\dummy.jar
[windows-jdk9] Class-Path:
[windows-jdk9] dummy1-1.0.jar dummy2-1.5.jar dummy3-2.0.jar
[windows-jdk9] [INFO] Building jar: f:\jenkins\jenkins-slave\workspace\n-archiver_MSHARED-668-test-WG4DQP6EJS2N73J3VGM2JH6SMRRHF477RDRLQRWF4WAHIMWMG5OA\m\target\test\dummy.jar
[windows-jdk9] Class-Path:
[windows-jdk9] lib/dummy1-1.0.jar lib/dummy2-1.5.jar lib/dummy3-2.0.jar
[windows-jdk9] [INFO] Building jar: f:\jenkins\jenkins-slave\workspace\n-archiver_MSHARED-668-test-WG4DQP6EJS2N73J3VGM2JH6SMRRHF477RDRLQRWF4WAHIMWMG5OA\m\target\test\dummy-custom-layout-simple.jar
[windows-jdk9] Class-Path:
[windows-jdk9] lib/dummy1-1.0.jar lib/dummy2-1.5.jar lib/dummy3-2.0.jar
[windows-jdk9] Class-Path:
[windows-jdk9] lib/org/apache/dummy/dummy1/1.0.1/dummy1-1.0.jar lib/org/apache/dummy/foo/dummy2/1.5/dummy2-1.5.jar
lib/org/apache/dummy/bar/dummy3/2.0/dummy3-2.0.jar
[windows-jdk9] [INFO] Building jar: f:\jenkins\jenkins-slave\workspace\n-archiver_MSHARED-668-test-WG4DQP6EJS2N73J3VGM2JH6SMRRHF477RDRLQRWF4WAHIMWMG5OA\m\target\test\dummy-custom-layout-repo.jar
[windows-jdk9] Class-Path:
[windows-jdk9] lib/org/apache/dummy/dummy1/1.0.1/dummy1-1.0.jar lib/org/apache/dummy/foo/dummy2/1.5/dummy2-1.5.jar
lib/org/apache/dummy/bar/dummy3/2.0/dummy3-2.0.jar
[windows-jdk9] Class-Path:
[windows-jdk9] org/apache/dummy/dummy1/1.0.1/dummy1-1.0.jar org/apache/dummy/foo/dummy2/1.5/dummy2-1.5.jar
org/apache/dummy/bar/dummy3/2.0/dummy3-2.0.jar
[windows-jdk9] [INFO] Building jar: f:\jenkins\jenkins-slave\workspace\n-archiver_MSHARED-668-test-WG4DQP6EJS2N73J3VGM2JH6SMRRHF477RDRLQRWF4WAHIMWMG5OA\m\target\test\dummy.jar
[windows-jdk9] Class-Path:
[windows-jdk9] org/apache/dummy/dummy1/1.0.1/dummy1-1.0.jar org/apache/dummy/foo/dummy2/1.5/dummy2-1.5.jar
org/apache/dummy/bar/dummy3/2.0/dummy3-2.0.jar
[windows-jdk9] Class-Path:
[windows-jdk9] lib/dummy1-1.0.1.jar lib/dummy2-1.5.jar lib/dummy3-2.0.jar
[windows-jdk9] [INFO] Building jar: f:\jenkins\jenkins-slave\workspace\n-archiver_MSHARED-668-test-WG4DQP6EJS2N73J3VGM2JH6SMRRHF477RDRLQRWF4WAHIMWMG5OA\m\target\test\dummy-custom-layout-simple-non-unique.jar
[windows-jdk9] Class-Path:
[windows-jdk9] lib/dummy1-1.0.1.jar lib/dummy2-1.5.jar lib/dummy3-2.0.jar
[windows-jdk9] Class-Path:
[windows-jdk9] maven-archiver-test-15197317716237486164.jar
[windows-jdk9] [INFO] Building jar: f:\jenkins\jenkins-slave\workspace\n-archiver_MSHARED-668-test-WG4DQP6EJS2N73J3VGM2JH6SMRRHF477RDRLQRWF4WAHIMWMG5OA\m\target\test\dummy.jar
[windows-jdk9] [INFO] Building jar: f:\jenkins\jenkins-slave\workspace\n-archiver_MSHARED-668-test-WG4DQP6EJS2N73J3VGM2JH6SMRRHF477RDRLQRWF4WAHIMWMG5OA\m\target\test\dummy.jar
[windows-jdk9] Class-Path:
[windows-jdk9] dummy1-1.1-20081022.112233-1.jar dummy2-1.5.jar dummy3-2.0.jar
[windows-jdk9] [INFO] Building jar: f:\jenkins\jenkins-slave\workspace\n-archiver_MSHARED-668-test-WG4DQP6EJS2N73J3VGM2JH6SMRRHF477RDRLQRWF4WAHIMWMG5OA\m\target\test\dummy.jar
[windows-jdk9] [INFO] Tests run: 27, Failures: 0, Errors: 0, Skipped: 0, Time elapsed: 1.248
s - in org.apache.maven.archiver.MavenArchiverTest
[windows-jdk9] [INFO] 
[windows-jdk9] [INFO] Results:
[windows-jdk9] [INFO] 
[windows-jdk9] [INFO] Tests run: 34, Failures: 0, Errors: 0, Skipped: 0
[windows-jdk9] [INFO] 
[windows-jdk9] [INFO] 
[windows-jdk9] [INFO] --- maven-jar-plugin:3.0.0:jar (default-jar) @ maven-archiver ---
[windows-jdk9] [INFO] Building jar: f:\jenkins\jenkins-slave\workspace\n-archiver_MSHARED-668-test-WG4DQP6EJS2N73J3VGM2JH6SMRRHF477RDRLQRWF4WAHIMWMG5OA\m\target\maven-archiver-3.2.1-SNAPSHOT.jar
[linux-jdk9] [INFO] There is 1 error reported by Checkstyle 6.1.1 with config/maven_checks.xml
ruleset.
[linux-jdk9] [INFO] Ignored 1 error, 0 violation remaining.
[linux-jdk9] [INFO] ------------------------------------------------------------------------
[linux-jdk9] [INFO] BUILD SUCCESS
[linux-jdk9] [INFO] ------------------------------------------------------------------------
[linux-jdk9] [INFO] Total time: 22.037 s
[linux-jdk9] [INFO] Finished at: 2017-12-27T12:31:14Z
[windows-jdk9] [INFO] 
[windows-jdk9] [INFO] --- maven-site-plugin:3.5.1:attach-descriptor (attach-descriptor) @
maven-archiver ---
[windows-jdk9] [INFO] 
[windows-jdk9] [INFO] --- maven-checkstyle-plugin:2.15:check (checkstyle-check) @ maven-archiver
---
[linux-jdk9] [INFO] Final Memory: 32M/108M
[linux-jdk9] [INFO] ------------------------------------------------------------------------
[linux-jdk9] [WARNING] The requested profile "run-its" could not be activated because it does
not exist.
[linux-jdk9] [INFO] [jenkins-event-spy] Generated /home/jenkins/jenkins-slave/workspace/n-archiver_MSHARED-668-test-WG4DQP6EJS2N73J3VGM2JH6SMRRHF477RDRLQRWF4WAHIMWMG5OA@tmp/withMavencad91bdd/maven-spy-20171227-123051-8478094056335601445340.log
[Pipeline] [linux-jdk9] }
[Pipeline] [linux-jdk9] // dir
[Pipeline] [linux-jdk9] }
[linux-jdk9] [withMaven] Skip 'Generated Artifacts Publisher' disabled by configuration
[linux-jdk9] [withMaven] junitPublisher - Archive test results for Maven artifact org.apache.maven:maven-archiver:3.2.1-SNAPSHOT
generated by maven-surefire-plugin:test (default-test): m/target/surefire-reports/*.xml
[linux-jdk9] [withMaven] junitPublisher - Jenkins JUnit Attachments Plugin not found, can't
publish test attachments.Recording test results
[linux-jdk9] [withMaven] Skip 'Findbugs Publisher' disabled by configuration
[linux-jdk9] [withMaven] Skip 'Open Task Scanner Publisher' disabled by configuration
[Pipeline] [linux-jdk9] // withMaven
[windows-jdk9] [INFO] There is 1 error reported by Checkstyle 6.1.1 with config/maven_checks.xml
ruleset.
[windows-jdk9] [INFO] Ignored 1 error, 0 violation remaining.
[windows-jdk9] [INFO] ------------------------------------------------------------------------
[windows-jdk9] [INFO] BUILD SUCCESS
[windows-jdk9] [INFO] ------------------------------------------------------------------------
[windows-jdk9] [INFO] Total time: 17.892 s
[windows-jdk9] [INFO] Finished at: 2017-12-27T12:31:15Z
[Pipeline] [linux-jdk9] }
[Pipeline] [linux-jdk9] // stage
[Pipeline] [linux-jdk9] }
[Pipeline] [linux-jdk9] // node
[Pipeline] [linux-jdk9] }
[windows-jdk9] [INFO] Final Memory: 29M/97M
[windows-jdk9] [INFO] ------------------------------------------------------------------------
[windows-jdk9] [WARNING] The requested profile "run-its" could not be activated because it
does not exist.
[windows-jdk9] [INFO] [jenkins-event-spy] Generated F:\jenkins\jenkins-slave\workspace\n-archiver_MSHARED-668-test-WG4DQP6EJS2N73J3VGM2JH6SMRRHF477RDRLQRWF4WAHIMWMG5OA@tmp\withMavenc58347ff\maven-spy-20171227-123057-406606330443686310066.log
[Pipeline] [windows-jdk9] }
[Pipeline] [windows-jdk9] // dir
[Pipeline] [windows-jdk9] }
[windows-jdk9] [withMaven] Skip 'Generated Artifacts Publisher' disabled by configuration
[windows-jdk9] [withMaven] junitPublisher - Archive test results for Maven artifact org.apache.maven:maven-archiver:3.2.1-SNAPSHOT
generated by maven-surefire-plugin:test (default-test): m\target\surefire-reports\*.xml
[windows-jdk9] [withMaven] junitPublisher - Jenkins JUnit Attachments Plugin not found, can't
publish test attachments.Recording test results
[windows-jdk9] [withMaven] Skip 'Findbugs Publisher' disabled by configuration
[windows-jdk9] [withMaven] Skip 'Open Task Scanner Publisher' disabled by configuration
[Pipeline] [windows-jdk9] // withMaven
[Pipeline] [windows-jdk9] }
[Pipeline] [windows-jdk9] // stage
[Pipeline] [windows-jdk9] }
[Pipeline] [windows-jdk9] // node
[Pipeline] [windows-jdk9] }
[Pipeline] // parallel
[Pipeline] stage
[Pipeline] { (Notifications)
[Pipeline] echo
Build result: UNSTABLE
[Pipeline] jiraIssueSelector
[Pipeline] emailext
Mime
  • Unnamed multipart/mixed (inline, None, 0 bytes)
View raw message