maven-notifications mailing list archives

Site index · List index
Message view « Date » · « Thread »
Top « Date » · « Thread »
From Apache Jenkins Server <jenk...@builds.apache.org>
Subject Build unstable in Jenkins: Maven TLP » maven-dependency-analyzer » MSHARED-674_Detect_Java_8_type_annotations #1
Date Thu, 04 Jan 2018 11:30:06 GMT
See https://builds.apache.org/job/maven-box/job/maven-dependency-analyzer/job/MSHARED-674_Detect_Java_8_type_annotations/1/

No changes.

2 tests failed.
FAILED:  org.apache.maven.shared.dependency.analyzer.DefaultProjectDependencyAnalyzerTest.testTypeUseAnnotationDependency

Error Message:
got: <false>, expected: is <true>

Stack Trace:
org.junit.AssumptionViolatedException: got: <false>, expected: is <true>
	at org.junit.Assume.assumeThat(Assume.java:95)
	at org.junit.Assume.assumeTrue(Assume.java:41)
	at org.apache.maven.shared.dependency.analyzer.DefaultProjectDependencyAnalyzerTest.testTypeUseAnnotationDependency(DefaultProjectDependencyAnalyzerTest.java:310)


FAILED:  org.apache.maven.shared.dependency.analyzer.DefaultProjectDependencyAnalyzerTest.testTypeUseAnnotationDependency

Error Message:
got: <false>, expected: is <true>

Stack Trace:
org.junit.AssumptionViolatedException: got: <false>, expected: is <true>
	at org.junit.Assume.assumeThat(Assume.java:95)
	at org.junit.Assume.assumeTrue(Assume.java:41)
	at org.apache.maven.shared.dependency.analyzer.DefaultProjectDependencyAnalyzerTest.testTypeUseAnnotationDependency(DefaultProjectDependencyAnalyzerTest.java:310)




Build log:
[...truncated 1.47 MB...]
[linux-jdk9] [withMaven] Skip 'Findbugs Publisher' disabled by configuration
[linux-jdk9] [withMaven] Skip 'Open Task Scanner Publisher' disabled by configuration
[linux-jdk9] [withMaven] Skip 'Generated Artifacts Publisher' disabled by configuration
[linux-jdk9] [withMaven] junitPublisher - Archive test results for Maven artifact org.apache.maven.shared.dependency-analyzer.tests:jarWithTestDependency1:1.0
generated by maven-surefire-plugin:test (default-test): m/target/test-classes/jarWithTestDependency/project1/target/surefire-reports/*.xml
[linux-jdk9] [withMaven] junitPublisher - Jenkins JUnit Attachments Plugin not found, can't
publish test attachments.Recording test results
[linux-jdk9] None of the test reports contained any result
[linux-jdk9] [withMaven] junitPublisher - Archive test results for Maven artifact org.apache.maven.shared.dependency-analyzer.tests:jarWithTestDependency2:1.0
generated by maven-surefire-plugin:test (default-test): m/target/test-classes/jarWithTestDependency/project2/target/surefire-reports/*.xml
[linux-jdk9] [withMaven] junitPublisher - Jenkins JUnit Attachments Plugin not found, can't
publish test attachments.Recording test results
[linux-jdk9] None of the test reports contained any result
[linux-jdk9] [withMaven] Skip 'Findbugs Publisher' disabled by configuration
[linux-jdk9] [withMaven] Skip 'Open Task Scanner Publisher' disabled by configuration
[linux-jdk9] [withMaven] Skip 'Generated Artifacts Publisher' disabled by configuration
[linux-jdk9] [withMaven] junitPublisher - Archive test results for Maven artifact org.apache.maven.shared.dependency-analyzer.tests:jarWithCompileDependency1:1.0
generated by maven-surefire-plugin:test (default-test): m/target/test-classes/jarWithCompileDependency/project1/target/surefire-reports/*.xml
[linux-jdk9] [withMaven] junitPublisher - Jenkins JUnit Attachments Plugin not found, can't
publish test attachments.Recording test results
[linux-jdk9] None of the test reports contained any result
[linux-jdk9] [withMaven] junitPublisher - Archive test results for Maven artifact org.apache.maven.shared.dependency-analyzer.tests:jarWithCompileDependency2:1.0
generated by maven-surefire-plugin:test (default-test): m/target/test-classes/jarWithCompileDependency/project2/target/surefire-reports/*.xml
[linux-jdk9] [withMaven] junitPublisher - Jenkins JUnit Attachments Plugin not found, can't
publish test attachments.Recording test results
[linux-jdk9] None of the test reports contained any result
[linux-jdk9] [withMaven] Skip 'Findbugs Publisher' disabled by configuration
[linux-jdk9] [withMaven] Skip 'Open Task Scanner Publisher' disabled by configuration
[linux-jdk9] [withMaven] Skip 'Generated Artifacts Publisher' disabled by configuration
[linux-jdk9] [withMaven] junitPublisher - Archive test results for Maven artifact org.apache.maven.shared.dependency-analyzer.tests:java8methodreferences:1.0
generated by maven-surefire-plugin:test (default-test): m/target/test-classes/java8methodRefs/target/surefire-reports/*.xml
[linux-jdk9] [withMaven] junitPublisher - Jenkins JUnit Attachments Plugin not found, can't
publish test attachments.Recording test results
[linux-jdk9] None of the test reports contained any result
[linux-jdk9] [withMaven] Skip 'Findbugs Publisher' disabled by configuration
[linux-jdk9] [withMaven] Skip 'Open Task Scanner Publisher' disabled by configuration
[linux-jdk9] [withMaven] Skip 'Generated Artifacts Publisher' disabled by configuration
[linux-jdk9] [withMaven] junitPublisher - Archive test results for Maven artifact org.apache.maven.shared.dependency-analyzer.tests:inlinedStaticReference:1.0
generated by maven-surefire-plugin:test (default-test): m/target/test-classes/inlinedStaticReference/target/surefire-reports/*.xml
[linux-jdk9] [withMaven] junitPublisher - Jenkins JUnit Attachments Plugin not found, can't
publish test attachments.Recording test results
[linux-jdk9] None of the test reports contained any result
[linux-jdk9] [withMaven] Skip 'Findbugs Publisher' disabled by configuration
[linux-jdk9] [withMaven] Skip 'Open Task Scanner Publisher' disabled by configuration
[linux-jdk9] [withMaven] Skip 'Generated Artifacts Publisher' disabled by configuration
[linux-jdk9] [withMaven] junitPublisher - Archive test results for Maven artifact org.apache.maven.shared.dependency-analyzer.tests:typeUseAnnotationDependencyAnnotation:1.0
generated by maven-surefire-plugin:test (default-test): m/target/test-classes/typeUseAnnotationDependency/annotation/target/surefire-reports/*.xml
[linux-jdk9] [withMaven] junitPublisher - Jenkins JUnit Attachments Plugin not found, can't
publish test attachments.Recording test results
[linux-jdk9] None of the test reports contained any result
[linux-jdk9] [withMaven] junitPublisher - Archive test results for Maven artifact org.apache.maven.shared.dependency-analyzer.tests:typeUseAnnotationDependencyUsage:1.0
generated by maven-surefire-plugin:test (default-test): m/target/test-classes/typeUseAnnotationDependency/usage/target/surefire-reports/*.xml
[linux-jdk9] [withMaven] junitPublisher - Jenkins JUnit Attachments Plugin not found, can't
publish test attachments.Recording test results
[linux-jdk9] None of the test reports contained any result
[linux-jdk9] [withMaven] Skip 'Findbugs Publisher' disabled by configuration
[linux-jdk9] [withMaven] Skip 'Open Task Scanner Publisher' disabled by configuration
[linux-jdk9] [withMaven] Skip 'Generated Artifacts Publisher' disabled by configuration
[linux-jdk9] [withMaven] junitPublisher - Archive test results for Maven artifact org.apache.maven.its.dependency:test-module1:1.0
generated by maven-surefire-plugin:test (default-test): m/target/test-classes/multimoduleProject/module1/target/surefire-reports/*.xml
[linux-jdk9] [withMaven] junitPublisher - Jenkins JUnit Attachments Plugin not found, can't
publish test attachments.Recording test results
[linux-jdk9] None of the test reports contained any result
[linux-jdk9] [withMaven] junitPublisher - Archive test results for Maven artifact org.apache.maven.its.dependency:test-module2:1.0
generated by maven-surefire-plugin:test (default-test): m/target/test-classes/multimoduleProject/module2/target/surefire-reports/*.xml
[linux-jdk9] [withMaven] junitPublisher - Jenkins JUnit Attachments Plugin not found, can't
publish test attachments.Recording test results
[linux-jdk9] None of the test reports contained any result
[linux-jdk9] [withMaven] Skip 'Findbugs Publisher' disabled by configuration
[linux-jdk9] [withMaven] Skip 'Open Task Scanner Publisher' disabled by configuration
[Pipeline] [linux-jdk7] // node
[Pipeline] [windows-jdk7] // withMaven
[Pipeline] [linux-jdk8] // withMaven
[Pipeline] [linux-jdk9] // withMaven
[Pipeline] [linux-jdk7] }
[Pipeline] [windows-jdk7] }
[Pipeline] [windows-jdk8] }
[Pipeline] [linux-jdk8] }
[Pipeline] [windows-jdk9] }
[Pipeline] [linux-jdk9] }
[Pipeline] [windows-jdk7] // stage
[Pipeline] [windows-jdk8] // dir
[Pipeline] [linux-jdk8] // stage
[Pipeline] [windows-jdk9] // dir
[Pipeline] [linux-jdk9] // stage
[Pipeline] [linux-jdk8] }
[Pipeline] [linux-jdk9] }
[Pipeline] [windows-jdk7] }
[Pipeline] [windows-jdk8] }
[windows-jdk8] [withMaven] Skip 'Generated Artifacts Publisher' disabled by configuration
[windows-jdk8] [withMaven] junitPublisher - Archive test results for Maven artifact org.apache.maven.shared:maven-dependency-analyzer:1.8-SNAPSHOT
generated by maven-surefire-plugin:test (default-test): m\target\surefire-reports\*.xml
[windows-jdk8] [withMaven] junitPublisher - Jenkins JUnit Attachments Plugin not found, can't
publish test attachments.Recording test results
[windows-jdk8] [withMaven] Skip 'Findbugs Publisher' disabled by configuration
[windows-jdk8] [withMaven] Skip 'Open Task Scanner Publisher' disabled by configuration
[windows-jdk8] [withMaven] Skip 'Generated Artifacts Publisher' disabled by configuration
[windows-jdk8] [withMaven] junitPublisher - Archive test results for Maven artifact org.apache.maven.shared.dependency-analyzer.tests:jarWithXercesDependencies:1.0
generated by maven-surefire-plugin:test (default-test): m\target\test-classes\jarWithXmlTransitiveDependency\target\surefire-reports\*.xml
[windows-jdk8] [withMaven] junitPublisher - Jenkins JUnit Attachments Plugin not found, can't
publish test attachments.Recording test results
[windows-jdk8] None of the test reports contained any result
[windows-jdk8] [withMaven] Skip 'Findbugs Publisher' disabled by configuration
[windows-jdk8] [withMaven] Skip 'Open Task Scanner Publisher' disabled by configuration
[windows-jdk8] [withMaven] Skip 'Generated Artifacts Publisher' disabled by configuration
[windows-jdk8] [withMaven] junitPublisher - Archive test results for Maven artifact org.apache.maven.shared.dependency-analyzer.tests:jarWithNoDependencies:1.0
generated by maven-surefire-plugin:test (default-test): m\target\test-classes\jarWithNoDependencies\target\surefire-reports\*.xml
[windows-jdk8] [withMaven] junitPublisher - Jenkins JUnit Attachments Plugin not found, can't
publish test attachments.Recording test results
[windows-jdk8] None of the test reports contained any result
[windows-jdk8] [withMaven] Skip 'Findbugs Publisher' disabled by configuration
[windows-jdk8] [withMaven] Skip 'Open Task Scanner Publisher' disabled by configuration
[windows-jdk8] [withMaven] Skip 'Generated Artifacts Publisher' disabled by configuration
[windows-jdk8] [withMaven] Skip 'Findbugs Publisher' disabled by configuration
[windows-jdk8] [withMaven] Skip 'Open Task Scanner Publisher' disabled by configuration
[windows-jdk8] [withMaven] Skip 'Generated Artifacts Publisher' disabled by configuration
[windows-jdk8] [withMaven] junitPublisher - Archive test results for Maven artifact org.apache.maven.shared.dependency-analyzer.tests:jarWithTestDependency1:1.0
generated by maven-surefire-plugin:test (default-test): m\target\test-classes\jarWithTestDependency\project1\target\surefire-reports\*.xml
[windows-jdk8] [withMaven] junitPublisher - Jenkins JUnit Attachments Plugin not found, can't
publish test attachments.Recording test results
[windows-jdk8] None of the test reports contained any result
[windows-jdk8] [withMaven] junitPublisher - Archive test results for Maven artifact org.apache.maven.shared.dependency-analyzer.tests:jarWithTestDependency2:1.0
generated by maven-surefire-plugin:test (default-test): m\target\test-classes\jarWithTestDependency\project2\target\surefire-reports\*.xml
[windows-jdk8] [withMaven] junitPublisher - Jenkins JUnit Attachments Plugin not found, can't
publish test attachments.Recording test results
[windows-jdk8] None of the test reports contained any result
[windows-jdk8] [withMaven] Skip 'Findbugs Publisher' disabled by configuration
[windows-jdk8] [withMaven] Skip 'Open Task Scanner Publisher' disabled by configuration
[windows-jdk8] [withMaven] Skip 'Generated Artifacts Publisher' disabled by configuration
[windows-jdk8] [withMaven] junitPublisher - Archive test results for Maven artifact org.apache.maven.shared.dependency-analyzer.tests:jarWithTestDependency1:1.0
generated by maven-surefire-plugin:test (default-test): m\target\test-classes\jarWithTestDependency\project1\target\surefire-reports\*.xml
[windows-jdk8] [withMaven] junitPublisher - Jenkins JUnit Attachments Plugin not found, can't
publish test attachments.Recording test results
[windows-jdk8] None of the test reports contained any result
[windows-jdk8] [withMaven] junitPublisher - Archive test results for Maven artifact org.apache.maven.shared.dependency-analyzer.tests:jarWithTestDependency2:1.0
generated by maven-surefire-plugin:test (default-test): m\target\test-classes\jarWithTestDependency\project2\target\surefire-reports\*.xml
[windows-jdk8] [withMaven] junitPublisher - Jenkins JUnit Attachments Plugin not found, can't
publish test attachments.Recording test results
[windows-jdk8] None of the test reports contained any result
[windows-jdk8] [withMaven] Skip 'Findbugs Publisher' disabled by configuration
[windows-jdk8] [withMaven] Skip 'Open Task Scanner Publisher' disabled by configuration
[windows-jdk8] [withMaven] Skip 'Generated Artifacts Publisher' disabled by configuration
[windows-jdk8] [withMaven] junitPublisher - Archive test results for Maven artifact org.apache.maven.shared.dependency-analyzer.tests:jarWithCompileDependency1:1.0
generated by maven-surefire-plugin:test (default-test): m\target\test-classes\jarWithCompileDependency\project1\target\surefire-reports\*.xml
[windows-jdk8] [withMaven] junitPublisher - Jenkins JUnit Attachments Plugin not found, can't
publish test attachments.Recording test results
[windows-jdk8] None of the test reports contained any result
[windows-jdk8] [withMaven] junitPublisher - Archive test results for Maven artifact org.apache.maven.shared.dependency-analyzer.tests:jarWithCompileDependency2:1.0
generated by maven-surefire-plugin:test (default-test): m\target\test-classes\jarWithCompileDependency\project2\target\surefire-reports\*.xml
[windows-jdk8] [withMaven] junitPublisher - Jenkins JUnit Attachments Plugin not found, can't
publish test attachments.Recording test results
[windows-jdk8] None of the test reports contained any result
[windows-jdk8] [withMaven] Skip 'Findbugs Publisher' disabled by configuration
[windows-jdk8] [withMaven] Skip 'Open Task Scanner Publisher' disabled by configuration
[windows-jdk8] [withMaven] Skip 'Generated Artifacts Publisher' disabled by configuration
[windows-jdk8] [withMaven] junitPublisher - Archive test results for Maven artifact org.apache.maven.shared.dependency-analyzer.tests:java8methodreferences:1.0
generated by maven-surefire-plugin:test (default-test): m\target\test-classes\java8methodRefs\target\surefire-reports\*.xml
[windows-jdk8] [withMaven] junitPublisher - Jenkins JUnit Attachments Plugin not found, can't
publish test attachments.Recording test results
[windows-jdk8] None of the test reports contained any result
[windows-jdk8] [withMaven] Skip 'Findbugs Publisher' disabled by configuration
[windows-jdk8] [withMaven] Skip 'Open Task Scanner Publisher' disabled by configuration
[windows-jdk8] [withMaven] Skip 'Generated Artifacts Publisher' disabled by configuration
[windows-jdk8] [withMaven] junitPublisher - Archive test results for Maven artifact org.apache.maven.shared.dependency-analyzer.tests:inlinedStaticReference:1.0
generated by maven-surefire-plugin:test (default-test): m\target\test-classes\inlinedStaticReference\target\surefire-reports\*.xml
[windows-jdk8] [withMaven] junitPublisher - Jenkins JUnit Attachments Plugin not found, can't
publish test attachments.Recording test results
[windows-jdk8] None of the test reports contained any result
[windows-jdk8] [withMaven] Skip 'Findbugs Publisher' disabled by configuration
[windows-jdk8] [withMaven] Skip 'Open Task Scanner Publisher' disabled by configuration
[windows-jdk8] [withMaven] Skip 'Generated Artifacts Publisher' disabled by configuration
[windows-jdk8] [withMaven] junitPublisher - Archive test results for Maven artifact org.apache.maven.shared.dependency-analyzer.tests:typeUseAnnotationDependencyAnnotation:1.0
generated by maven-surefire-plugin:test (default-test): m\target\test-classes\typeUseAnnotationDependency\annotation\target\surefire-reports\*.xml
[windows-jdk8] [withMaven] junitPublisher - Jenkins JUnit Attachments Plugin not found, can't
publish test attachments.Recording test results
[windows-jdk8] None of the test reports contained any result
[windows-jdk8] [withMaven] junitPublisher - Archive test results for Maven artifact org.apache.maven.shared.dependency-analyzer.tests:typeUseAnnotationDependencyUsage:1.0
generated by maven-surefire-plugin:test (default-test): m\target\test-classes\typeUseAnnotationDependency\usage\target\surefire-reports\*.xml
[windows-jdk8] [withMaven] junitPublisher - Jenkins JUnit Attachments Plugin not found, can't
publish test attachments.Recording test results
[windows-jdk8] None of the test reports contained any result
[windows-jdk8] [withMaven] Skip 'Findbugs Publisher' disabled by configuration
[windows-jdk8] [withMaven] Skip 'Open Task Scanner Publisher' disabled by configuration
[windows-jdk8] [withMaven] Skip 'Generated Artifacts Publisher' disabled by configuration
[windows-jdk8] [withMaven] junitPublisher - Archive test results for Maven artifact org.apache.maven.its.dependency:test-module1:1.0
generated by maven-surefire-plugin:test (default-test): m\target\test-classes\multimoduleProject\module1\target\surefire-reports\*.xml
[windows-jdk8] [withMaven] junitPublisher - Jenkins JUnit Attachments Plugin not found, can't
publish test attachments.Recording test results
[windows-jdk8] None of the test reports contained any result
[windows-jdk8] [withMaven] junitPublisher - Archive test results for Maven artifact org.apache.maven.its.dependency:test-module2:1.0
generated by maven-surefire-plugin:test (default-test): m\target\test-classes\multimoduleProject\module2\target\surefire-reports\*.xml
[windows-jdk8] [withMaven] junitPublisher - Jenkins JUnit Attachments Plugin not found, can't
publish test attachments.Recording test results
[windows-jdk8] None of the test reports contained any result
[windows-jdk8] [withMaven] Skip 'Findbugs Publisher' disabled by configuration
[windows-jdk8] [withMaven] Skip 'Open Task Scanner Publisher' disabled by configuration
[Pipeline] [windows-jdk9] }
[windows-jdk9] [withMaven] Skip 'Generated Artifacts Publisher' disabled by configuration
[windows-jdk9] [withMaven] junitPublisher - Archive test results for Maven artifact org.apache.maven.shared:maven-dependency-analyzer:1.8-SNAPSHOT
generated by maven-surefire-plugin:test (default-test): m\target\surefire-reports\*.xml
[windows-jdk9] [withMaven] junitPublisher - Jenkins JUnit Attachments Plugin not found, can't
publish test attachments.Recording test results
[windows-jdk9] [withMaven] Skip 'Findbugs Publisher' disabled by configuration
[windows-jdk9] [withMaven] Skip 'Open Task Scanner Publisher' disabled by configuration
[windows-jdk9] [withMaven] Skip 'Generated Artifacts Publisher' disabled by configuration
[windows-jdk9] [withMaven] junitPublisher - Archive test results for Maven artifact org.apache.maven.shared.dependency-analyzer.tests:jarWithXercesDependencies:1.0
generated by maven-surefire-plugin:test (default-test): m\target\test-classes\jarWithXmlTransitiveDependency\target\surefire-reports\*.xml
[windows-jdk9] [withMaven] junitPublisher - Jenkins JUnit Attachments Plugin not found, can't
publish test attachments.Recording test results
[windows-jdk9] None of the test reports contained any result
[windows-jdk9] [withMaven] Skip 'Findbugs Publisher' disabled by configuration
[windows-jdk9] [withMaven] Skip 'Open Task Scanner Publisher' disabled by configuration
[windows-jdk9] [withMaven] Skip 'Generated Artifacts Publisher' disabled by configuration
[windows-jdk9] [withMaven] junitPublisher - Archive test results for Maven artifact org.apache.maven.shared.dependency-analyzer.tests:jarWithNoDependencies:1.0
generated by maven-surefire-plugin:test (default-test): m\target\test-classes\jarWithNoDependencies\target\surefire-reports\*.xml
[windows-jdk9] [withMaven] junitPublisher - Jenkins JUnit Attachments Plugin not found, can't
publish test attachments.Recording test results
[windows-jdk9] None of the test reports contained any result
[windows-jdk9] [withMaven] Skip 'Findbugs Publisher' disabled by configuration
[windows-jdk9] [withMaven] Skip 'Open Task Scanner Publisher' disabled by configuration
[windows-jdk9] [withMaven] Skip 'Generated Artifacts Publisher' disabled by configuration
[windows-jdk9] [withMaven] Skip 'Findbugs Publisher' disabled by configuration
[windows-jdk9] [withMaven] Skip 'Open Task Scanner Publisher' disabled by configuration
[windows-jdk9] [withMaven] Skip 'Generated Artifacts Publisher' disabled by configuration
[windows-jdk9] [withMaven] junitPublisher - Archive test results for Maven artifact org.apache.maven.shared.dependency-analyzer.tests:jarWithTestDependency1:1.0
generated by maven-surefire-plugin:test (default-test): m\target\test-classes\jarWithTestDependency\project1\target\surefire-reports\*.xml
[windows-jdk9] [withMaven] junitPublisher - Jenkins JUnit Attachments Plugin not found, can't
publish test attachments.Recording test results
[windows-jdk9] None of the test reports contained any result
[windows-jdk9] [withMaven] junitPublisher - Archive test results for Maven artifact org.apache.maven.shared.dependency-analyzer.tests:jarWithTestDependency2:1.0
generated by maven-surefire-plugin:test (default-test): m\target\test-classes\jarWithTestDependency\project2\target\surefire-reports\*.xml
[windows-jdk9] [withMaven] junitPublisher - Jenkins JUnit Attachments Plugin not found, can't
publish test attachments.Recording test results
[windows-jdk9] None of the test reports contained any result
[windows-jdk9] [withMaven] Skip 'Findbugs Publisher' disabled by configuration
[windows-jdk9] [withMaven] Skip 'Open Task Scanner Publisher' disabled by configuration
[windows-jdk9] [withMaven] Skip 'Generated Artifacts Publisher' disabled by configuration
[windows-jdk9] [withMaven] junitPublisher - Archive test results for Maven artifact org.apache.maven.shared.dependency-analyzer.tests:jarWithTestDependency1:1.0
generated by maven-surefire-plugin:test (default-test): m\target\test-classes\jarWithTestDependency\project1\target\surefire-reports\*.xml
[windows-jdk9] [withMaven] junitPublisher - Jenkins JUnit Attachments Plugin not found, can't
publish test attachments.Recording test results
[windows-jdk9] None of the test reports contained any result
[windows-jdk9] [withMaven] junitPublisher - Archive test results for Maven artifact org.apache.maven.shared.dependency-analyzer.tests:jarWithTestDependency2:1.0
generated by maven-surefire-plugin:test (default-test): m\target\test-classes\jarWithTestDependency\project2\target\surefire-reports\*.xml
[windows-jdk9] [withMaven] junitPublisher - Jenkins JUnit Attachments Plugin not found, can't
publish test attachments.Recording test results
[windows-jdk9] None of the test reports contained any result
[windows-jdk9] [withMaven] Skip 'Findbugs Publisher' disabled by configuration
[windows-jdk9] [withMaven] Skip 'Open Task Scanner Publisher' disabled by configuration
[windows-jdk9] [withMaven] Skip 'Generated Artifacts Publisher' disabled by configuration
[windows-jdk9] [withMaven] junitPublisher - Archive test results for Maven artifact org.apache.maven.shared.dependency-analyzer.tests:jarWithCompileDependency1:1.0
generated by maven-surefire-plugin:test (default-test): m\target\test-classes\jarWithCompileDependency\project1\target\surefire-reports\*.xml
[windows-jdk9] [withMaven] junitPublisher - Jenkins JUnit Attachments Plugin not found, can't
publish test attachments.Recording test results
[windows-jdk9] None of the test reports contained any result
[windows-jdk9] [withMaven] junitPublisher - Archive test results for Maven artifact org.apache.maven.shared.dependency-analyzer.tests:jarWithCompileDependency2:1.0
generated by maven-surefire-plugin:test (default-test): m\target\test-classes\jarWithCompileDependency\project2\target\surefire-reports\*.xml
[windows-jdk9] [withMaven] junitPublisher - Jenkins JUnit Attachments Plugin not found, can't
publish test attachments.Recording test results
[windows-jdk9] None of the test reports contained any result
[windows-jdk9] [withMaven] Skip 'Findbugs Publisher' disabled by configuration
[windows-jdk9] [withMaven] Skip 'Open Task Scanner Publisher' disabled by configuration
[windows-jdk9] [withMaven] Skip 'Generated Artifacts Publisher' disabled by configuration
[windows-jdk9] [withMaven] junitPublisher - Archive test results for Maven artifact org.apache.maven.shared.dependency-analyzer.tests:java8methodreferences:1.0
generated by maven-surefire-plugin:test (default-test): m\target\test-classes\java8methodRefs\target\surefire-reports\*.xml
[windows-jdk9] [withMaven] junitPublisher - Jenkins JUnit Attachments Plugin not found, can't
publish test attachments.Recording test results
[windows-jdk9] None of the test reports contained any result
[windows-jdk9] [withMaven] Skip 'Findbugs Publisher' disabled by configuration
[windows-jdk9] [withMaven] Skip 'Open Task Scanner Publisher' disabled by configuration
[windows-jdk9] [withMaven] Skip 'Generated Artifacts Publisher' disabled by configuration
[windows-jdk9] [withMaven] junitPublisher - Archive test results for Maven artifact org.apache.maven.shared.dependency-analyzer.tests:inlinedStaticReference:1.0
generated by maven-surefire-plugin:test (default-test): m\target\test-classes\inlinedStaticReference\target\surefire-reports\*.xml
[windows-jdk9] [withMaven] junitPublisher - Jenkins JUnit Attachments Plugin not found, can't
publish test attachments.Recording test results
[windows-jdk9] None of the test reports contained any result
[windows-jdk9] [withMaven] Skip 'Findbugs Publisher' disabled by configuration
[windows-jdk9] [withMaven] Skip 'Open Task Scanner Publisher' disabled by configuration
[windows-jdk9] [withMaven] Skip 'Generated Artifacts Publisher' disabled by configuration
[windows-jdk9] [withMaven] junitPublisher - Archive test results for Maven artifact org.apache.maven.shared.dependency-analyzer.tests:typeUseAnnotationDependencyAnnotation:1.0
generated by maven-surefire-plugin:test (default-test): m\target\test-classes\typeUseAnnotationDependency\annotation\target\surefire-reports\*.xml
[windows-jdk9] [withMaven] junitPublisher - Jenkins JUnit Attachments Plugin not found, can't
publish test attachments.Recording test results
[windows-jdk9] None of the test reports contained any result
[windows-jdk9] [withMaven] junitPublisher - Archive test results for Maven artifact org.apache.maven.shared.dependency-analyzer.tests:typeUseAnnotationDependencyUsage:1.0
generated by maven-surefire-plugin:test (default-test): m\target\test-classes\typeUseAnnotationDependency\usage\target\surefire-reports\*.xml
[windows-jdk9] [withMaven] junitPublisher - Jenkins JUnit Attachments Plugin not found, can't
publish test attachments.Recording test results
[windows-jdk9] None of the test reports contained any result
[windows-jdk9] [withMaven] Skip 'Findbugs Publisher' disabled by configuration
[windows-jdk9] [withMaven] Skip 'Open Task Scanner Publisher' disabled by configuration
[windows-jdk9] [withMaven] Skip 'Generated Artifacts Publisher' disabled by configuration
[windows-jdk9] [withMaven] junitPublisher - Archive test results for Maven artifact org.apache.maven.its.dependency:test-module1:1.0
generated by maven-surefire-plugin:test (default-test): m\target\test-classes\multimoduleProject\module1\target\surefire-reports\*.xml
[windows-jdk9] [withMaven] junitPublisher - Jenkins JUnit Attachments Plugin not found, can't
publish test attachments.Recording test results
[windows-jdk9] None of the test reports contained any result
[windows-jdk9] [withMaven] junitPublisher - Archive test results for Maven artifact org.apache.maven.its.dependency:test-module2:1.0
generated by maven-surefire-plugin:test (default-test): m\target\test-classes\multimoduleProject\module2\target\surefire-reports\*.xml
[windows-jdk9] [withMaven] junitPublisher - Jenkins JUnit Attachments Plugin not found, can't
publish test attachments.Recording test results
[windows-jdk9] None of the test reports contained any result
[windows-jdk9] [withMaven] Skip 'Findbugs Publisher' disabled by configuration
[windows-jdk9] [withMaven] Skip 'Open Task Scanner Publisher' disabled by configuration
[Pipeline] [linux-jdk8] // node
[Pipeline] [linux-jdk9] // node
[Pipeline] [windows-jdk7] // node
[Pipeline] [windows-jdk8] // withMaven
[Pipeline] [windows-jdk9] // withMaven
[Pipeline] [linux-jdk8] }
[Pipeline] [linux-jdk9] }
[Pipeline] [windows-jdk7] }
[Pipeline] [windows-jdk8] }
[Pipeline] [windows-jdk9] }
[Pipeline] [windows-jdk8] // stage
[Pipeline] [windows-jdk9] // stage
[Pipeline] [windows-jdk8] }
[Pipeline] [windows-jdk9] }
[Pipeline] [windows-jdk8] // node
[Pipeline] [windows-jdk9] // node
[Pipeline] [windows-jdk8] }
[Pipeline] [windows-jdk9] }
[Pipeline] // parallel
[Pipeline] stage
[Pipeline] { (Notifications)
[Pipeline] echo
Build result: UNSTABLE
[Pipeline] jiraIssueSelector
[Pipeline] emailext
Mime
  • Unnamed multipart/mixed (inline, None, 0 bytes)
View raw message