maven-notifications mailing list archives

Site index · List index
Message view « Date » · « Thread »
Top « Date » · « Thread »
From Apache Jenkins Server <jenk...@builds.apache.org>
Subject Build unstable in Jenkins: Maven TLP » maven-javadoc-plugin » master #14
Date Tue, 02 Jan 2018 12:16:55 GMT
See https://builds.apache.org/job/maven-box/job/maven-javadoc-plugin/job/master/14/

Changes:

* Handle other parts of the parallel being interrupted by fast fail

5 tests failed.
FAILED:  org.apache.maven.plugins.javadoc.JavadocReportTest.testDefaultConfiguration

Error Message:
null

Stack Trace:
junit.framework.AssertionFailedError
	at org.apache.maven.plugins.javadoc.JavadocReportTest.testDefaultConfiguration(JavadocReportTest.java:231)


FAILED:  org.apache.maven.plugins.javadoc.JavadocReportTest.testJavadocResources

Error Message:
This bug appeared in JDK8 and was planned to be fixed in JDK9, see JDK-8032205

Stack Trace:
junit.framework.AssertionFailedError: This bug appeared in JDK8 and was planned to be fixed
in JDK9, see JDK-8032205
	at org.apache.maven.plugins.javadoc.JavadocReportTest.testJavadocResources(JavadocReportTest.java:657)


FAILED:  org.apache.maven.plugins.javadoc.JavadocReportTest.testDefaultConfiguration

Error Message:
null

Stack Trace:
junit.framework.AssertionFailedError
	at org.apache.maven.plugins.javadoc.JavadocReportTest.testDefaultConfiguration(JavadocReportTest.java:231)


FAILED:  org.apache.maven.plugins.javadoc.JavadocReportTest.testDefaultConfiguration

Error Message:
null

Stack Trace:
junit.framework.AssertionFailedError
	at org.apache.maven.plugins.javadoc.JavadocReportTest.testDefaultConfiguration(JavadocReportTest.java:231)


FAILED:  org.apache.maven.plugins.javadoc.JavadocReportTest.testDefaultConfiguration

Error Message:
null

Stack Trace:
junit.framework.AssertionFailedError
	at org.apache.maven.plugins.javadoc.JavadocReportTest.testDefaultConfiguration(JavadocReportTest.java:231)




Build log:
[...truncated 700.99 KB...]
[linux-jdk9] [withMaven] Skip 'Open Task Scanner Publisher' disabled by configuration
[linux-jdk9] [withMaven] Skip 'Generated Artifacts Publisher' disabled by configuration
[linux-jdk9] [withMaven] Skip 'Findbugs Publisher' disabled by configuration
[linux-jdk9] [withMaven] Skip 'Open Task Scanner Publisher' disabled by configuration
[linux-jdk9] [withMaven] Skip 'Generated Artifacts Publisher' disabled by configuration
[linux-jdk9] [withMaven] Skip 'Findbugs Publisher' disabled by configuration
[linux-jdk9] [withMaven] Skip 'Open Task Scanner Publisher' disabled by configuration
[linux-jdk9] [withMaven] Skip 'Generated Artifacts Publisher' disabled by configuration
[linux-jdk9] [withMaven] Skip 'Findbugs Publisher' disabled by configuration
[linux-jdk9] [withMaven] Skip 'Open Task Scanner Publisher' disabled by configuration
[Pipeline] [linux-jdk9] // withMaven
[Pipeline] [linux-jdk9] }
[Pipeline] [linux-jdk9] // stage
[Pipeline] [linux-jdk9] }
[Pipeline] [linux-jdk9] // node
[Pipeline] [linux-jdk9] }
[windows-jdk7] [INFO] ..SUCCESS (8.7 s)
[windows-jdk7] [INFO] Building: site-failOnError\pom.xml
[windows-jdk9] [INFO] run script verify.bsh
[windows-jdk9] [INFO] ..SUCCESS (15.4 s)
[windows-jdk9] [INFO] Building: MJAVADOC-325\pom.xml
[windows-jdk9] [INFO] run script verify.bsh
[windows-jdk9] [INFO] ..SUCCESS (8.8 s)
[windows-jdk9] [INFO] Building: MJAVADOC-365\pom.xml
[windows-jdk7] [INFO] ..SUCCESS (13.9 s)
[windows-jdk7] [INFO] 
[windows-jdk7] [INFO] --- mrm-maven-plugin:1.1.0:stop (repository) @ maven-javadoc-plugin
---
[windows-jdk7] [INFO] Stopping Mock Repository Manager on http://localhost:64010
[windows-jdk7] [INFO] Stopped SocketConnector@0.0.0.0:64010
[windows-jdk7] [INFO] Mock Repository Manager http://localhost:64010 is stopped.
[windows-jdk7] [INFO] 
[windows-jdk7] [INFO] --- mrm-maven-plugin:1.1.0:stop (3rdparty) @ maven-javadoc-plugin ---
[windows-jdk7] [INFO] Stopping Mock Repository Manager on http://localhost:64011
[windows-jdk7] [INFO] Stopped SocketConnector@0.0.0.0:64011
[windows-jdk7] [INFO] Mock Repository Manager http://localhost:64011 is stopped.
[windows-jdk7] [INFO] 
[windows-jdk7] [INFO] --- maven-checkstyle-plugin:2.15:check (checkstyle-check) @ maven-javadoc-plugin
---
[windows-jdk7] [INFO] There are 4 errors reported by Checkstyle 6.1.1 with config/maven_checks.xml
ruleset.
[windows-jdk7] [INFO] Ignored 4 errors, 0 violation remaining.
[windows-jdk7] [INFO] 
[windows-jdk7] [INFO] --- maven-invoker-plugin:2.0.0:verify (integration-test) @ maven-javadoc-plugin
---
[windows-jdk7] [INFO] -------------------------------------------------
[windows-jdk7] [INFO] Build Summary:
[windows-jdk7] [INFO]   Passed: 31, Failed: 1, Errors: 0, Skipped: 3
[windows-jdk7] [INFO] -------------------------------------------------
[windows-jdk7] [WARNING] The following builds failed:
[windows-jdk7] [WARNING] *  detectLinks\pom.xml
[windows-jdk7] [INFO] -------------------------------------------------
[windows-jdk7] [WARNING] Ignoring that 1 build failed.
[windows-jdk7] [INFO] ------------------------------------------------------------------------
[windows-jdk7] [INFO] BUILD SUCCESS
[windows-jdk7] [INFO] ------------------------------------------------------------------------
[windows-jdk7] [INFO] Total time: 09:32 min
[windows-jdk7] [INFO] Finished at: 2018-01-02T12:13:57Z
[windows-jdk9] [INFO] run script verify.bsh
[windows-jdk9] [INFO] ..SUCCESS (8.6 s)
[windows-jdk9] [INFO] Building: MJAVADOC-369\pom.xml
[windows-jdk7] [INFO] Final Memory: 64M/1437M
[windows-jdk7] [INFO] ------------------------------------------------------------------------
[windows-jdk7] [INFO] [jenkins-event-spy] Generated F:\jenkins\jenkins-slave\workspace\maven-javadoc-plugin_master-XEOGALQNOP5LSNOEDUT42L6QGQHATWO55CM3NEKN4WGK3JAPU26Q@tmp\withMaven07819c16\maven-spy-20180102-120424-34230684935275312399.log
[windows-jdk7] Picked up JAVA_TOOL_OPTIONS: -Dmaven.ext.class.path="f:\jenkins\jenkins-slave\workspace\maven-javadoc-plugin_master-XEOGALQNOP5LSNOEDUT42L6QGQHATWO55CM3NEKN4WGK3JAPU26Q@tmp\withMaven07819c16\pipeline-maven-spy.jar"
-Dorg.jenkinsci.plugins.pipeline.maven.reportsFolder="f:\jenkins\jenkins-slave\workspace\maven-javadoc-plugin_master-XEOGALQNOP5LSNOEDUT42L6QGQHATWO55CM3NEKN4WGK3JAPU26Q@tmp\withMaven07819c16"

[Pipeline] [windows-jdk7] }
[Pipeline] [windows-jdk7] // dir
[Pipeline] [windows-jdk7] }
[windows-jdk7] [withMaven] Skip 'Generated Artifacts Publisher' disabled by configuration
[windows-jdk7] [withMaven] junitPublisher - Archive test results for Maven artifact org.apache.maven.plugins:maven-javadoc-plugin:3.0.1-SNAPSHOT
generated by maven-surefire-plugin:test (default-test): m\target\surefire-reports\*.xml
[windows-jdk7] [withMaven] junitPublisher - Jenkins JUnit Attachments Plugin not found, can't
publish test attachments.Recording test results
[windows-jdk7] [withMaven] Skip 'Findbugs Publisher' disabled by configuration
[windows-jdk7] [withMaven] Skip 'Open Task Scanner Publisher' disabled by configuration
[windows-jdk7] [withMaven] Skip 'Generated Artifacts Publisher' disabled by configuration
[windows-jdk7] [withMaven] Skip 'Findbugs Publisher' disabled by configuration
[windows-jdk7] [withMaven] Skip 'Open Task Scanner Publisher' disabled by configuration
[windows-jdk7] [withMaven] Skip 'Generated Artifacts Publisher' disabled by configuration
[windows-jdk7] [withMaven] Skip 'Findbugs Publisher' disabled by configuration
[windows-jdk7] [withMaven] Skip 'Open Task Scanner Publisher' disabled by configuration
[windows-jdk7] [withMaven] Skip 'Generated Artifacts Publisher' disabled by configuration
[windows-jdk7] [withMaven] Skip 'Findbugs Publisher' disabled by configuration
[windows-jdk7] [withMaven] Skip 'Open Task Scanner Publisher' disabled by configuration
[windows-jdk7] [withMaven] Skip 'Generated Artifacts Publisher' disabled by configuration
[windows-jdk7] [withMaven] Skip 'Findbugs Publisher' disabled by configuration
[windows-jdk7] [withMaven] Skip 'Open Task Scanner Publisher' disabled by configuration
[windows-jdk7] [withMaven] Skip 'Generated Artifacts Publisher' disabled by configuration
[windows-jdk7] [withMaven] Skip 'Findbugs Publisher' disabled by configuration
[windows-jdk7] [withMaven] Skip 'Open Task Scanner Publisher' disabled by configuration
[windows-jdk7] [withMaven] Skip 'Generated Artifacts Publisher' disabled by configuration
[windows-jdk7] [withMaven] Skip 'Findbugs Publisher' disabled by configuration
[windows-jdk7] [withMaven] Skip 'Open Task Scanner Publisher' disabled by configuration
[Pipeline] [windows-jdk7] // withMaven
[Pipeline] [windows-jdk7] }
[Pipeline] [windows-jdk7] // stage
[Pipeline] [windows-jdk7] }
[Pipeline] [windows-jdk7] // node
[Pipeline] [windows-jdk7] }
[windows-jdk9] [INFO] run script verify.bsh
[windows-jdk9] [INFO] ..SUCCESS (19.1 s)
[windows-jdk9] [INFO] Building: MJAVADOC-384\pom.xml
[windows-jdk9] [INFO] run script verify.bsh
[windows-jdk9] [INFO] ..SUCCESS (8.7 s)
[windows-jdk9] [INFO] Building: MJAVADOC-407\pom.xml
[windows-jdk9] [INFO] run script verify.bsh
[windows-jdk9] [INFO] ..SUCCESS (10.7 s)
[windows-jdk9] [INFO] Building: MJAVADOC-414\pom.xml
[windows-jdk9] [INFO] run script verify.bsh
[windows-jdk9] [INFO] ..SUCCESS (10.8 s)
[windows-jdk9] [INFO] Building: MJAVADOC-437\pom.xml
[windows-jdk9] [INFO] run script verify.bsh
[windows-jdk9] [INFO] ..SUCCESS (11.1 s)
[windows-jdk9] [INFO] Building: MJAVADOC-494_aggregate-repositories\pom.xml
[windows-jdk9] [INFO] ..SUCCESS (11.7 s)
[windows-jdk9] [INFO] Building: MJAVADOC-497\pom.xml
[windows-jdk9] [INFO] run script verify.bsh
[windows-jdk9] [INFO] ..SUCCESS (10.7 s)
[windows-jdk9] [INFO] Building: MJAVADOC-498_aggr_modulepath\pom.xml
[windows-jdk9] [INFO] ..SUCCESS (29.0 s)
[windows-jdk9] [INFO] Building: MJAVADOC-498_mm_modulepath\pom.xml
[windows-jdk9] [INFO] ..SUCCESS (15.3 s)
[windows-jdk9] [INFO] Building: MJAVADOC-498_modulepath\pom.xml
[windows-jdk9] [INFO] run script verify.groovy
[windows-jdk9] WARNING: An illegal reflective access operation has occurred
[windows-jdk9] WARNING: Illegal reflective access by org.codehaus.groovy.reflection.CachedClass$3$1
(file:/f:/jenkins/jenkins-slave/workspace/maven-javadoc-plugin_master-XEOGALQNOP5LSNOEDUT42L6QGQHATWO55CM3NEKN4WGK3JAPU26Q/.repository/org/codehaus/groovy/groovy/2.0.1/groovy-2.0.1.jar)
to method java.lang.Object.finalize()
[windows-jdk9] WARNING: Please consider reporting this to the maintainers of org.codehaus.groovy.reflection.CachedClass$3$1
[windows-jdk9] WARNING: Use --illegal-access=warn to enable warnings of further illegal reflective
access operations
[windows-jdk9] WARNING: All illegal access operations will be denied in a future release
[windows-jdk9] [INFO] ..SUCCESS (19.2 s)
[windows-jdk9] [INFO] Building: MJAVADOC-508\pom.xml
[windows-jdk9] [INFO] ..SUCCESS (9.9 s)
[windows-jdk9] [INFO] Building: site-failOnError\pom.xml
[windows-jdk9] [INFO] ..SUCCESS (14.3 s)
[windows-jdk9] [INFO] 
[windows-jdk9] [INFO] --- mrm-maven-plugin:1.1.0:stop (repository) @ maven-javadoc-plugin
---
[windows-jdk9] [INFO] Stopping Mock Repository Manager on http://localhost:60007
[windows-jdk9] [INFO] Stopped SocketConnector@0.0.0.0:60007
[windows-jdk9] [INFO] Mock Repository Manager http://localhost:60007 is stopped.
[windows-jdk9] [INFO] 
[windows-jdk9] [INFO] --- mrm-maven-plugin:1.1.0:stop (3rdparty) @ maven-javadoc-plugin ---
[windows-jdk9] [INFO] Stopping Mock Repository Manager on http://localhost:60008
[windows-jdk9] [INFO] Stopped SocketConnector@0.0.0.0:60008
[windows-jdk9] [INFO] Mock Repository Manager http://localhost:60008 is stopped.
[windows-jdk9] [INFO] 
[windows-jdk9] [INFO] --- maven-checkstyle-plugin:2.15:check (checkstyle-check) @ maven-javadoc-plugin
---
[windows-jdk9] [INFO] Downloading: https://repo.maven.apache.org/maven2/org/apache/maven/shared/maven-shared-resources/2/maven-shared-resources-2.pom
[windows-jdk9] [INFO] Downloaded: https://repo.maven.apache.org/maven2/org/apache/maven/shared/maven-shared-resources/2/maven-shared-resources-2.pom
(3.0 kB at 197 kB/s)
[windows-jdk9] [INFO] Downloading: https://repo.maven.apache.org/maven2/org/codehaus/plexus/plexus-utils/3.0.10/plexus-utils-3.0.10.pom
[windows-jdk9] [INFO] Downloaded: https://repo.maven.apache.org/maven2/org/codehaus/plexus/plexus-utils/3.0.10/plexus-utils-3.0.10.pom
(3.1 kB at 349 kB/s)
[windows-jdk9] [INFO] Downloading: https://repo.maven.apache.org/maven2/org/apache/maven/doxia/doxia-integration-tools/1.6/doxia-integration-tools-1.6.pom
[windows-jdk9] [INFO] Downloaded: https://repo.maven.apache.org/maven2/org/apache/maven/doxia/doxia-integration-tools/1.6/doxia-integration-tools-1.6.pom
(7.0 kB at 696 kB/s)
[windows-jdk9] [INFO] Downloading: https://repo.maven.apache.org/maven2/org/apache/maven/doxia/doxia-tools/3/doxia-tools-3.pom
[windows-jdk9] [INFO] Downloaded: https://repo.maven.apache.org/maven2/org/apache/maven/doxia/doxia-tools/3/doxia-tools-3.pom
(9.9 kB at 903 kB/s)
[windows-jdk9] [INFO] Downloading: https://repo.maven.apache.org/maven2/org/apache/maven/doxia/doxia-logging-api/1.6/doxia-logging-api-1.6.pom
[windows-jdk9] [INFO] Downloaded: https://repo.maven.apache.org/maven2/org/apache/maven/doxia/doxia-logging-api/1.6/doxia-logging-api-1.6.pom
(1.5 kB at 140 kB/s)
[windows-jdk9] [INFO] Downloading: https://repo.maven.apache.org/maven2/org/apache/maven/doxia/doxia/1.6/doxia-1.6.pom
[windows-jdk9] [INFO] Downloaded: https://repo.maven.apache.org/maven2/org/apache/maven/doxia/doxia/1.6/doxia-1.6.pom
(19 kB at 2.1 MB/s)
[windows-jdk9] [INFO] Downloading: https://repo.maven.apache.org/maven2/org/apache/maven/doxia/doxia-decoration-model/1.6/doxia-decoration-model-1.6.pom
[windows-jdk9] [INFO] Downloaded: https://repo.maven.apache.org/maven2/org/apache/maven/doxia/doxia-decoration-model/1.6/doxia-decoration-model-1.6.pom
(3.0 kB at 374 kB/s)
[windows-jdk9] [INFO] Downloading: https://repo.maven.apache.org/maven2/org/apache/maven/doxia/doxia-sitetools/1.6/doxia-sitetools-1.6.pom
[windows-jdk9] [INFO] Downloaded: https://repo.maven.apache.org/maven2/org/apache/maven/doxia/doxia-sitetools/1.6/doxia-sitetools-1.6.pom
(18 kB at 1.5 MB/s)
[windows-jdk9] [INFO] Downloading: https://repo.maven.apache.org/maven2/org/codehaus/plexus/plexus-resources/1.0.1/plexus-resources-1.0.1.pom
[windows-jdk9] [INFO] Downloaded: https://repo.maven.apache.org/maven2/org/codehaus/plexus/plexus-resources/1.0.1/plexus-resources-1.0.1.pom
(1.3 kB at 132 kB/s)
[windows-jdk9] [INFO] Downloading: https://repo.maven.apache.org/maven2/com/puppycrawl/tools/checkstyle/6.1.1/checkstyle-6.1.1.pom
[windows-jdk9] [INFO] Downloaded: https://repo.maven.apache.org/maven2/com/puppycrawl/tools/checkstyle/6.1.1/checkstyle-6.1.1.pom
(30 kB at 1.5 MB/s)
[windows-jdk9] [INFO] Downloading: https://repo.maven.apache.org/maven2/org/sonatype/oss/oss-parent/7/oss-parent-7.pom
[windows-jdk9] [INFO] Downloaded: https://repo.maven.apache.org/maven2/org/sonatype/oss/oss-parent/7/oss-parent-7.pom
(4.8 kB at 536 kB/s)
[windows-jdk9] [INFO] Downloading: https://repo.maven.apache.org/maven2/org/antlr/antlr4-runtime/4.3/antlr4-runtime-4.3.pom
[windows-jdk9] [INFO] Downloaded: https://repo.maven.apache.org/maven2/org/antlr/antlr4-runtime/4.3/antlr4-runtime-4.3.pom
(4.8 kB at 479 kB/s)
[windows-jdk9] [INFO] Downloading: https://repo.maven.apache.org/maven2/org/antlr/antlr4-master/4.3/antlr4-master-4.3.pom
[windows-jdk9] [INFO] Downloaded: https://repo.maven.apache.org/maven2/org/antlr/antlr4-master/4.3/antlr4-master-4.3.pom
(7.9 kB at 881 kB/s)
[windows-jdk9] [INFO] Downloading: https://repo.maven.apache.org/maven2/org/abego/treelayout/org.abego.treelayout.core/1.0.1/org.abego.treelayout.core-1.0.1.pom
[windows-jdk9] [INFO] Downloaded: https://repo.maven.apache.org/maven2/org/abego/treelayout/org.abego.treelayout.core/1.0.1/org.abego.treelayout.core-1.0.1.pom
(3.1 kB at 282 kB/s)
[windows-jdk9] [INFO] Downloading: https://repo.maven.apache.org/maven2/org/antlr/antlr4-annotations/4.3/antlr4-annotations-4.3.pom
[windows-jdk9] [INFO] Downloaded: https://repo.maven.apache.org/maven2/org/antlr/antlr4-annotations/4.3/antlr4-annotations-4.3.pom
(1.3 kB at 116 kB/s)
[windows-jdk9] [INFO] Downloading: https://repo.maven.apache.org/maven2/commons-beanutils/commons-beanutils-core/1.8.3/commons-beanutils-core-1.8.3.pom
[windows-jdk9] [INFO] Downloaded: https://repo.maven.apache.org/maven2/commons-beanutils/commons-beanutils-core/1.8.3/commons-beanutils-core-1.8.3.pom
(1.6 kB at 205 kB/s)
[windows-jdk9] [INFO] Downloading: https://repo.maven.apache.org/maven2/com/google/guava/guava/18.0/guava-18.0.pom
[windows-jdk9] [INFO] Downloaded: https://repo.maven.apache.org/maven2/com/google/guava/guava/18.0/guava-18.0.pom
(5.7 kB at 630 kB/s)
[windows-jdk9] [INFO] Downloading: https://repo.maven.apache.org/maven2/com/google/guava/guava-parent/18.0/guava-parent-18.0.pom
[windows-jdk9] [INFO] Downloaded: https://repo.maven.apache.org/maven2/com/google/guava/guava-parent/18.0/guava-parent-18.0.pom
(7.7 kB at 699 kB/s)
[windows-jdk9] [INFO] Downloading: https://repo.maven.apache.org/maven2/org/apache/maven/shared/maven-shared-resources/2/maven-shared-resources-2.jar
[windows-jdk9] [INFO] Downloading: https://repo.maven.apache.org/maven2/org/apache/maven/doxia/doxia-integration-tools/1.6/doxia-integration-tools-1.6.jar
[windows-jdk9] [INFO] Downloading: https://repo.maven.apache.org/maven2/org/codehaus/plexus/plexus-resources/1.0.1/plexus-resources-1.0.1.jar
[windows-jdk9] [INFO] Downloading: https://repo.maven.apache.org/maven2/com/puppycrawl/tools/checkstyle/6.1.1/checkstyle-6.1.1.jar
[windows-jdk9] [INFO] Downloading: https://repo.maven.apache.org/maven2/org/antlr/antlr4-runtime/4.3/antlr4-runtime-4.3.jar
[windows-jdk9] [INFO] Downloaded: https://repo.maven.apache.org/maven2/org/codehaus/plexus/plexus-resources/1.0.1/plexus-resources-1.0.1.jar
(22 kB at 1.2 MB/s)
[windows-jdk9] [INFO] Downloading: https://repo.maven.apache.org/maven2/org/abego/treelayout/org.abego.treelayout.core/1.0.1/org.abego.treelayout.core-1.0.1.jar
[windows-jdk9] [INFO] Downloaded: https://repo.maven.apache.org/maven2/org/apache/maven/shared/maven-shared-resources/2/maven-shared-resources-2.jar
(13 kB at 466 kB/s)
[windows-jdk9] [INFO] Downloading: https://repo.maven.apache.org/maven2/org/antlr/antlr4-annotations/4.3/antlr4-annotations-4.3.jar
[windows-jdk9] [INFO] Downloaded: https://repo.maven.apache.org/maven2/org/apache/maven/doxia/doxia-integration-tools/1.6/doxia-integration-tools-1.6.jar
(45 kB at 1.5 MB/s)
[windows-jdk9] [INFO] Downloading: https://repo.maven.apache.org/maven2/commons-beanutils/commons-beanutils-core/1.8.3/commons-beanutils-core-1.8.3.jar
[windows-jdk9] [INFO] Downloaded: https://repo.maven.apache.org/maven2/org/antlr/antlr4-runtime/4.3/antlr4-runtime-4.3.jar
(345 kB at 10 MB/s)
[windows-jdk9] [INFO] Downloading: https://repo.maven.apache.org/maven2/com/google/guava/guava/18.0/guava-18.0.jar
[windows-jdk9] [INFO] Downloaded: https://repo.maven.apache.org/maven2/org/abego/treelayout/org.abego.treelayout.core/1.0.1/org.abego.treelayout.core-1.0.1.jar
(26 kB at 690 kB/s)
[windows-jdk9] [INFO] Downloading: https://repo.maven.apache.org/maven2/commons-lang/commons-lang/2.1/commons-lang-2.1.jar
[windows-jdk9] [INFO] Downloaded: https://repo.maven.apache.org/maven2/org/antlr/antlr4-annotations/4.3/antlr4-annotations-4.3.jar
(10 kB at 235 kB/s)
[windows-jdk9] [INFO] Downloaded: https://repo.maven.apache.org/maven2/commons-beanutils/commons-beanutils-core/1.8.3/commons-beanutils-core-1.8.3.jar
(207 kB at 3.3 MB/s)
[windows-jdk9] [INFO] Downloaded: https://repo.maven.apache.org/maven2/commons-lang/commons-lang/2.1/commons-lang-2.1.jar
(208 kB at 3.2 MB/s)
[windows-jdk9] [INFO] Downloaded: https://repo.maven.apache.org/maven2/com/puppycrawl/tools/checkstyle/6.1.1/checkstyle-6.1.1.jar
(1.0 MB at 15 MB/s)
[windows-jdk9] [INFO] Downloaded: https://repo.maven.apache.org/maven2/com/google/guava/guava/18.0/guava-18.0.jar
(2.3 MB at 20 MB/s)
[windows-jdk9] [INFO] There are 4 errors reported by Checkstyle 6.1.1 with config/maven_checks.xml
ruleset.
[windows-jdk9] [INFO] Ignored 4 errors, 0 violation remaining.
[windows-jdk9] [INFO] 
[windows-jdk9] [INFO] --- maven-invoker-plugin:2.0.0:verify (integration-test) @ maven-javadoc-plugin
---
[windows-jdk9] [INFO] -------------------------------------------------
[windows-jdk9] [INFO] Build Summary:
[windows-jdk9] [INFO]   Passed: 34, Failed: 1, Errors: 0, Skipped: 0
[windows-jdk9] [INFO] -------------------------------------------------
[windows-jdk9] [WARNING] The following builds failed:
[windows-jdk9] [WARNING] *  detectLinks\pom.xml
[windows-jdk9] [INFO] -------------------------------------------------
[windows-jdk9] [WARNING] Ignoring that 1 build failed.
[windows-jdk9] [INFO] ------------------------------------------------------------------------
[windows-jdk9] [INFO] BUILD SUCCESS
[windows-jdk9] [INFO] ------------------------------------------------------------------------
[windows-jdk9] [INFO] Total time: 12:39 min
[windows-jdk9] [INFO] Finished at: 2018-01-02T12:16:50Z
[windows-jdk9] [INFO] Final Memory: 51M/169M
[windows-jdk9] [INFO] ------------------------------------------------------------------------
[windows-jdk9] [INFO] [jenkins-event-spy] Generated F:\jenkins\jenkins-slave\workspace\maven-javadoc-plugin_master-XEOGALQNOP5LSNOEDUT42L6QGQHATWO55CM3NEKN4WGK3JAPU26Q@tmp\withMaven98bb4f20\maven-spy-20180102-120411-21114997987907666474498.log
[Pipeline] [windows-jdk9] }
[Pipeline] [windows-jdk9] // dir
[Pipeline] [windows-jdk9] }
[windows-jdk9] [withMaven] Skip 'Generated Artifacts Publisher' disabled by configuration
[windows-jdk9] [withMaven] junitPublisher - Archive test results for Maven artifact org.apache.maven.plugins:maven-javadoc-plugin:3.0.1-SNAPSHOT
generated by maven-surefire-plugin:test (default-test): m\target\surefire-reports\*.xml
[windows-jdk9] [withMaven] junitPublisher - Jenkins JUnit Attachments Plugin not found, can't
publish test attachments.Recording test results
[windows-jdk9] [withMaven] Skip 'Findbugs Publisher' disabled by configuration
[windows-jdk9] [withMaven] Skip 'Open Task Scanner Publisher' disabled by configuration
[windows-jdk9] [withMaven] Skip 'Generated Artifacts Publisher' disabled by configuration
[windows-jdk9] [withMaven] Skip 'Findbugs Publisher' disabled by configuration
[windows-jdk9] [withMaven] Skip 'Open Task Scanner Publisher' disabled by configuration
[windows-jdk9] [withMaven] Skip 'Generated Artifacts Publisher' disabled by configuration
[windows-jdk9] [withMaven] Skip 'Findbugs Publisher' disabled by configuration
[windows-jdk9] [withMaven] Skip 'Open Task Scanner Publisher' disabled by configuration
[windows-jdk9] [withMaven] Skip 'Generated Artifacts Publisher' disabled by configuration
[windows-jdk9] [withMaven] Skip 'Findbugs Publisher' disabled by configuration
[windows-jdk9] [withMaven] Skip 'Open Task Scanner Publisher' disabled by configuration
[windows-jdk9] [withMaven] Skip 'Generated Artifacts Publisher' disabled by configuration
[windows-jdk9] [withMaven] Skip 'Findbugs Publisher' disabled by configuration
[windows-jdk9] [withMaven] Skip 'Open Task Scanner Publisher' disabled by configuration
[Pipeline] [windows-jdk9] // withMaven
[Pipeline] [windows-jdk9] }
[Pipeline] [windows-jdk9] // stage
[Pipeline] [windows-jdk9] }
[Pipeline] [windows-jdk9] // node
[Pipeline] [windows-jdk9] }
[Pipeline] // parallel
[Pipeline] stage
[Pipeline] { (Notifications)
[Pipeline] echo
Build result: UNSTABLE
[Pipeline] jiraIssueSelector
[Pipeline] emailext
Mime
  • Unnamed multipart/mixed (inline, None, 0 bytes)
View raw message