maven-notifications mailing list archives

Site index · List index
Message view « Date » · « Thread »
Top « Date » · « Thread »
From Apache Jenkins Server <jenk...@builds.apache.org>
Subject Build failed in Jenkins: Maven TLP » maven-javadoc-plugin » MJAVADOC-504 #1
Date Tue, 02 Jan 2018 17:15:31 GMT
See https://builds.apache.org/job/maven-box/job/maven-javadoc-plugin/job/MJAVADOC-504/1/

No changes.

All tests passed

Build log:
[...truncated 1.52 MB...]
[windows-jdk7] [INFO] java-javadoc mojo extractor found 0 mojo descriptor.
[windows-jdk8] [INFO] Downloading: https://repo.maven.apache.org/maven2/org/apache/apache-jar-resource-bundle/1.4/apache-jar-resource-bundle-1.4.jar
[windows-jdk8] [INFO] Downloaded: https://repo.maven.apache.org/maven2/org/apache/apache-jar-resource-bundle/1.4/apache-jar-resource-bundle-1.4.jar
(12 kB at 1.1 MB/s)
[windows-jdk8] [INFO] 
[windows-jdk8] [INFO] --- maven-resources-plugin:2.7:resources (default-resources) @ maven-javadoc-plugin
---
[windows-jdk8] [INFO] Downloading: https://repo.maven.apache.org/maven2/org/codehaus/plexus/plexus-utils/3.0.15/plexus-utils-3.0.15.pom
[windows-jdk8] [INFO] Downloaded: https://repo.maven.apache.org/maven2/org/codehaus/plexus/plexus-utils/3.0.15/plexus-utils-3.0.15.pom
(3.1 kB at 150 kB/s)
[windows-jdk8] [INFO] Downloading: https://repo.maven.apache.org/maven2/org/apache/maven/shared/maven-filtering/1.2/maven-filtering-1.2.pom
[windows-jdk8] [INFO] Downloaded: https://repo.maven.apache.org/maven2/org/apache/maven/shared/maven-filtering/1.2/maven-filtering-1.2.pom
(6.5 kB at 592 kB/s)
[windows-jdk8] [INFO] Downloading: https://repo.maven.apache.org/maven2/org/apache/maven/shared/maven-shared-utils/0.3/maven-shared-utils-0.3.pom
[windows-jdk9] [INFO] Downloaded: https://repo.maven.apache.org/maven2/org/codehaus/plexus/plexus-compiler/2.7/plexus-compiler-2.7.pom
(4.9 kB at 548 kB/s)
[windows-jdk9] [INFO] Downloading: https://repo.maven.apache.org/maven2/org/codehaus/plexus/plexus-compiler-manager/2.7/plexus-compiler-manager-2.7.pom
[windows-jdk9] [INFO] Downloaded: https://repo.maven.apache.org/maven2/org/codehaus/plexus/plexus-compiler-manager/2.7/plexus-compiler-manager-2.7.pom
(711 B at 19 kB/s)
[windows-jdk9] [INFO] Downloading: https://repo.maven.apache.org/maven2/org/codehaus/plexus/plexus-compiler-javac/2.7/plexus-compiler-javac-2.7.pom
[windows-jdk9] [INFO] Downloaded: https://repo.maven.apache.org/maven2/org/codehaus/plexus/plexus-compiler-javac/2.7/plexus-compiler-javac-2.7.pom
(792 B at 40 kB/s)
[windows-jdk9] [INFO] Downloading: https://repo.maven.apache.org/maven2/org/codehaus/plexus/plexus-compilers/2.7/plexus-compilers-2.7.pom
[windows-jdk9] [INFO] Downloaded: https://repo.maven.apache.org/maven2/org/codehaus/plexus/plexus-compilers/2.7/plexus-compilers-2.7.pom
(1.4 kB at 138 kB/s)
[windows-jdk9] [INFO] Downloading: https://repo.maven.apache.org/maven2/org/codehaus/plexus/plexus-compiler-manager/2.7/plexus-compiler-manager-2.7.jar
[windows-jdk9] [INFO] Downloading: https://repo.maven.apache.org/maven2/org/apache/maven/shared/maven-shared-incremental/1.1/maven-shared-incremental-1.1.jar
[windows-jdk9] [INFO] Downloading: https://repo.maven.apache.org/maven2/org/codehaus/plexus/plexus-compiler-javac/2.7/plexus-compiler-javac-2.7.jar
[windows-jdk9] [INFO] Downloading: https://repo.maven.apache.org/maven2/org/codehaus/plexus/plexus-compiler-api/2.7/plexus-compiler-api-2.7.jar
[windows-jdk9] [INFO] Downloaded: https://repo.maven.apache.org/maven2/org/codehaus/plexus/plexus-compiler-api/2.7/plexus-compiler-api-2.7.jar
(26 kB at 53 kB/s)
[windows-jdk9] [INFO] Downloaded: https://repo.maven.apache.org/maven2/org/codehaus/plexus/plexus-compiler-javac/2.7/plexus-compiler-javac-2.7.jar
(19 kB at 40 kB/s)
[windows-jdk9] [INFO] Downloaded: https://repo.maven.apache.org/maven2/org/codehaus/plexus/plexus-compiler-manager/2.7/plexus-compiler-manager-2.7.jar
(4.7 kB at 9.5 kB/s)
[windows-jdk9] [INFO] Downloaded: https://repo.maven.apache.org/maven2/org/apache/maven/shared/maven-shared-incremental/1.1/maven-shared-incremental-1.1.jar
(14 kB at 27 kB/s)
[windows-jdk9] [INFO] Changes detected - recompiling the module!
[windows-jdk9] [INFO] Compiling 36 source files to f:\jenkins\jenkins-slave\workspace\javadoc-plugin_MJAVADOC-504-H73AD7NET6QERU3OCBMULFVY22GE4X5GOJQHYCRXB6CQBY3JHYDQ@2\m\target\classes
[linux-jdk8] [WARNING] Javadoc Warnings
[linux-jdk8] [WARNING] Picked up JAVA_TOOL_OPTIONS: -Dmaven.ext.class.path="/home/jenkins/jenkins-slave/workspace/javadoc-plugin_MJAVADOC-504-H73AD7NET6QERU3OCBMULFVY22GE4X5GOJQHYCRXB6CQBY3JHYDQ@tmp/withMavenbcf7e7a1/pipeline-maven-spy.jar"
-Dorg.jenkinsci.plugins.pipeline.maven.reportsFolder="/home/jenkins/jenkins-slave/workspace/javadoc-plugin_MJAVADOC-504-H73AD7NET6QERU3OCBMULFVY22GE4X5GOJQHYCRXB6CQBY3JHYDQ@tmp/withMavenbcf7e7a1"
[windows-jdk8] [INFO] Downloaded: https://repo.maven.apache.org/maven2/org/apache/maven/shared/maven-shared-utils/0.3/maven-shared-utils-0.3.pom
(4.0 kB at 450 kB/s)
[windows-jdk8] [INFO] Downloading: https://repo.maven.apache.org/maven2/org/apache/maven/shared/maven-shared-components/18/maven-shared-components-18.pom
[windows-jdk8] [INFO] Downloaded: https://repo.maven.apache.org/maven2/org/apache/maven/shared/maven-shared-components/18/maven-shared-components-18.pom
(4.9 kB at 183 kB/s)
[windows-jdk8] [INFO] Downloading: https://repo.maven.apache.org/maven2/org/apache/maven/maven-parent/22/maven-parent-22.pom
[windows-jdk8] [INFO] Downloaded: https://repo.maven.apache.org/maven2/org/apache/maven/maven-parent/22/maven-parent-22.pom
(30 kB at 1.4 MB/s)
[windows-jdk8] [INFO] Downloading: https://repo.maven.apache.org/maven2/org/apache/apache/11/apache-11.pom
[windows-jdk8] [INFO] Downloaded: https://repo.maven.apache.org/maven2/org/apache/apache/11/apache-11.pom
(15 kB at 673 kB/s)
[windows-jdk8] [INFO] Downloading: https://repo.maven.apache.org/maven2/org/codehaus/plexus/plexus-interpolation/1.19/plexus-interpolation-1.19.pom
[windows-jdk8] [INFO] Downloaded: https://repo.maven.apache.org/maven2/org/codehaus/plexus/plexus-interpolation/1.19/plexus-interpolation-1.19.pom
(1.0 kB at 129 kB/s)
[windows-jdk8] [INFO] Downloading: https://repo.maven.apache.org/maven2/org/codehaus/plexus/plexus-utils/3.0.15/plexus-utils-3.0.15.jar
[windows-jdk8] [INFO] Downloading: https://repo.maven.apache.org/maven2/org/apache/maven/shared/maven-filtering/1.2/maven-filtering-1.2.jar
[windows-jdk8] [INFO] Downloading: https://repo.maven.apache.org/maven2/org/apache/maven/shared/maven-shared-utils/0.3/maven-shared-utils-0.3.jar
[windows-jdk8] [INFO] Downloading: https://repo.maven.apache.org/maven2/org/codehaus/plexus/plexus-interpolation/1.19/plexus-interpolation-1.19.jar
[windows-jdk8] [INFO] Downloaded: https://repo.maven.apache.org/maven2/org/apache/maven/shared/maven-filtering/1.2/maven-filtering-1.2.jar
(44 kB at 1.5 MB/s)
[windows-jdk8] [INFO] Downloaded: https://repo.maven.apache.org/maven2/org/codehaus/plexus/plexus-interpolation/1.19/plexus-interpolation-1.19.jar
(62 kB at 1.7 MB/s)
[windows-jdk8] [INFO] Downloaded: https://repo.maven.apache.org/maven2/org/apache/maven/shared/maven-shared-utils/0.3/maven-shared-utils-0.3.jar
(155 kB at 4.1 MB/s)
[windows-jdk8] [INFO] Downloaded: https://repo.maven.apache.org/maven2/org/codehaus/plexus/plexus-utils/3.0.15/plexus-utils-3.0.15.jar
(239 kB at 6.0 MB/s)
[windows-jdk8] [INFO] Using 'UTF-8' encoding to copy filtered resources.
[windows-jdk8] [INFO] Copying 22 resources
[windows-jdk8] [INFO] Copying 3 resources
[windows-jdk8] [INFO] 
[windows-jdk8] [INFO] --- maven-compiler-plugin:3.5.1:compile (default-compile) @ maven-javadoc-plugin
---
[windows-jdk8] [INFO] Downloading: https://repo.maven.apache.org/maven2/org/apache/maven/shared/maven-shared-incremental/1.1/maven-shared-incremental-1.1.pom
[windows-jdk8] [INFO] Downloaded: https://repo.maven.apache.org/maven2/org/apache/maven/shared/maven-shared-incremental/1.1/maven-shared-incremental-1.1.pom
(4.7 kB at 279 kB/s)
[windows-jdk8] [INFO] Downloading: https://repo.maven.apache.org/maven2/org/apache/maven/shared/maven-shared-utils/0.1/maven-shared-utils-0.1.pom
[windows-jdk8] [INFO] Downloaded: https://repo.maven.apache.org/maven2/org/apache/maven/shared/maven-shared-utils/0.1/maven-shared-utils-0.1.pom
(4.0 kB at 193 kB/s)
[windows-jdk8] [INFO] Downloading: https://repo.maven.apache.org/maven2/org/codehaus/plexus/plexus-compiler-api/2.7/plexus-compiler-api-2.7.pom
[windows-jdk8] [INFO] Downloaded: https://repo.maven.apache.org/maven2/org/codehaus/plexus/plexus-compiler-api/2.7/plexus-compiler-api-2.7.pom
(891 B at 99 kB/s)
[windows-jdk8] [INFO] Downloading: https://repo.maven.apache.org/maven2/org/codehaus/plexus/plexus-compiler/2.7/plexus-compiler-2.7.pom
[windows-jdk8] [INFO] Downloaded: https://repo.maven.apache.org/maven2/org/codehaus/plexus/plexus-compiler/2.7/plexus-compiler-2.7.pom
(4.9 kB at 705 kB/s)
[windows-jdk8] [INFO] Downloading: https://repo.maven.apache.org/maven2/org/codehaus/plexus/plexus-compiler-manager/2.7/plexus-compiler-manager-2.7.pom
[windows-jdk8] [INFO] Downloaded: https://repo.maven.apache.org/maven2/org/codehaus/plexus/plexus-compiler-manager/2.7/plexus-compiler-manager-2.7.pom
(711 B at 102 kB/s)
[windows-jdk8] [INFO] Downloading: https://repo.maven.apache.org/maven2/org/codehaus/plexus/plexus-compiler-javac/2.7/plexus-compiler-javac-2.7.pom
[windows-jdk8] [INFO] Downloaded: https://repo.maven.apache.org/maven2/org/codehaus/plexus/plexus-compiler-javac/2.7/plexus-compiler-javac-2.7.pom
(792 B at 61 kB/s)
[windows-jdk8] [INFO] Downloading: https://repo.maven.apache.org/maven2/org/codehaus/plexus/plexus-compilers/2.7/plexus-compilers-2.7.pom
[windows-jdk8] [INFO] Downloaded: https://repo.maven.apache.org/maven2/org/codehaus/plexus/plexus-compilers/2.7/plexus-compilers-2.7.pom
(1.4 kB at 230 kB/s)
[windows-jdk8] [INFO] Downloading: https://repo.maven.apache.org/maven2/org/codehaus/plexus/plexus-compiler-javac/2.7/plexus-compiler-javac-2.7.jar
[windows-jdk8] [INFO] Downloading: https://repo.maven.apache.org/maven2/org/apache/maven/shared/maven-shared-incremental/1.1/maven-shared-incremental-1.1.jar
[windows-jdk8] [INFO] Downloading: https://repo.maven.apache.org/maven2/org/codehaus/plexus/plexus-compiler-api/2.7/plexus-compiler-api-2.7.jar
[windows-jdk8] [INFO] Downloading: https://repo.maven.apache.org/maven2/org/codehaus/plexus/plexus-compiler-manager/2.7/plexus-compiler-manager-2.7.jar
[windows-jdk8] [INFO] Downloaded: https://repo.maven.apache.org/maven2/org/codehaus/plexus/plexus-compiler-api/2.7/plexus-compiler-api-2.7.jar
(26 kB at 524 kB/s)
[windows-jdk8] [INFO] Downloaded: https://repo.maven.apache.org/maven2/org/codehaus/plexus/plexus-compiler-manager/2.7/plexus-compiler-manager-2.7.jar
(4.7 kB at 94 kB/s)
[windows-jdk8] [INFO] Downloaded: https://repo.maven.apache.org/maven2/org/apache/maven/shared/maven-shared-incremental/1.1/maven-shared-incremental-1.1.jar
(14 kB at 208 kB/s)
[windows-jdk8] [INFO] Downloaded: https://repo.maven.apache.org/maven2/org/codehaus/plexus/plexus-compiler-javac/2.7/plexus-compiler-javac-2.7.jar
(19 kB at 250 kB/s)
[windows-jdk8] [INFO] Changes detected - recompiling the module!
[windows-jdk8] [INFO] Compiling 36 source files to f:\jenkins\jenkins-slave\workspace\javadoc-plugin_MJAVADOC-504-H73AD7NET6QERU3OCBMULFVY22GE4X5GOJQHYCRXB6CQBY3JHYDQ\m\target\classes
[windows-jdk7] [INFO] ------------------------------------------------------------------------
[windows-jdk7] [INFO] BUILD FAILURE
[windows-jdk7] [INFO] ------------------------------------------------------------------------
[windows-jdk7] [INFO] Total time: 33.124 s
[windows-jdk7] [INFO] Finished at: 2018-01-02T17:15:13Z
[windows-jdk7] [INFO] Final Memory: 53M/1441M
[windows-jdk7] [INFO] ------------------------------------------------------------------------
[windows-jdk7] [INFO] [jenkins-event-spy] Generated F:\jenkins\jenkins-slave\workspace\javadoc-plugin_MJAVADOC-504-H73AD7NET6QERU3OCBMULFVY22GE4X5GOJQHYCRXB6CQBY3JHYDQ@tmp\withMaven0aebaf37\maven-spy-20180102-171440-985771117532277744307.log
[windows-jdk7] [ERROR] Failed to execute goal org.apache.maven.plugins:maven-plugin-plugin:3.5:descriptor
(default-descriptor) on project maven-javadoc-plugin: Execution default-descriptor of goal
org.apache.maven.plugins:maven-plugin-plugin:3.5:descriptor failed. NoSuchElementException
-> [Help 1]
[windows-jdk7] [ERROR] 
[windows-jdk7] [ERROR] To see the full stack trace of the errors, re-run Maven with the -e
switch.
[windows-jdk7] [ERROR] Re-run Maven using the -X switch to enable full debug logging.
[windows-jdk7] [ERROR] 
[windows-jdk7] [ERROR] For more information about the errors and possible solutions, please
read the following articles:
[windows-jdk7] [ERROR] [Help 1] http://cwiki.apache.org/confluence/display/MAVEN/PluginExecutionException
[windows-jdk7] Picked up JAVA_TOOL_OPTIONS: -Dmaven.ext.class.path="f:\jenkins\jenkins-slave\workspace\javadoc-plugin_MJAVADOC-504-H73AD7NET6QERU3OCBMULFVY22GE4X5GOJQHYCRXB6CQBY3JHYDQ@tmp\withMaven0aebaf37\pipeline-maven-spy.jar"
-Dorg.jenkinsci.plugins.pipeline.maven.reportsFolder="f:\jenkins\jenkins-slave\workspace\javadoc-plugin_MJAVADOC-504-H73AD7NET6QERU3OCBMULFVY22GE4X5GOJQHYCRXB6CQBY3JHYDQ@tmp\withMaven0aebaf37"

[linux-jdk8] [WARNING] Javadoc Warnings
[linux-jdk8] [WARNING] Picked up JAVA_TOOL_OPTIONS: -Dmaven.ext.class.path="/home/jenkins/jenkins-slave/workspace/javadoc-plugin_MJAVADOC-504-H73AD7NET6QERU3OCBMULFVY22GE4X5GOJQHYCRXB6CQBY3JHYDQ@tmp/withMavenbcf7e7a1/pipeline-maven-spy.jar"
-Dorg.jenkinsci.plugins.pipeline.maven.reportsFolder="/home/jenkins/jenkins-slave/workspace/javadoc-plugin_MJAVADOC-504-H73AD7NET6QERU3OCBMULFVY22GE4X5GOJQHYCRXB6CQBY3JHYDQ@tmp/withMavenbcf7e7a1"
[linux-jdk8] [ERROR] ProjectBuildingException for Mock for Artifact, hashCode: 491762195:
Error resolving project artifact: Could not find artifact commons-logging:commons-logging:pom:1.1.1
for project null
[Pipeline] [windows-jdk7] }
[Pipeline] [windows-jdk7] // dir
[Pipeline] [windows-jdk7] }
[windows-jdk7] [withMaven] Skip 'Generated Artifacts Publisher' disabled by configuration
[windows-jdk7] [withMaven] Skip 'Findbugs Publisher' disabled by configuration
[windows-jdk7] [withMaven] Skip 'Open Task Scanner Publisher' disabled by configuration
[Pipeline] [windows-jdk7] // withMaven
[Pipeline] [windows-jdk7] echo
[windows-jdk7] [FAIL FAST] This is the first failure and likely root cause
[Pipeline] [windows-jdk7] }
[Pipeline] [windows-jdk7] // stage
[Pipeline] [windows-jdk7] }
[Pipeline] [windows-jdk7] // node
[Pipeline] [windows-jdk7] }
[linux-jdk7] Sending interrupt signal to process
[windows-jdk7] Failed in branch windows-jdk7
[linux-jdk7] [WARNING] Javadoc Warnings
[linux-jdk7] [WARNING] Picked up JAVA_TOOL_OPTIONS: -Dmaven.ext.class.path="/home/jenkins/jenkins-slave/workspace/javadoc-plugin_MJAVADOC-504-H73AD7NET6QERU3OCBMULFVY22GE4X5GOJQHYCRXB6CQBY3JHYDQ@tmp/withMaven50a42dc9/pipeline-maven-spy.jar"
-Dorg.jenkinsci.plugins.pipeline.maven.reportsFolder="/home/jenkins/jenkins-slave/workspace/javadoc-plugin_MJAVADOC-504-H73AD7NET6QERU3OCBMULFVY22GE4X5GOJQHYCRXB6CQBY3JHYDQ@tmp/withMaven50a42dc9"
[linux-jdk7] Tests run: 1, Failures: 0, Errors: 0, Skipped: 0, Time elapsed: 3.487 sec - in
org.apache.maven.plugins.javadoc.TestJavadocReportTest
[linux-jdk7] Running org.apache.maven.plugins.javadoc.JavadocReportTest
[linux-jdk7] 
[linux-jdk7] Results :
[linux-jdk7] 
[linux-jdk7] Tests run: 11, Failures: 0, Errors: 0, Skipped: 0
[linux-jdk7] 
[linux-jdk7] [INFO] ------------------------------------------------------------------------
[linux-jdk7] [INFO] BUILD FAILURE
[linux-jdk7] [INFO] ------------------------------------------------------------------------
[linux-jdk7] [INFO] Total time: 38.403 s
[linux-jdk7] [INFO] Finished at: 2018-01-02T17:15:17Z
[linux-jdk7] [INFO] Final Memory: 52M/1814M
[linux-jdk7] [INFO] ------------------------------------------------------------------------
[linux-jdk7] [INFO] [jenkins-event-spy] Generated /home/jenkins/jenkins-slave/workspace/javadoc-plugin_MJAVADOC-504-H73AD7NET6QERU3OCBMULFVY22GE4X5GOJQHYCRXB6CQBY3JHYDQ@tmp/withMaven50a42dc9/maven-spy-20180102-171438-677210937787715190217.log
[linux-jdk7] [ERROR] Failed to execute goal org.apache.maven.plugins:maven-surefire-plugin:2.19.1:test
(default-test) on project maven-javadoc-plugin: Execution default-test of goal org.apache.maven.plugins:maven-surefire-plugin:2.19.1:test
failed: The forked VM terminated without properly saying goodbye. VM crash or System.exit
called?
[linux-jdk7] [ERROR] Command was /bin/sh -c cd /home/jenkins/jenkins-slave/workspace/javadoc-plugin_MJAVADOC-504-H73AD7NET6QERU3OCBMULFVY22GE4X5GOJQHYCRXB6CQBY3JHYDQ/m
&& /usr/local/asfpackages/java/jdk1.7.0_80/jre/bin/java -jar /home/jenkins/jenkins-slave/workspace/javadoc-plugin_MJAVADOC-504-H73AD7NET6QERU3OCBMULFVY22GE4X5GOJQHYCRXB6CQBY3JHYDQ/m/target/surefire/surefirebooter1551640049874565288.jar
/home/jenkins/jenkins-slave/workspace/javadoc-plugin_MJAVADOC-504-H73AD7NET6QERU3OCBMULFVY22GE4X5GOJQHYCRXB6CQBY3JHYDQ/m/target/surefire/surefire3323795610380521521tmp
/home/jenkins/jenkins-slave/workspace/javadoc-plugin_MJAVADOC-504-H73AD7NET6QERU3OCBMULFVY22GE4X5GOJQHYCRXB6CQBY3JHYDQ/m/target/surefire/surefire_06976624970953115832tmp
[linux-jdk7] [ERROR] -> [Help 1]
[linux-jdk7] [ERROR] 
[linux-jdk7] [ERROR] To see the full stack trace of the errors, re-run Maven with the -e switch.
[linux-jdk7] [ERROR] Re-run Maven using the -X switch to enable full debug logging.
[linux-jdk7] [ERROR] 
[linux-jdk7] [ERROR] For more information about the errors and possible solutions, please
read the following articles:
[linux-jdk7] [ERROR] [Help 1] http://cwiki.apache.org/confluence/display/MAVEN/PluginExecutionException
[linux-jdk9] WARNING: An illegal reflective access operation has occurred
[linux-jdk9] WARNING: Illegal reflective access by org.apache.commons.lang3.builder.EqualsBuilder
(file:/home/jenkins/jenkins-slave/workspace/javadoc-plugin_MJAVADOC-504-H73AD7NET6QERU3OCBMULFVY22GE4X5GOJQHYCRXB6CQBY3JHYDQ%402/.repository/org/apache/commons/commons-lang3/3.5/commons-lang3-3.5.jar)
to field java.util.ArrayList.serialVersionUID
[linux-jdk9] WARNING: Please consider reporting this to the maintainers of org.apache.commons.lang3.builder.EqualsBuilder
[linux-jdk9] WARNING: Use --illegal-access=warn to enable warnings of further illegal reflective
access operations
[linux-jdk9] WARNING: All illegal access operations will be denied in a future release
[linux-jdk9] Tests run: 8, Failures: 0, Errors: 0, Skipped: 0, Time elapsed: 5.838 sec - in
org.apache.maven.plugins.javadoc.JavadocUtilTest
[linux-jdk9] Running org.apache.maven.plugins.javadoc.JavadocReportTest
[linux-jdk8] [WARNING] Javadoc Warnings
[linux-jdk8] [WARNING] Picked up JAVA_TOOL_OPTIONS: -Dmaven.ext.class.path="/home/jenkins/jenkins-slave/workspace/javadoc-plugin_MJAVADOC-504-H73AD7NET6QERU3OCBMULFVY22GE4X5GOJQHYCRXB6CQBY3JHYDQ@tmp/withMavenbcf7e7a1/pipeline-maven-spy.jar"
-Dorg.jenkinsci.plugins.pipeline.maven.reportsFolder="/home/jenkins/jenkins-slave/workspace/javadoc-plugin_MJAVADOC-504-H73AD7NET6QERU3OCBMULFVY22GE4X5GOJQHYCRXB6CQBY3JHYDQ@tmp/withMavenbcf7e7a1"
[linux-jdk8] [ERROR] ProjectBuildingException for Mock for Artifact, hashCode: 1907228381:
Error resolving project artifact: Could not find artifact commons-logging:commons-logging:pom:1.1.1
for project null
[linux-jdk8] Sending interrupt signal to process
[linux-jdk9] Sending interrupt signal to process
[linux-jdk9] [WARNING] Unable to find the javadoc version: Exit code: 143 - Picked up JAVA_TOOL_OPTIONS:
-Dmaven.ext.class.path="/home/jenkins/jenkins-slave/workspace/javadoc-plugin_MJAVADOC-504-H73AD7NET6QERU3OCBMULFVY22GE4X5GOJQHYCRXB6CQBY3JHYDQ@2@tmp/withMaven50fc3a0a/pipeline-maven-spy.jar"
-Dorg.jenkinsci.plugins.pipeline.maven.reportsFolder="/home/jenkins/jenkins-slave/workspace/javadoc-plugin_MJAVADOC-504-H73AD7NET6QERU3OCBMULFVY22GE4X5GOJQHYCRXB6CQBY3JHYDQ@2@tmp/withMaven50fc3a0a"

[linux-jdk9] 
[linux-jdk9] Command line was:/home/jenkins/tools/java/latest1.9/bin/javadoc -J-version
[linux-jdk9] [WARNING] Using the Java version instead of, i.e. 9
[linux-jdk9] Terminated
[windows-jdk8] Sending interrupt signal to process
[linux-jdk8] [WARNING] Source files encoding has not been set, using platform encoding ISO-8859-1,
i.e. build is platform dependent!
[linux-jdk8] [WARNING] Source files encoding has not been set, using platform encoding ISO-8859-1,
i.e. build is platform dependent!
[linux-jdk8] /home/jenkins/jenkins-slave/workspace/javadoc-plugin_MJAVADOC-504-H73AD7NET6QERU3OCBMULFVY22GE4X5GOJQHYCRXB6CQBY3JHYDQ/m@tmp/durable-b9bcd14f/script.sh:
line 2: 30938 Terminated              mvn -P+run-its -Dmaven.test.failure.ignore=true -Dfindbugs.failOnError=false
-Dfindbugs.skip=true clean verify
[windows-jdk9] [INFO] /F:/jenkins/jenkins-slave/workspace/javadoc-plugin_MJAVADOC-504-H73AD7NET6QERU3OCBMULFVY22GE4X5GOJQHYCRXB6CQBY3JHYDQ@2/m/src/main/java/org/apache/maven/plugins/javadoc/JavadocUtil.java:
Some input files use or override a deprecated API.
[windows-jdk9] [INFO] /F:/jenkins/jenkins-slave/workspace/javadoc-plugin_MJAVADOC-504-H73AD7NET6QERU3OCBMULFVY22GE4X5GOJQHYCRXB6CQBY3JHYDQ@2/m/src/main/java/org/apache/maven/plugins/javadoc/JavadocUtil.java:
Recompile with -Xlint:deprecation for details.
[windows-jdk9] [INFO] /F:/jenkins/jenkins-slave/workspace/javadoc-plugin_MJAVADOC-504-H73AD7NET6QERU3OCBMULFVY22GE4X5GOJQHYCRXB6CQBY3JHYDQ@2/m/src/main/java/org/apache/maven/plugins/javadoc/AbstractJavadocMojo.java:
Some input files use unchecked or unsafe operations.
[windows-jdk9] [INFO] /F:/jenkins/jenkins-slave/workspace/javadoc-plugin_MJAVADOC-504-H73AD7NET6QERU3OCBMULFVY22GE4X5GOJQHYCRXB6CQBY3JHYDQ@2/m/src/main/java/org/apache/maven/plugins/javadoc/AbstractJavadocMojo.java:
Recompile with -Xlint:unchecked for details.
[windows-jdk9] [INFO] 
[windows-jdk9] [INFO] --- maven-plugin-plugin:3.5:descriptor (default-descriptor) @ maven-javadoc-plugin
---
[windows-jdk9] [INFO] Using 'UTF-8' encoding to read mojo source files.
[windows-jdk9] [INFO] java-javadoc mojo extractor found 0 mojo descriptor.
[windows-jdk9] [INFO] java-annotations mojo extractor found 15 mojo descriptors.
[windows-jdk9] Sending interrupt signal to process
[Pipeline] [linux-jdk8] }
[Pipeline] [linux-jdk7] }
[Pipeline] [linux-jdk9] }
[Pipeline] [linux-jdk8] // dir
[Pipeline] [linux-jdk7] // dir
[Pipeline] [linux-jdk9] // dir
[Pipeline] [linux-jdk8] }
[linux-jdk8] [withMaven] One or multiple Maven executions have been ignored by the Jenkins
Pipeline Maven Plugin because they have been interrupted before completion (1). See Pipeline
Maven Plugin FAQ for more details.
[Pipeline] [linux-jdk7] }
[linux-jdk7] [Fast Archiver] No prior successful build to compare, so performing full copy
of artifacts
[linux-jdk7] [withMaven] junitPublisher - Archive test results for Maven artifact org.apache.maven.plugins:maven-javadoc-plugin:3.0.1-SNAPSHOT
generated by maven-surefire-plugin:test (default-test): m/target/surefire-reports/*.xml
[linux-jdk7] [withMaven] junitPublisher - Jenkins JUnit Attachments Plugin not found, can't
publish test attachments.Recording test results
[linux-jdk7] [withMaven] openTasksPublisher - Scan Tasks for Maven artifact org.apache.maven.plugins:maven-javadoc-plugin:3.0.1-SNAPSHOT
in source directory m/src/main/java
[linux-jdk7] [TASKS] Scanning folder '/home/jenkins/jenkins-slave/workspace/javadoc-plugin_MJAVADOC-504-H73AD7NET6QERU3OCBMULFVY22GE4X5GOJQHYCRXB6CQBY3JHYDQ'
for files matching the pattern 'm/src/main/java/**/*' - excludes: null
[linux-jdk7] [TASKS] Found 23 files to scan for tasks
[linux-jdk7] [TASKS] Found 6 open tasks.
[linux-jdk7] Skipping warnings blame since pipelines do not have an SCM link.%n
[Pipeline] [linux-jdk9] }
[linux-jdk9] [withMaven] One or multiple Maven executions have been ignored by the Jenkins
Pipeline Maven Plugin because they have been interrupted before completion (1). See Pipeline
Maven Plugin FAQ for more details.
[Pipeline] [linux-jdk8] // withMaven
[Pipeline] [linux-jdk7] // withMaven
[Pipeline] [linux-jdk9] // withMaven
[Pipeline] [linux-jdk8] echo
[linux-jdk8] [FAIL FAST] windows-jdk7 had first failure, ignoring script returned exit code
143
[Pipeline] [linux-jdk8] }
[Pipeline] [linux-jdk7] echo
[linux-jdk7] [FAIL FAST] windows-jdk7 had first failure, ignoring script returned exit code
1
[Pipeline] [linux-jdk7] }
[Pipeline] [linux-jdk9] echo
[linux-jdk9] [FAIL FAST] windows-jdk7 had first failure, ignoring script returned exit code
143
[Pipeline] [linux-jdk9] }
[Pipeline] [linux-jdk8] // stage
[Pipeline] [linux-jdk7] // stage
[Pipeline] [linux-jdk9] // stage
[Pipeline] [linux-jdk7] }
[Pipeline] [linux-jdk8] }
[Pipeline] [linux-jdk9] }
[Pipeline] [linux-jdk7] // node
[Pipeline] [linux-jdk8] // node
[Pipeline] [linux-jdk9] // node
[Pipeline] [linux-jdk7] }
[Pipeline] [linux-jdk8] }
[Pipeline] [linux-jdk9] }
[windows-jdk8] After 10s process did not stop
[Pipeline] [windows-jdk8] }
[Pipeline] [windows-jdk8] // dir
[Pipeline] [windows-jdk8] }
[windows-jdk8] [withMaven] One or multiple Maven executions have been ignored by the Jenkins
Pipeline Maven Plugin because they have been interrupted before completion (1). See Pipeline
Maven Plugin FAQ for more details.
[Pipeline] [windows-jdk8] // withMaven
[Pipeline] [windows-jdk8] echo
[windows-jdk8] [FAIL FAST] windows-jdk7 had first failure, ignoring null
[Pipeline] [windows-jdk8] }
[Pipeline] [windows-jdk8] // stage
[Pipeline] [windows-jdk8] }
[Pipeline] [windows-jdk8] // node
[Pipeline] [windows-jdk8] }
[windows-jdk9] After 10s process did not stop
[Pipeline] [windows-jdk9] }
[Pipeline] [windows-jdk9] // dir
[Pipeline] [windows-jdk9] }
[windows-jdk9] [withMaven] One or multiple Maven executions have been ignored by the Jenkins
Pipeline Maven Plugin because they have been interrupted before completion (1). See Pipeline
Maven Plugin FAQ for more details.
[Pipeline] [windows-jdk9] // withMaven
[Pipeline] [windows-jdk9] echo
[windows-jdk9] [FAIL FAST] windows-jdk7 had first failure, ignoring null
[Pipeline] [windows-jdk9] }
[Pipeline] [windows-jdk9] // stage
[Pipeline] [windows-jdk9] }
[Pipeline] [windows-jdk9] // node
[Pipeline] [windows-jdk9] }
[Pipeline] // parallel
[Pipeline] echo
***** FAST FAILURE *****

Fast failure triggered by windows-jdk7

***** FAST FAILURE *****
[Pipeline] stage
[Pipeline] { (Notifications)
[Pipeline] echo
Build result: FAILURE
[Pipeline] jiraIssueSelector
[Pipeline] emailext
Mime
  • Unnamed multipart/mixed (inline, None, 0 bytes)
View raw message