maven-notifications mailing list archives

Site index · List index
Message view « Date » · « Thread »
Top « Date » · « Thread »
From Apache Jenkins Server <jenk...@builds.apache.org>
Subject Build unstable in Jenkins: Maven TLP » maven-javadoc-plugin » master #17
Date Tue, 02 Jan 2018 13:56:53 GMT
See https://builds.apache.org/job/maven-box/job/maven-javadoc-plugin/job/master/17/

No changes.

5 tests failed.
FAILED:  org.apache.maven.plugins.javadoc.JavadocReportTest.testJavadocResources

Error Message:
This bug appeared in JDK8 and was planned to be fixed in JDK9, see JDK-8032205

Stack Trace:
junit.framework.AssertionFailedError: This bug appeared in JDK8 and was planned to be fixed
in JDK9, see JDK-8032205
	at org.apache.maven.plugins.javadoc.JavadocReportTest.testJavadocResources(JavadocReportTest.java:657)


FAILED:  org.apache.maven.plugins.javadoc.JavadocReportTest.testDefaultConfiguration

Error Message:
null

Stack Trace:
junit.framework.AssertionFailedError
	at org.apache.maven.plugins.javadoc.JavadocReportTest.testDefaultConfiguration(JavadocReportTest.java:231)


FAILED:  org.apache.maven.plugins.javadoc.JavadocReportTest.testDefaultConfiguration

Error Message:
null

Stack Trace:
junit.framework.AssertionFailedError
	at org.apache.maven.plugins.javadoc.JavadocReportTest.testDefaultConfiguration(JavadocReportTest.java:231)


FAILED:  org.apache.maven.plugins.javadoc.JavadocReportTest.testDefaultConfiguration

Error Message:
null

Stack Trace:
junit.framework.AssertionFailedError
	at org.apache.maven.plugins.javadoc.JavadocReportTest.testDefaultConfiguration(JavadocReportTest.java:231)


FAILED:  org.apache.maven.plugins.javadoc.JavadocReportTest.testDefaultConfiguration

Error Message:
null

Stack Trace:
junit.framework.AssertionFailedError
	at org.apache.maven.plugins.javadoc.JavadocReportTest.testDefaultConfiguration(JavadocReportTest.java:231)




Build log:
[...truncated 577.44 KB...]
[windows-jdk8] [INFO] Building: MJAVADOC-414\pom.xml
[Pipeline] [linux-jdk9] }
[linux-jdk9] [withMaven] Skip 'Generated Artifacts Publisher' disabled by configuration
[linux-jdk9] [withMaven] junitPublisher - Archive test results for Maven artifact org.apache.maven.plugins:maven-javadoc-plugin:3.0.1-SNAPSHOT
generated by maven-surefire-plugin:test (default-test): m/target/surefire-reports/*.xml
[linux-jdk9] [withMaven] junitPublisher - Jenkins JUnit Attachments Plugin not found, can't
publish test attachments.Recording test results
[linux-jdk9] [withMaven] Skip 'Findbugs Publisher' disabled by configuration
[linux-jdk9] [withMaven] Skip 'Open Task Scanner Publisher' disabled by configuration
[Pipeline] [linux-jdk9] // withMaven
[Pipeline] [linux-jdk9] }
[Pipeline] [linux-jdk9] // stage
[Pipeline] [linux-jdk9] }
[Pipeline] [linux-jdk9] // node
[Pipeline] [linux-jdk9] }
[windows-jdk9] [INFO] ..SUCCESS (19.2 s)
[windows-jdk9] [INFO] Building: MJAVADOC-278\pom.xml
[windows-jdk7] [INFO] run script verify.bsh
[windows-jdk7] [INFO] ..SUCCESS (10.0 s)
[windows-jdk7] [INFO] Building: MJAVADOC-437\pom.xml
[windows-jdk8] [INFO] run script verify.bsh
[windows-jdk8] [INFO] ..SUCCESS (10.5 s)
[windows-jdk8] [INFO] Building: MJAVADOC-437\pom.xml
[windows-jdk9] [INFO] run script verify.bsh
[windows-jdk9] [INFO] ..SUCCESS (11.3 s)
[windows-jdk9] [INFO] Building: MJAVADOC-320\pom.xml
[windows-jdk7] [INFO] run script verify.bsh
[windows-jdk7] [INFO] ..SUCCESS (12.4 s)
[windows-jdk7] [INFO] Building: MJAVADOC-494_aggregate-repositories\pom.xml
[windows-jdk8] [INFO] run script verify.bsh
[windows-jdk8] [INFO] ..SUCCESS (12.6 s)
[windows-jdk8] [INFO] Building: MJAVADOC-494_aggregate-repositories\pom.xml
[windows-jdk7] [INFO] ..SUCCESS (10.8 s)
[windows-jdk7] [INFO] Building: MJAVADOC-497\pom.xml
[windows-jdk9] [INFO] run script verify.bsh
[windows-jdk9] [INFO] ..SUCCESS (16.3 s)
[windows-jdk9] [INFO] Building: MJAVADOC-325\pom.xml
[windows-jdk8] [INFO] ..SUCCESS (11.5 s)
[windows-jdk8] [INFO] Building: MJAVADOC-497\pom.xml
[windows-jdk7] [INFO] run script verify.bsh
[windows-jdk7] [INFO] ..SUCCESS (10.1 s)
[windows-jdk7] [INFO] Building: MJAVADOC-498_aggr_modulepath\pom.xml
[windows-jdk7] [INFO] ..SKIPPED due to JRE version
[windows-jdk7] [INFO] Building: MJAVADOC-498_mm_modulepath\pom.xml
[windows-jdk7] [INFO] ..SKIPPED due to JRE version
[windows-jdk7] [INFO] Building: MJAVADOC-498_modulepath\pom.xml
[windows-jdk7] [INFO] ..SKIPPED due to JRE version
[windows-jdk7] [INFO] Building: MJAVADOC-508\pom.xml
[windows-jdk9] [INFO] run script verify.bsh
[windows-jdk9] [INFO] ..SUCCESS (9.1 s)
[windows-jdk9] [INFO] Building: MJAVADOC-365\pom.xml
[windows-jdk8] [INFO] run script verify.bsh
[windows-jdk8] [INFO] ..SUCCESS (10.0 s)
[windows-jdk8] [INFO] Building: MJAVADOC-498_aggr_modulepath\pom.xml
[windows-jdk8] [INFO] ..SKIPPED due to JRE version
[windows-jdk8] [INFO] Building: MJAVADOC-498_mm_modulepath\pom.xml
[windows-jdk8] [INFO] ..SKIPPED due to JRE version
[windows-jdk8] [INFO] Building: MJAVADOC-498_modulepath\pom.xml
[windows-jdk8] [INFO] ..SKIPPED due to JRE version
[windows-jdk8] [INFO] Building: MJAVADOC-508\pom.xml
[windows-jdk7] [INFO] ..SUCCESS (8.6 s)
[windows-jdk7] [INFO] Building: site-failOnError\pom.xml
[windows-jdk9] [INFO] run script verify.bsh
[windows-jdk9] [INFO] ..SUCCESS (9.4 s)
[windows-jdk9] [INFO] Building: MJAVADOC-369\pom.xml
[windows-jdk8] [INFO] ..SUCCESS (7.9 s)
[windows-jdk8] [INFO] Building: site-failOnError\pom.xml
[windows-jdk7] [INFO] ..SUCCESS (15.3 s)
[windows-jdk7] [INFO] 
[windows-jdk7] [INFO] --- mrm-maven-plugin:1.1.0:stop (repository) @ maven-javadoc-plugin
---
[windows-jdk7] [INFO] Stopping Mock Repository Manager on http://localhost:50118
[windows-jdk7] [INFO] Stopped SocketConnector@0.0.0.0:50118
[windows-jdk7] [INFO] Mock Repository Manager http://localhost:50118 is stopped.
[windows-jdk7] [INFO] 
[windows-jdk7] [INFO] --- mrm-maven-plugin:1.1.0:stop (3rdparty) @ maven-javadoc-plugin ---
[windows-jdk7] [INFO] Stopping Mock Repository Manager on http://localhost:50119
[windows-jdk7] [INFO] Stopped SocketConnector@0.0.0.0:50119
[windows-jdk7] [INFO] Mock Repository Manager http://localhost:50119 is stopped.
[windows-jdk7] [INFO] 
[windows-jdk7] [INFO] --- maven-checkstyle-plugin:2.15:check (checkstyle-check) @ maven-javadoc-plugin
---
[windows-jdk8] [INFO] ..SUCCESS (15.0 s)
[windows-jdk8] [INFO] 
[windows-jdk8] [INFO] --- mrm-maven-plugin:1.1.0:stop (repository) @ maven-javadoc-plugin
---
[windows-jdk8] [INFO] Stopping Mock Repository Manager on http://localhost:50123
[windows-jdk8] [INFO] Stopped SocketConnector@0.0.0.0:50123
[windows-jdk8] [INFO] Mock Repository Manager http://localhost:50123 is stopped.
[windows-jdk8] [INFO] 
[windows-jdk8] [INFO] --- mrm-maven-plugin:1.1.0:stop (3rdparty) @ maven-javadoc-plugin ---
[windows-jdk8] [INFO] Stopping Mock Repository Manager on http://localhost:50124
[windows-jdk8] [INFO] Stopped SocketConnector@0.0.0.0:50124
[windows-jdk8] [INFO] Mock Repository Manager http://localhost:50124 is stopped.
[windows-jdk8] [INFO] 
[windows-jdk8] [INFO] --- maven-checkstyle-plugin:2.15:check (checkstyle-check) @ maven-javadoc-plugin
---
[windows-jdk7] [INFO] There are 4 errors reported by Checkstyle 6.1.1 with config/maven_checks.xml
ruleset.
[windows-jdk7] [INFO] Ignored 4 errors, 0 violation remaining.
[windows-jdk7] [INFO] 
[windows-jdk7] [INFO] --- maven-invoker-plugin:2.0.0:verify (integration-test) @ maven-javadoc-plugin
---
[windows-jdk7] [INFO] -------------------------------------------------
[windows-jdk7] [INFO] Build Summary:
[windows-jdk7] [INFO]   Passed: 31, Failed: 1, Errors: 0, Skipped: 3
[windows-jdk7] [INFO] -------------------------------------------------
[windows-jdk7] [WARNING] The following builds failed:
[windows-jdk7] [WARNING] *  detectLinks\pom.xml
[windows-jdk7] [INFO] -------------------------------------------------
[windows-jdk7] [WARNING] Ignoring that 1 build failed.
[windows-jdk7] [INFO] ------------------------------------------------------------------------
[windows-jdk7] [INFO] BUILD SUCCESS
[windows-jdk7] [INFO] ------------------------------------------------------------------------
[windows-jdk7] [INFO] Total time: 10:30 min
[windows-jdk7] [INFO] Finished at: 2018-01-02T13:54:07Z
[windows-jdk7] [INFO] Final Memory: 70M/1806M
[windows-jdk7] [INFO] ------------------------------------------------------------------------
[windows-jdk7] [INFO] [jenkins-event-spy] Generated F:\jenkins\jenkins-slave\workspace\maven-javadoc-plugin_master-XEOGALQNOP5LSNOEDUT42L6QGQHATWO55CM3NEKN4WGK3JAPU26Q@tmp\withMavenfefaaafd\maven-spy-20180102-134337-314486172426950223047.log
[windows-jdk7] Picked up JAVA_TOOL_OPTIONS: -Dmaven.ext.class.path="f:\jenkins\jenkins-slave\workspace\maven-javadoc-plugin_master-XEOGALQNOP5LSNOEDUT42L6QGQHATWO55CM3NEKN4WGK3JAPU26Q@tmp\withMavenfefaaafd\pipeline-maven-spy.jar"
-Dorg.jenkinsci.plugins.pipeline.maven.reportsFolder="f:\jenkins\jenkins-slave\workspace\maven-javadoc-plugin_master-XEOGALQNOP5LSNOEDUT42L6QGQHATWO55CM3NEKN4WGK3JAPU26Q@tmp\withMavenfefaaafd"

[windows-jdk8] [INFO] There are 4 errors reported by Checkstyle 6.1.1 with config/maven_checks.xml
ruleset.
[windows-jdk8] [INFO] Ignored 4 errors, 0 violation remaining.
[windows-jdk8] [INFO] 
[windows-jdk8] [INFO] --- maven-invoker-plugin:2.0.0:verify (integration-test) @ maven-javadoc-plugin
---
[windows-jdk8] [INFO] -------------------------------------------------
[windows-jdk8] [INFO] Build Summary:
[windows-jdk8] [INFO]   Passed: 31, Failed: 1, Errors: 0, Skipped: 3
[windows-jdk8] [INFO] -------------------------------------------------
[windows-jdk8] [WARNING] The following builds failed:
[windows-jdk8] [WARNING] *  detectLinks\pom.xml
[windows-jdk8] [INFO] -------------------------------------------------
[windows-jdk8] [WARNING] Ignoring that 1 build failed.
[windows-jdk8] [INFO] ------------------------------------------------------------------------
[windows-jdk8] [INFO] BUILD SUCCESS
[windows-jdk8] [INFO] ------------------------------------------------------------------------
[windows-jdk8] [INFO] Total time: 10:30 min
[windows-jdk8] [INFO] Finished at: 2018-01-02T13:54:08Z
[Pipeline] [windows-jdk7] }
[Pipeline] [windows-jdk7] // dir
[windows-jdk8] [INFO] Final Memory: 72M/1911M
[windows-jdk8] [INFO] ------------------------------------------------------------------------
[windows-jdk8] [INFO] [jenkins-event-spy] Generated F:\jenkins\jenkins-slave\workspace\maven-javadoc-plugin_master-XEOGALQNOP5LSNOEDUT42L6QGQHATWO55CM3NEKN4WGK3JAPU26Q@2@tmp\withMavencdc9d5de\maven-spy-20180102-134336-8025614044314149509587.log
[windows-jdk8] Picked up JAVA_TOOL_OPTIONS: -Dmaven.ext.class.path="f:\jenkins\jenkins-slave\workspace\maven-javadoc-plugin_master-XEOGALQNOP5LSNOEDUT42L6QGQHATWO55CM3NEKN4WGK3JAPU26Q@2@tmp\withMavencdc9d5de\pipeline-maven-spy.jar"
-Dorg.jenkinsci.plugins.pipeline.maven.reportsFolder="f:\jenkins\jenkins-slave\workspace\maven-javadoc-plugin_master-XEOGALQNOP5LSNOEDUT42L6QGQHATWO55CM3NEKN4WGK3JAPU26Q@2@tmp\withMavencdc9d5de"

[Pipeline] [windows-jdk7] }
[windows-jdk7] [withMaven] Skip 'Generated Artifacts Publisher' disabled by configuration
[windows-jdk7] [withMaven] junitPublisher - Archive test results for Maven artifact org.apache.maven.plugins:maven-javadoc-plugin:3.0.1-SNAPSHOT
generated by maven-surefire-plugin:test (default-test): m\target\surefire-reports\*.xml
[windows-jdk7] [withMaven] junitPublisher - Jenkins JUnit Attachments Plugin not found, can't
publish test attachments.Recording test results
[windows-jdk7] [withMaven] Skip 'Findbugs Publisher' disabled by configuration
[windows-jdk7] [withMaven] Skip 'Open Task Scanner Publisher' disabled by configuration
[Pipeline] [windows-jdk7] // withMaven
[Pipeline] [windows-jdk7] }
[Pipeline] [windows-jdk7] // stage
[Pipeline] [windows-jdk7] }
[Pipeline] [windows-jdk7] // node
[Pipeline] [windows-jdk7] }
[Pipeline] [windows-jdk8] }
[Pipeline] [windows-jdk8] // dir
[Pipeline] [windows-jdk8] }
[windows-jdk8] [withMaven] Skip 'Generated Artifacts Publisher' disabled by configuration
[windows-jdk8] [withMaven] junitPublisher - Archive test results for Maven artifact org.apache.maven.plugins:maven-javadoc-plugin:3.0.1-SNAPSHOT
generated by maven-surefire-plugin:test (default-test): m\target\surefire-reports\*.xml
[windows-jdk8] [withMaven] junitPublisher - Jenkins JUnit Attachments Plugin not found, can't
publish test attachments.Recording test results
[windows-jdk8] [withMaven] Skip 'Findbugs Publisher' disabled by configuration
[windows-jdk8] [withMaven] Skip 'Open Task Scanner Publisher' disabled by configuration
[Pipeline] [windows-jdk8] // withMaven
[Pipeline] [windows-jdk8] }
[Pipeline] [windows-jdk8] // stage
[Pipeline] [windows-jdk8] }
[Pipeline] [windows-jdk8] // node
[Pipeline] [windows-jdk8] }
[windows-jdk9] [INFO] run script verify.bsh
[windows-jdk9] [INFO] ..SUCCESS (20.3 s)
[windows-jdk9] [INFO] Building: MJAVADOC-384\pom.xml
[windows-jdk9] [INFO] run script verify.bsh
[windows-jdk9] [INFO] ..SUCCESS (9.0 s)
[windows-jdk9] [INFO] Building: MJAVADOC-407\pom.xml
[windows-jdk9] [INFO] run script verify.bsh
[windows-jdk9] [INFO] ..SUCCESS (11.4 s)
[windows-jdk9] [INFO] Building: MJAVADOC-414\pom.xml
[windows-jdk9] [INFO] run script verify.bsh
[windows-jdk9] [INFO] ..SUCCESS (11.6 s)
[windows-jdk9] [INFO] Building: MJAVADOC-437\pom.xml
[windows-jdk9] [INFO] run script verify.bsh
[windows-jdk9] [INFO] ..SUCCESS (11.9 s)
[windows-jdk9] [INFO] Building: MJAVADOC-494_aggregate-repositories\pom.xml
[windows-jdk9] [INFO] ..SUCCESS (12.6 s)
[windows-jdk9] [INFO] Building: MJAVADOC-497\pom.xml
[windows-jdk9] [INFO] run script verify.bsh
[windows-jdk9] [INFO] ..SUCCESS (11.0 s)
[windows-jdk9] [INFO] Building: MJAVADOC-498_aggr_modulepath\pom.xml
[windows-jdk9] [INFO] ..SUCCESS (29.5 s)
[windows-jdk9] [INFO] Building: MJAVADOC-498_mm_modulepath\pom.xml
[windows-jdk9] [INFO] ..SUCCESS (15.8 s)
[windows-jdk9] [INFO] Building: MJAVADOC-498_modulepath\pom.xml
[windows-jdk9] [INFO] run script verify.groovy
[windows-jdk9] WARNING: An illegal reflective access operation has occurred
[windows-jdk9] WARNING: Illegal reflective access by org.codehaus.groovy.reflection.CachedClass$3$1
(file:/f:/jenkins/jenkins-slave/workspace/maven-javadoc-plugin_master-XEOGALQNOP5LSNOEDUT42L6QGQHATWO55CM3NEKN4WGK3JAPU26Q/.repository/org/codehaus/groovy/groovy/2.0.1/groovy-2.0.1.jar)
to method java.lang.Object.finalize()
[windows-jdk9] WARNING: Please consider reporting this to the maintainers of org.codehaus.groovy.reflection.CachedClass$3$1
[windows-jdk9] WARNING: Use --illegal-access=warn to enable warnings of further illegal reflective
access operations
[windows-jdk9] WARNING: All illegal access operations will be denied in a future release
[windows-jdk9] [INFO] ..SUCCESS (20.3 s)
[windows-jdk9] [INFO] Building: MJAVADOC-508\pom.xml
[windows-jdk9] [INFO] ..SUCCESS (9.4 s)
[windows-jdk9] [INFO] Building: site-failOnError\pom.xml
[windows-jdk9] [INFO] ..SUCCESS (15.2 s)
[windows-jdk9] [INFO] 
[windows-jdk9] [INFO] --- mrm-maven-plugin:1.1.0:stop (repository) @ maven-javadoc-plugin
---
[windows-jdk9] [INFO] Stopping Mock Repository Manager on http://localhost:50879
[windows-jdk9] [INFO] Stopped SocketConnector@0.0.0.0:50879
[windows-jdk9] [INFO] Mock Repository Manager http://localhost:50879 is stopped.
[windows-jdk9] [INFO] 
[windows-jdk9] [INFO] --- mrm-maven-plugin:1.1.0:stop (3rdparty) @ maven-javadoc-plugin ---
[windows-jdk9] [INFO] Stopping Mock Repository Manager on http://localhost:50880
[windows-jdk9] [INFO] Stopped SocketConnector@0.0.0.0:50880
[windows-jdk9] [INFO] Mock Repository Manager http://localhost:50880 is stopped.
[windows-jdk9] [INFO] 
[windows-jdk9] [INFO] --- maven-checkstyle-plugin:2.15:check (checkstyle-check) @ maven-javadoc-plugin
---
[windows-jdk9] [INFO] There are 4 errors reported by Checkstyle 6.1.1 with config/maven_checks.xml
ruleset.
[windows-jdk9] [INFO] Ignored 4 errors, 0 violation remaining.
[windows-jdk9] [INFO] 
[windows-jdk9] [INFO] --- maven-invoker-plugin:2.0.0:verify (integration-test) @ maven-javadoc-plugin
---
[windows-jdk9] [INFO] -------------------------------------------------
[windows-jdk9] [INFO] Build Summary:
[windows-jdk9] [INFO]   Passed: 34, Failed: 1, Errors: 0, Skipped: 0
[windows-jdk9] [INFO] -------------------------------------------------
[windows-jdk9] [WARNING] The following builds failed:
[windows-jdk9] [WARNING] *  detectLinks\pom.xml
[windows-jdk9] [INFO] -------------------------------------------------
[windows-jdk9] [WARNING] Ignoring that 1 build failed.
[windows-jdk9] [INFO] ------------------------------------------------------------------------
[windows-jdk9] [INFO] BUILD SUCCESS
[windows-jdk9] [INFO] ------------------------------------------------------------------------
[windows-jdk9] [INFO] Total time: 13:12 min
[windows-jdk9] [INFO] Finished at: 2018-01-02T13:56:50Z
[windows-jdk9] [INFO] Final Memory: 48M/159M
[windows-jdk9] [INFO] ------------------------------------------------------------------------
[windows-jdk9] [INFO] [jenkins-event-spy] Generated F:\jenkins\jenkins-slave\workspace\maven-javadoc-plugin_master-XEOGALQNOP5LSNOEDUT42L6QGQHATWO55CM3NEKN4WGK3JAPU26Q@tmp\withMaven546be4ef\maven-spy-20180102-134337-6612780642160313044993.log
[Pipeline] [windows-jdk9] }
[Pipeline] [windows-jdk9] // dir
[Pipeline] [windows-jdk9] }
[windows-jdk9] [withMaven] Skip 'Generated Artifacts Publisher' disabled by configuration
[windows-jdk9] [withMaven] junitPublisher - Archive test results for Maven artifact org.apache.maven.plugins:maven-javadoc-plugin:3.0.1-SNAPSHOT
generated by maven-surefire-plugin:test (default-test): m\target\surefire-reports\*.xml
[windows-jdk9] [withMaven] junitPublisher - Jenkins JUnit Attachments Plugin not found, can't
publish test attachments.Recording test results
[windows-jdk9] [withMaven] Skip 'Findbugs Publisher' disabled by configuration
[windows-jdk9] [withMaven] Skip 'Open Task Scanner Publisher' disabled by configuration
[Pipeline] [windows-jdk9] // withMaven
[Pipeline] [windows-jdk9] }
[Pipeline] [windows-jdk9] // stage
[Pipeline] [windows-jdk9] }
[Pipeline] [windows-jdk9] // node
[Pipeline] [windows-jdk9] }
[Pipeline] // parallel
[Pipeline] stage
[Pipeline] { (Notifications)
[Pipeline] echo
Build result: UNSTABLE
[Pipeline] jiraIssueSelector
[Pipeline] emailext
Mime
  • Unnamed multipart/mixed (inline, None, 0 bytes)
View raw message