maven-notifications mailing list archives

Site index · List index
Message view « Date » · « Thread »
Top « Date » · « Thread »
From Apache Jenkins Server <jenk...@builds.apache.org>
Subject Build failed in Jenkins: Maven TLP » maven-resolver-ant-tasks » master #7
Date Thu, 15 Feb 2018 18:52:33 GMT
See https://builds.apache.org/job/maven-box/job/maven-resolver-ant-tasks/job/master/7/

Changes:

* [maven-release-plugin] prepare for next development iteration
* [maven-release-plugin] prepare for next development iteration
* [maven-release-plugin] prepare for next development iteration
* [maven-release-plugin] prepare for next development iteration
* [maven-release-plugin] prepare for next development iteration

No tests ran.

Build log:
[...truncated 46.81 KB...]
[Pipeline] [linux-jdk7] {
[Pipeline] [linux-jdk8] dir
[linux-jdk8] Running in /home/jenkins/jenkins-slave/workspace/n-resolver-ant-tasks_master-PZI36OPNRAJBXJOAPEQN5EKT3YVHZTR3KX72Y4FQGBMQE6GFTARQ/m
[Pipeline] [linux-jdk8] {
[Pipeline] [linux-jdk9] dir
[linux-jdk9] Running in /home/jenkins/jenkins-slave/workspace/n-resolver-ant-tasks_master-PZI36OPNRAJBXJOAPEQN5EKT3YVHZTR3KX72Y4FQGBMQE6GFTARQ@2/m
[Pipeline] [linux-jdk9] {
[Pipeline] [windows-jdk8] dir
[windows-jdk8] Running in f:\jenkins\jenkins-slave\workspace\n-resolver-ant-tasks_master-PZI36OPNRAJBXJOAPEQN5EKT3YVHZTR3KX72Y4FQGBMQE6GFTARQ@2\m
[Pipeline] [windows-jdk8] {
[Pipeline] [linux-jdk7] isUnix
[Pipeline] [linux-jdk7] sh
[linux-jdk7] [m] Running shell script
[linux-jdk7] + mvn -P+run-its -Dmaven.test.failure.ignore=true -Dfindbugs.failOnError=false
clean verify
[linux-jdk7] ----- withMaven Wrapper script -----
[linux-jdk7] Picked up JAVA_TOOL_OPTIONS: -Dmaven.ext.class.path="/home/jenkins/jenkins-slave/workspace/n-resolver-ant-tasks_master-PZI36OPNRAJBXJOAPEQN5EKT3YVHZTR3KX72Y4FQGBMQE6GFTARQ@tmp/withMavenbc17c0ef/pipeline-maven-spy.jar"
-Dorg.jenkinsci.plugins.pipeline.maven.reportsFolder="/home/jenkins/jenkins-slave/workspace/n-resolver-ant-tasks_master-PZI36OPNRAJBXJOAPEQN5EKT3YVHZTR3KX72Y4FQGBMQE6GFTARQ@tmp/withMavenbc17c0ef"

[linux-jdk7] Apache Maven 3.5.2 (138edd61fd100ec658bfa2d307c43b76940a5d7d; 2017-10-18T07:58:13Z)
[linux-jdk7] Maven home: /home/jenkins/tools/maven/apache-maven-3.5.2
[linux-jdk7] Java version: 1.7.0_80, vendor: Oracle Corporation
[linux-jdk7] Java home: /usr/local/asfpackages/java/jdk1.7.0_80/jre
[linux-jdk7] Default locale: en_US, platform encoding: ISO-8859-1
[linux-jdk7] OS name: "linux", version: "4.4.0-109-generic", arch: "amd64", family: "unix"
[linux-jdk7] [INFO] [jenkins-event-spy] Generate /home/jenkins/jenkins-slave/workspace/n-resolver-ant-tasks_master-PZI36OPNRAJBXJOAPEQN5EKT3YVHZTR3KX72Y4FQGBMQE6GFTARQ@tmp/withMavenbc17c0ef/maven-spy-20180215-185226-5457267591490884923371.log.tmp
...
[linux-jdk7] [INFO] Scanning for projects...
[linux-jdk7] [INFO] 
[linux-jdk7] [INFO] ------------------------------------------------------------------------
[linux-jdk7] [INFO] Building Maven Artifact Resolver Ant Tasks 1.1.2-SNAPSHOT
[linux-jdk7] [INFO] ------------------------------------------------------------------------
[Pipeline] [linux-jdk8] isUnix
[Pipeline] [linux-jdk8] sh
[linux-jdk8] [m] Running shell script
[linux-jdk8] + mvn -P+run-its -Dmaven.test.failure.ignore=true -Dfindbugs.failOnError=false
-Dfindbugs.skip=true clean verify
[linux-jdk8] ----- withMaven Wrapper script -----
[linux-jdk8] Picked up JAVA_TOOL_OPTIONS: -Dmaven.ext.class.path="/home/jenkins/jenkins-slave/workspace/n-resolver-ant-tasks_master-PZI36OPNRAJBXJOAPEQN5EKT3YVHZTR3KX72Y4FQGBMQE6GFTARQ@tmp/withMaven7220170c/pipeline-maven-spy.jar"
-Dorg.jenkinsci.plugins.pipeline.maven.reportsFolder="/home/jenkins/jenkins-slave/workspace/n-resolver-ant-tasks_master-PZI36OPNRAJBXJOAPEQN5EKT3YVHZTR3KX72Y4FQGBMQE6GFTARQ@tmp/withMaven7220170c"

[linux-jdk8] Apache Maven 3.5.2 (138edd61fd100ec658bfa2d307c43b76940a5d7d; 2017-10-18T07:58:13Z)
[linux-jdk8] Maven home: /home/jenkins/tools/maven/apache-maven-3.5.2
[linux-jdk8] Java version: 1.8.0_152, vendor: Oracle Corporation
[linux-jdk8] Java home: /usr/local/asfpackages/java/jdk1.8.0_152/jre
[linux-jdk8] Default locale: en_US, platform encoding: ISO-8859-1
[linux-jdk8] OS name: "linux", version: "4.4.0-98-generic", arch: "amd64", family: "unix"
[Pipeline] [linux-jdk9] isUnix
[Pipeline] [linux-jdk9] sh
[linux-jdk9] [m] Running shell script
[Pipeline] [windows-jdk8] isUnix
[Pipeline] [windows-jdk8] bat
[windows-jdk8] [m] Running batch script
[Pipeline] [windows-jdk9] {
[linux-jdk7] [WARNING] The POM for org.apache.maven.resolver:maven-resolver-api:jar:1.1.1
is missing, no dependency information available
[linux-jdk7] [WARNING] The POM for org.apache.maven.resolver:maven-resolver-util:jar:1.1.1
is missing, no dependency information available
[linux-jdk7] [WARNING] The POM for org.apache.maven.resolver:maven-resolver-impl:jar:1.1.1
is missing, no dependency information available
[linux-jdk7] [WARNING] The POM for org.apache.maven.resolver:maven-resolver-connector-basic:jar:1.1.1
is missing, no dependency information available
[linux-jdk7] [WARNING] The POM for org.apache.maven.resolver:maven-resolver-transport-classpath:jar:1.1.1
is missing, no dependency information available
[linux-jdk7] [WARNING] The POM for org.apache.maven.resolver:maven-resolver-transport-file:jar:1.1.1
is missing, no dependency information available
[linux-jdk7] [WARNING] The POM for org.apache.maven.resolver:maven-resolver-transport-http:jar:1.1.1
is missing, no dependency information available
[linux-jdk7] [INFO] Downloading from central: https://repo.maven.apache.org/maven2/org/sonatype/forge/forge-parent/5/forge-parent-5.pom
[Pipeline] [windows-jdk9] stage
[Pipeline] [windows-jdk9] { (Checkout windows-jdk9)
[Pipeline] [windows-jdk7] }
[Pipeline] [windows-jdk9] dir
[windows-jdk9] Running in f:\jenkins\jenkins-slave\workspace\n-resolver-ant-tasks_master-PZI36OPNRAJBXJOAPEQN5EKT3YVHZTR3KX72Y4FQGBMQE6GFTARQ\m
[Pipeline] [windows-jdk9] {
[Pipeline] [windows-jdk9] checkout
[windows-jdk8] 
[windows-jdk8] f:\jenkins\jenkins-slave\workspace\n-resolver-ant-tasks_master-PZI36OPNRAJBXJOAPEQN5EKT3YVHZTR3KX72Y4FQGBMQE6GFTARQ@2\m>mvn
-P+run-its -Dmaven.test.failure.ignore=true -Dfindbugs.failOnError=false -Dfindbugs.skip=true
clean verify 
[windows-jdk8] ----- withMaven Wrapper script -----
[windows-jdk9]  > git rev-parse --is-inside-work-tree # timeout=10
[windows-jdk9] Fetching changes from the remote Git repository
[windows-jdk9]  > git config remote.origin.url https://gitbox.apache.org/repos/asf/maven-resolver-ant-tasks.git
# timeout=10
[windows-jdk9] Fetching without tags
[windows-jdk9] Fetching upstream changes from https://gitbox.apache.org/repos/asf/maven-resolver-ant-tasks.git
[windows-jdk9]  > git --version # timeout=10
[windows-jdk9]  > git fetch --no-tags --progress https://gitbox.apache.org/repos/asf/maven-resolver-ant-tasks.git
+refs/heads/*:refs/remotes/origin/*
[Pipeline] [windows-jdk7] // dir
[Pipeline] [windows-jdk7] }
[windows-jdk7] [withMaven] Skip 'Generated Artifacts Publisher' disabled by configuration
[windows-jdk7] [withMaven] Skip 'Findbugs Publisher' disabled by configuration
[windows-jdk7] [withMaven] Skip 'Open Task Scanner Publisher' disabled by configuration
[Pipeline] [windows-jdk7] // withMaven
[Pipeline] [windows-jdk7] echo
[windows-jdk7] [FAIL FAST] This is the first failure and likely root cause
[Pipeline] [windows-jdk7] }
[Pipeline] [windows-jdk7] // stage
[Pipeline] [windows-jdk7] }
[Pipeline] [windows-jdk7] // node
[Pipeline] [windows-jdk7] }
[windows-jdk7] Failed in branch windows-jdk7
[linux-jdk7] Sending interrupt signal to process
[linux-jdk7] [INFO] Downloaded from central: https://repo.maven.apache.org/maven2/org/sonatype/forge/forge-parent/5/forge-parent-5.pom
(8.4 kB at 18 kB/s)
[linux-jdk7] [INFO] Downloading from central: https://repo.maven.apache.org/maven2/org/codehaus/plexus/plexus-component-annotations/1.6/plexus-component-annotations-1.6.pom
[linux-jdk7] [INFO] Downloaded from central: https://repo.maven.apache.org/maven2/org/codehaus/plexus/plexus-component-annotations/1.6/plexus-component-annotations-1.6.pom
(748 B at 50 kB/s)
[linux-jdk7] [INFO] Downloading from central: https://repo.maven.apache.org/maven2/org/codehaus/plexus/plexus-containers/1.6/plexus-containers-1.6.pom
[linux-jdk7] [INFO] Downloaded from central: https://repo.maven.apache.org/maven2/org/codehaus/plexus/plexus-containers/1.6/plexus-containers-1.6.pom
(3.8 kB at 235 kB/s)
[linux-jdk7] [INFO] Downloading from central: https://repo.maven.apache.org/maven2/org/codehaus/plexus/plexus/3.3.2/plexus-3.3.2.pom
[linux-jdk7] [INFO] Downloaded from central: https://repo.maven.apache.org/maven2/org/codehaus/plexus/plexus/3.3.2/plexus-3.3.2.pom
(22 kB at 718 kB/s)
[linux-jdk7] [INFO] Downloading from central: https://repo.maven.apache.org/maven2/org/sonatype/spice/spice-parent/17/spice-parent-17.pom
[linux-jdk7] [INFO] Downloaded from central: https://repo.maven.apache.org/maven2/org/sonatype/spice/spice-parent/17/spice-parent-17.pom
(6.8 kB at 451 kB/s)
[linux-jdk7] [INFO] Downloading from central: https://repo.maven.apache.org/maven2/org/codehaus/plexus/plexus-interpolation/1.16/plexus-interpolation-1.16.pom
[linux-jdk7] [INFO] Downloaded from central: https://repo.maven.apache.org/maven2/org/codehaus/plexus/plexus-interpolation/1.16/plexus-interpolation-1.16.pom
(1.0 kB at 68 kB/s)
[linux-jdk7] [INFO] Downloading from central: https://repo.maven.apache.org/maven2/org/codehaus/plexus/plexus-components/1.3/plexus-components-1.3.pom
[linux-jdk7] [INFO] Downloaded from central: https://repo.maven.apache.org/maven2/org/codehaus/plexus/plexus-components/1.3/plexus-components-1.3.pom
(3.1 kB at 218 kB/s)
[linux-jdk7] [INFO] Downloading from central: https://repo.maven.apache.org/maven2/org/codehaus/plexus/plexus/3.3/plexus-3.3.pom
[linux-jdk7] [INFO] Downloaded from central: https://repo.maven.apache.org/maven2/org/codehaus/plexus/plexus/3.3/plexus-3.3.pom
(20 kB at 1.0 MB/s)
[linux-jdk7] [INFO] Downloading from central: https://repo.maven.apache.org/maven2/org/eclipse/sisu/org.eclipse.sisu.plexus/0.1.1/org.eclipse.sisu.plexus-0.1.1.pom
[linux-jdk7] [INFO] Downloaded from central: https://repo.maven.apache.org/maven2/org/eclipse/sisu/org.eclipse.sisu.plexus/0.1.1/org.eclipse.sisu.plexus-0.1.1.pom
(4.7 kB at 313 kB/s)
[linux-jdk7] [INFO] Downloading from central: https://repo.maven.apache.org/maven2/org/eclipse/sisu/sisu-plexus/0.1.1/sisu-plexus-0.1.1.pom
[linux-jdk7] [INFO] Downloaded from central: https://repo.maven.apache.org/maven2/org/eclipse/sisu/sisu-plexus/0.1.1/sisu-plexus-0.1.1.pom
(13 kB at 825 kB/s)
[linux-jdk7] [INFO] Downloading from central: https://repo.maven.apache.org/maven2/junit/junit/4.11/junit-4.11.pom
[linux-jdk7] [INFO] Downloaded from central: https://repo.maven.apache.org/maven2/junit/junit/4.11/junit-4.11.pom
(2.3 kB at 156 kB/s)
[linux-jdk7] [INFO] Downloading from central: https://repo.maven.apache.org/maven2/org/hamcrest/hamcrest-core/1.3/hamcrest-core-1.3.pom
[linux-jdk8] [INFO] [jenkins-event-spy] Generate /home/jenkins/jenkins-slave/workspace/n-resolver-ant-tasks_master-PZI36OPNRAJBXJOAPEQN5EKT3YVHZTR3KX72Y4FQGBMQE6GFTARQ@tmp/withMaven7220170c/maven-spy-20180215-185228-4384614597035660116907.log.tmp
...
[linux-jdk8] [INFO] Scanning for projects...
[linux-jdk9] + mvn -P+run-its -Dmaven.test.failure.ignore=true -Dfindbugs.failOnError=false
-Dfindbugs.skip=true clean verify
[linux-jdk9] ----- withMaven Wrapper script -----
[linux-jdk9] Picked up JAVA_TOOL_OPTIONS: -Dmaven.ext.class.path="/home/jenkins/jenkins-slave/workspace/n-resolver-ant-tasks_master-PZI36OPNRAJBXJOAPEQN5EKT3YVHZTR3KX72Y4FQGBMQE6GFTARQ@2@tmp/withMavenec8f7716/pipeline-maven-spy.jar"
-Dorg.jenkinsci.plugins.pipeline.maven.reportsFolder="/home/jenkins/jenkins-slave/workspace/n-resolver-ant-tasks_master-PZI36OPNRAJBXJOAPEQN5EKT3YVHZTR3KX72Y4FQGBMQE6GFTARQ@2@tmp/withMavenec8f7716"

[linux-jdk9] Apache Maven 3.5.2 (138edd61fd100ec658bfa2d307c43b76940a5d7d; 2017-10-18T07:58:13Z)
[linux-jdk9] Maven home: /home/jenkins/tools/maven/apache-maven-3.5.2
[linux-jdk9] Java version: 9.0.1, vendor: Oracle Corporation
[linux-jdk9] Java home: /usr/local/asfpackages/java/jdk-9.0.1
[linux-jdk9] Default locale: en_US, platform encoding: ISO-8859-1
[linux-jdk9] OS name: "linux", version: "4.4.0-98-generic", arch: "amd64", family: "unix"
[windows-jdk8] Apache Maven 3.5.0 (ff8f5e7444045639af65f6095c62210b5713f426; 2017-04-03T19:39:06Z)
[windows-jdk8] Maven home: F:\jenkins\tools\maven\apache-maven-3.5.0\bin\..
[windows-jdk8] Java version: 1.8.0_152, vendor: Oracle Corporation
[windows-jdk8] Java home: f:\jenkins\tools\java\latest1.8\jre
[windows-jdk8] Default locale: en_US, platform encoding: Cp1252
[windows-jdk8] OS name: "windows server 2012 r2", version: "6.3", arch: "amd64", family: "windows"
[windows-jdk9] Checking out Revision e1d13236b41e2d62b5463b58543ecb73e865ad24 (master)
[windows-jdk9]  > git config core.sparsecheckout # timeout=10
[windows-jdk9]  > git checkout -f e1d13236b41e2d62b5463b58543ecb73e865ad24
[windows-jdk9] Commit message: "[maven-release-plugin] prepare for next development iteration"
[windows-jdk9] Cleaning workspace
[windows-jdk9]  > git rev-parse --verify HEAD # timeout=10
[windows-jdk9] Resetting working tree
[windows-jdk9]  > git reset --hard # timeout=10
[windows-jdk9]  > git clean -fdx # timeout=10
[linux-jdk8] [INFO] 
[linux-jdk8] [INFO] ------------------------------------------------------------------------
[linux-jdk8] [INFO] Building Maven Artifact Resolver Ant Tasks 1.1.2-SNAPSHOT
[linux-jdk8] [INFO] ------------------------------------------------------------------------
[linux-jdk8] [WARNING] The POM for org.apache.maven.resolver:maven-resolver-api:jar:1.1.1
is missing, no dependency information available
[linux-jdk8] [WARNING] The POM for org.apache.maven.resolver:maven-resolver-util:jar:1.1.1
is missing, no dependency information available
[linux-jdk8] [WARNING] The POM for org.apache.maven.resolver:maven-resolver-impl:jar:1.1.1
is missing, no dependency information available
[linux-jdk8] [WARNING] The POM for org.apache.maven.resolver:maven-resolver-connector-basic:jar:1.1.1
is missing, no dependency information available
[linux-jdk8] [WARNING] The POM for org.apache.maven.resolver:maven-resolver-transport-classpath:jar:1.1.1
is missing, no dependency information available
[linux-jdk8] [WARNING] The POM for org.apache.maven.resolver:maven-resolver-transport-file:jar:1.1.1
is missing, no dependency information available
[linux-jdk8] [WARNING] The POM for org.apache.maven.resolver:maven-resolver-transport-http:jar:1.1.1
is missing, no dependency information available
[linux-jdk8] Sending interrupt signal to process
[linux-jdk9] [INFO] [jenkins-event-spy] Generate /home/jenkins/jenkins-slave/workspace/n-resolver-ant-tasks_master-PZI36OPNRAJBXJOAPEQN5EKT3YVHZTR3KX72Y4FQGBMQE6GFTARQ@2@tmp/withMavenec8f7716/maven-spy-20180215-185229-74016068899739520457500.log.tmp
...
[linux-jdk9] Sending interrupt signal to process
[linux-jdk9] [INFO] Scanning for projects...
[linux-jdk9] [INFO] 
[linux-jdk9] [INFO] ------------------------------------------------------------------------
[linux-jdk9] [INFO] Building Maven Artifact Resolver Ant Tasks 1.1.2-SNAPSHOT
[linux-jdk9] [INFO] ------------------------------------------------------------------------
[linux-jdk9] [INFO] Downloading from central: https://repo.maven.apache.org/maven2/org/apache/maven/plugins/maven-remote-resources-plugin/1.5/maven-remote-resources-plugin-1.5.jar
[windows-jdk8] [INFO] [jenkins-event-spy] Generate F:\jenkins\jenkins-slave\workspace\n-resolver-ant-tasks_master-PZI36OPNRAJBXJOAPEQN5EKT3YVHZTR3KX72Y4FQGBMQE6GFTARQ@2@tmp\withMaven4ffd9764\maven-spy-20180215-185230-213340473164054630632.log.tmp
...
[windows-jdk8] [INFO] Scanning for projects...
[windows-jdk8] [INFO] 
[windows-jdk8] [INFO] ------------------------------------------------------------------------
[windows-jdk8] [INFO] Building Maven Artifact Resolver Ant Tasks 1.1.2-SNAPSHOT
[windows-jdk8] [INFO] ------------------------------------------------------------------------
[windows-jdk8] Sending interrupt signal to process
[windows-jdk8] [WARNING] The POM for org.apache.maven.resolver:maven-resolver-api:jar:1.1.1
is missing, no dependency information available
[windows-jdk8] [WARNING] The POM for org.apache.maven.resolver:maven-resolver-util:jar:1.1.1
is missing, no dependency information available
[windows-jdk8] [WARNING] The POM for org.apache.maven.resolver:maven-resolver-impl:jar:1.1.1
is missing, no dependency information available
[windows-jdk8] [WARNING] The POM for org.apache.maven.resolver:maven-resolver-connector-basic:jar:1.1.1
is missing, no dependency information available
[windows-jdk8] [WARNING] The POM for org.apache.maven.resolver:maven-resolver-transport-classpath:jar:1.1.1
is missing, no dependency information available
[windows-jdk8] [WARNING] The POM for org.apache.maven.resolver:maven-resolver-transport-file:jar:1.1.1
is missing, no dependency information available
[windows-jdk8] [WARNING] The POM for org.apache.maven.resolver:maven-resolver-transport-http:jar:1.1.1
is missing, no dependency information available
[Pipeline] [linux-jdk7] }
[Pipeline] [linux-jdk8] }
[Pipeline] [windows-jdk9] }
[Pipeline] [linux-jdk7] // dir
[Pipeline] [linux-jdk8] // dir
[Pipeline] [windows-jdk9] // dir
[windows-jdk8] [WARNING] The POM for org.apache.maven.resolver:maven-resolver-test-util:jar:1.1.1
is missing, no dependency information available
[windows-jdk8] [INFO] ------------------------------------------------------------------------
[windows-jdk8] [INFO] BUILD FAILURE
[windows-jdk8] [INFO] ------------------------------------------------------------------------
[windows-jdk8] [INFO] Total time: 0.923 s
[windows-jdk8] [INFO] Finished at: 2018-02-15T18:52:31Z
[Pipeline] [linux-jdk7] }
[linux-jdk7] [withMaven] One or multiple Maven executions have been ignored by the Jenkins
Pipeline Maven Plugin because they have been interrupted before completion (1). See Pipeline
Maven Plugin FAQ for more details.
[Pipeline] [linux-jdk8] }
[linux-jdk8] [withMaven] One or multiple Maven executions have been ignored by the Jenkins
Pipeline Maven Plugin because they have been interrupted before completion (1). See Pipeline
Maven Plugin FAQ for more details.
[Pipeline] [windows-jdk9] }
[Pipeline] [linux-jdk7] // withMaven
[Pipeline] [linux-jdk8] // withMaven
[Pipeline] [windows-jdk9] // stage
[Pipeline] [linux-jdk7] echo
[linux-jdk7] [FAIL FAST] windows-jdk7 had first failure, ignoring script returned exit code
143
[Pipeline] [linux-jdk7] }
[Pipeline] [linux-jdk8] echo
[linux-jdk8] [FAIL FAST] windows-jdk7 had first failure, ignoring script returned exit code
143
[Pipeline] [linux-jdk8] }
[Pipeline] [linux-jdk9] }
[Pipeline] [windows-jdk8] }
[Pipeline] [windows-jdk9] stage
[Pipeline] [windows-jdk9] { (Build windows-jdk9)
[Pipeline] [windows-jdk9] echo
[windows-jdk9] [FAIL FAST] windows-jdk7 has failed. Skipping windows-jdk9.
[Pipeline] [windows-jdk9] }
[Pipeline] [linux-jdk7] // stage
[Pipeline] [linux-jdk8] // stage
[Pipeline] [linux-jdk9] // dir
[Pipeline] [windows-jdk8] // dir
[Pipeline] [linux-jdk7] }
[Pipeline] [linux-jdk8] }
[Pipeline] [linux-jdk9] }
[linux-jdk9] [withMaven] One or multiple Maven executions have been ignored by the Jenkins
Pipeline Maven Plugin because they have been interrupted before completion (1). See Pipeline
Maven Plugin FAQ for more details.
[Pipeline] [windows-jdk8] }
[windows-jdk8] [withMaven] One or multiple Maven executions have been ignored by the Jenkins
Pipeline Maven Plugin because they have been interrupted before completion (1). See Pipeline
Maven Plugin FAQ for more details.
[Pipeline] [windows-jdk9] // stage
[Pipeline] [windows-jdk9] }
[Pipeline] [linux-jdk7] // node
[Pipeline] [linux-jdk8] // node
[Pipeline] [linux-jdk9] // withMaven
[Pipeline] [windows-jdk8] // withMaven
[Pipeline] [linux-jdk7] }
[Pipeline] [linux-jdk8] }
[Pipeline] [linux-jdk9] echo
[linux-jdk9] [FAIL FAST] windows-jdk7 had first failure, ignoring script returned exit code
143
[Pipeline] [linux-jdk9] }
[Pipeline] [windows-jdk8] echo
[windows-jdk8] [FAIL FAST] windows-jdk7 had first failure, ignoring script returned exit code
-1
[Pipeline] [windows-jdk8] }
[Pipeline] [windows-jdk9] // node
[Pipeline] [windows-jdk9] }
[Pipeline] [linux-jdk9] // stage
[Pipeline] [windows-jdk8] // stage
[Pipeline] [linux-jdk9] }
[Pipeline] [windows-jdk8] }
[Pipeline] [linux-jdk9] // node
[Pipeline] [windows-jdk8] // node
[Pipeline] [linux-jdk9] }
[Pipeline] [windows-jdk8] }
[Pipeline] // parallel
[Pipeline] echo
***** FAST FAILURE *****

Fast failure triggered by windows-jdk7

***** FAST FAILURE *****
[Pipeline] stage
[Pipeline] { (Notifications)
[Pipeline] echo
Build result: FAILURE
[Pipeline] jiraIssueSelector
[Pipeline] emailext
Mime
  • Unnamed multipart/mixed (inline, None, 0 bytes)
View raw message