maven-notifications mailing list archives

Site index · List index
Message view « Date » · « Thread »
Top « Date » · « Thread »
From Apache Jenkins Server <jenk...@builds.apache.org>
Subject Build unstable in Jenkins: Maven TLP (wip) » maven » MNG-6255 #7
Date Fri, 09 Feb 2018 02:40:42 GMT
See https://builds.apache.org/job/maven-wip/job/maven/job/MNG-6255/7/

No changes.

8 tests failed.
FAILED:  org.apache.maven.it.MavenITmng6057CheckReactorOrderTest.testitReactorShouldResultInExpectedOrder

Error Message:
expected:<3> but was:<5>

Stack Trace:
junit.framework.AssertionFailedError: expected:<3> but was:<5>
	at junit.framework.Assert.fail(Assert.java:47)
	at junit.framework.Assert.failNotEquals(Assert.java:283)
	at junit.framework.Assert.assertEquals(Assert.java:64)
	at junit.framework.Assert.assertEquals(Assert.java:195)
	at junit.framework.Assert.assertEquals(Assert.java:201)
	at org.apache.maven.it.MavenITmng6057CheckReactorOrderTest.testitReactorShouldResultInExpectedOrder(MavenITmng6057CheckReactorOrderTest.java:69)


FAILED:  org.apache.maven.it.MavenITmng4293RequiresCompilePlusRuntimeScopeTest.testit

Error Message:
Exit code was non-zero: 1; command line and log = 
/home/jenkins/jenkins-slave/workspace/maven-wip_maven_MNG-6255-K3D4U5CO77R4RHWNDN6SCWEQCXDBLNZ2JWORRMKCNPTLBZKNCPFQ/test/core-it-suite/target/apache-maven/bin/mvn --global-settings /home/jenkins/jenkins-slave/workspace/maven-wip_maven_MNG-6255-K3D4U5CO77R4RHWNDN6SCWEQCXDBLNZ2JWORRMKCNPTLBZKNCPFQ/test/core-it-suite/target/test-classes/settings.xml --settings settings.xml -e --batch-mode -Dmaven.repo.local=/home/jenkins/jenkins-slave/workspace/maven-wip_maven_MNG-6255-K3D4U5CO77R4RHWNDN6SCWEQCXDBLNZ2JWORRMKCNPTLBZKNCPFQ/test/it-local-repo validate
[INFO] [jenkins-event-spy] Generate /home/jenkins/jenkins-slave/workspace/maven-wip_maven_MNG-6255-K3D4U5CO77R4RHWNDN6SCWEQCXDBLNZ2JWORRMKCNPTLBZKNCPFQ/test@tmp/withMaven60f322db/maven-spy-20180209-003018-8873159522497830569629.log.tmp ...
[INFO] Error stacktraces are turned on.
[INFO] Scanning for projects...
[ERROR] [ERROR] Some problems were encountered while processing the POMs:
[WARNING] 'dependencies.dependency.systemPath' for org.apache.maven.its.mng4293:system:jar should use a variable instead of a hard-coded path /home/jenkins/jenkins-slave/workspace/maven-wip_maven_MNG-6255-K3D4U5CO77R4RHWNDN6SCWEQCXDBLNZ2JWORRMKCNPTLBZKNCPFQ/test/core-it-suite/target/test-classes/mng-4293/system-0.1.jar @ line 64, column 19
[FATAL] 'dependencies.dependency org.apache.maven.its.mng4293:test:0.1' for org.apache.maven.its.mng4293:test:0.1 is referencing itself. @ line 53, column 17
 @ 
[INFO] [jenkins-event-spy] Generated /home/jenkins/jenkins-slave/workspace/maven-wip_maven_MNG-6255-K3D4U5CO77R4RHWNDN6SCWEQCXDBLNZ2JWORRMKCNPTLBZKNCPFQ/test@tmp/withMaven60f322db/maven-spy-20180209-003018-8873159522497830569629.log
[ERROR] The build could not read 1 project -> [Help 1]
org.apache.maven.project.ProjectBuildingException: Some problems were encountered while processing the POMs:
[WARNING] 'dependencies.dependency.systemPath' for org.apache.maven.its.mng4293:system:jar should use a variable instead of a hard-coded path /home/jenkins/jenkins-slave/workspace/maven-wip_maven_MNG-6255-K3D4U5CO77R4RHWNDN6SCWEQCXDBLNZ2JWORRMKCNPTLBZKNCPFQ/test/core-it-suite/target/test-classes/mng-4293/system-0.1.jar @ line 64, column 19
[FATAL] 'dependencies.dependency org.apache.maven.its.mng4293:test:0.1' for org.apache.maven.its.mng4293:test:0.1 is referencing itself. @ line 53, column 17

    at org.apache.maven.project.DefaultProjectBuilder.build (DefaultProjectBuilder.java:382)
    at org.apache.maven.graph.DefaultGraphBuilder.collectProjects (DefaultGraphBuilder.java:400)
    at org.apache.maven.graph.DefaultGraphBuilder.getProjectsForMavenReactor (DefaultGraphBuilder.java:391)
    at org.apache.maven.graph.DefaultGraphBuilder.build (DefaultGraphBuilder.java:78)
    at org.apache.maven.DefaultMaven.buildGraph (DefaultMaven.java:511)
    at org.apache.maven.DefaultMaven.doExecute (DefaultMaven.java:221)
    at org.apache.maven.DefaultMaven.doExecute (DefaultMaven.java:194)
    at org.apache.maven.DefaultMaven.execute (DefaultMaven.java:107)
    at org.apache.maven.cli.MavenCli.execute (MavenCli.java:955)
    at org.apache.maven.cli.MavenCli.doMain (MavenCli.java:290)
    at org.apache.maven.cli.MavenCli.doMain (MavenCli.java:245)
    at sun.reflect.GeneratedMethodAccessor57.invoke (Unknown Source)
    at sun.reflect.DelegatingMethodAccessorImpl.invoke (DelegatingMethodAccessorImpl.java:43)
    at java.lang.reflect.Method.invoke (Method.java:498)
    at org.apache.maven.it.Embedded3xLauncher.run (Embedded3xLauncher.java:247)
    at org.apache.maven.it.Verifier.executeGoals (Verifier.java:1354)
    at org.apache.maven.it.Verifier.executeGoal (Verifier.java:1254)
    at org.apache.maven.it.Verifier.executeGoal (Verifier.java:1248)
    at org.apache.maven.it.MavenITmng4293RequiresCompilePlusRuntimeScopeTest.testit (MavenITmng4293RequiresCompilePlusRuntimeScopeTest.java:64)
    at sun.reflect.NativeMethodAccessorImpl.invoke0 (Native Method)
    at sun.reflect.NativeMethodAccessorImpl.invoke (NativeMethodAccessorImpl.java:62)
    at sun.reflect.DelegatingMethodAccessorImpl.invoke (DelegatingMethodAccessorImpl.java:43)
    at java.lang.reflect.Method.invoke (Method.java:498)
    at junit.framework.TestCase.runTest (TestCase.java:168)
    at org.apache.maven.it.AbstractMavenIntegrationTestCase.runTest (AbstractMavenIntegrationTestCase.java:222)
    at junit.framework.TestCase.runBare (TestCase.java:134)
    at junit.framework.TestResult$1.protect (TestResult.java:110)
    at junit.framework.TestResult.runProtected (TestResult.java:128)
    at junit.framework.TestResult.run (TestResult.java:113)
    at junit.framework.TestCase.run (TestCase.java:124)
    at junit.framework.TestSuite.runTest (TestSuite.java:243)
    at junit.framework.TestSuite.run (TestSuite.java:238)
    at junit.framework.TestSuite.runTest (TestSuite.java:243)
    at junit.framework.TestSuite.run (TestSuite.java:238)
    at org.junit.internal.runners.JUnit38ClassRunner.run (JUnit38ClassRunner.java:83)
    at org.apache.maven.surefire.junit4.JUnit4Provider.execute (JUnit4Provider.java:283)
    at org.apache.maven.surefire.junit4.JUnit4Provider.executeWithRerun (JUnit4Provider.java:173)
    at org.apache.maven.surefire.junit4.JUnit4Provider.executeTestSet (JUnit4Provider.java:153)
    at org.apache.maven.surefire.junit4.JUnit4Provider.invoke (JUnit4Provider.java:128)
    at org.apache.maven.surefire.booter.ForkedBooter.invokeProviderInSameClassLoader (ForkedBooter.java:203)
    at org.apache.maven.surefire.booter.ForkedBooter.runSuitesInProcess (ForkedBooter.java:155)
    at org.apache.maven.surefire.booter.ForkedBooter.main (ForkedBooter.java:103)
[ERROR]   
[ERROR]   The project org.apache.maven.its.mng4293:test:0.1 (/home/jenkins/jenkins-slave/workspace/maven-wip_maven_MNG-6255-K3D4U5CO77R4RHWNDN6SCWEQCXDBLNZ2JWORRMKCNPTLBZKNCPFQ/test/core-it-suite/target/test-classes/mng-4293/pom.xml) has 1 error
[ERROR]     'dependencies.dependency org.apache.maven.its.mng4293:test:0.1' for org.apache.maven.its.mng4293:test:0.1 is referencing itself. @ line 53, column 17
[ERROR] 
[ERROR] Re-run Maven using the -X switch to enable full debug logging.
[ERROR] 
[ERROR] For more information about the errors and possible solutions, please read the following articles:
[ERROR] [Help 1] http://cwiki.apache.org/confluence/display/MAVEN/ProjectBuildingException


Stack Trace:
org.apache.maven.it.VerificationException: Exit code was non-zero: 1; command line and log = 
/home/jenkins/jenkins-slave/workspace/maven-wip_maven_MNG-6255-K3D4U5CO77R4RHWNDN6SCWEQCXDBLNZ2JWORRMKCNPTLBZKNCPFQ/test/core-it-suite/target/apache-maven/bin/mvn --global-settings /home/jenkins/jenkins-slave/workspace/maven-wip_maven_MNG-6255-K3D4U5CO77R4RHWNDN6SCWEQCXDBLNZ2JWORRMKCNPTLBZKNCPFQ/test/core-it-suite/target/test-classes/settings.xml --settings settings.xml -e --batch-mode -Dmaven.repo.local=/home/jenkins/jenkins-slave/workspace/maven-wip_maven_MNG-6255-K3D4U5CO77R4RHWNDN6SCWEQCXDBLNZ2JWORRMKCNPTLBZKNCPFQ/test/it-local-repo validate
[INFO] [jenkins-event-spy] Generate /home/jenkins/jenkins-slave/workspace/maven-wip_maven_MNG-6255-K3D4U5CO77R4RHWNDN6SCWEQCXDBLNZ2JWORRMKCNPTLBZKNCPFQ/test@tmp/withMaven60f322db/maven-spy-20180209-003018-8873159522497830569629.log.tmp ...
[INFO] Error stacktraces are turned on.
[INFO] Scanning for projects...
[ERROR] [ERROR] Some problems were encountered while processing the POMs:
[WARNING] 'dependencies.dependency.systemPath' for org.apache.maven.its.mng4293:system:jar should use a variable instead of a hard-coded path /home/jenkins/jenkins-slave/workspace/maven-wip_maven_MNG-6255-K3D4U5CO77R4RHWNDN6SCWEQCXDBLNZ2JWORRMKCNPTLBZKNCPFQ/test/core-it-suite/target/test-classes/mng-4293/system-0.1.jar @ line 64, column 19
[FATAL] 'dependencies.dependency org.apache.maven.its.mng4293:test:0.1' for org.apache.maven.its.mng4293:test:0.1 is referencing itself. @ line 53, column 17
 @ 
[INFO] [jenkins-event-spy] Generated /home/jenkins/jenkins-slave/workspace/maven-wip_maven_MNG-6255-K3D4U5CO77R4RHWNDN6SCWEQCXDBLNZ2JWORRMKCNPTLBZKNCPFQ/test@tmp/withMaven60f322db/maven-spy-20180209-003018-8873159522497830569629.log
[ERROR] The build could not read 1 project -> [Help 1]
org.apache.maven.project.ProjectBuildingException: Some problems were encountered while processing the POMs:
[WARNING] 'dependencies.dependency.systemPath' for org.apache.maven.its.mng4293:system:jar should use a variable instead of a hard-coded path /home/jenkins/jenkins-slave/workspace/maven-wip_maven_MNG-6255-K3D4U5CO77R4RHWNDN6SCWEQCXDBLNZ2JWORRMKCNPTLBZKNCPFQ/test/core-it-suite/target/test-classes/mng-4293/system-0.1.jar @ line 64, column 19
[FATAL] 'dependencies.dependency org.apache.maven.its.mng4293:test:0.1' for org.apache.maven.its.mng4293:test:0.1 is referencing itself. @ line 53, column 17

    at org.apache.maven.project.DefaultProjectBuilder.build (DefaultProjectBuilder.java:382)
    at org.apache.maven.graph.DefaultGraphBuilder.collectProjects (DefaultGraphBuilder.java:400)
    at org.apache.maven.graph.DefaultGraphBuilder.getProjectsForMavenReactor (DefaultGraphBuilder.java:391)
    at org.apache.maven.graph.DefaultGraphBuilder.build (DefaultGraphBuilder.java:78)
    at org.apache.maven.DefaultMaven.buildGraph (DefaultMaven.java:511)
    at org.apache.maven.DefaultMaven.doExecute (DefaultMaven.java:221)
    at org.apache.maven.DefaultMaven.doExecute (DefaultMaven.java:194)
    at org.apache.maven.DefaultMaven.execute (DefaultMaven.java:107)
    at org.apache.maven.cli.MavenCli.execute (MavenCli.java:955)
    at org.apache.maven.cli.MavenCli.doMain (MavenCli.java:290)
    at org.apache.maven.cli.MavenCli.doMain (MavenCli.java:245)
    at sun.reflect.GeneratedMethodAccessor57.invoke (Unknown Source)
    at sun.reflect.DelegatingMethodAccessorImpl.invoke (DelegatingMethodAccessorImpl.java:43)
    at java.lang.reflect.Method.invoke (Method.java:498)
    at org.apache.maven.it.Embedded3xLauncher.run (Embedded3xLauncher.java:247)
    at org.apache.maven.it.Verifier.executeGoals (Verifier.java:1354)
    at org.apache.maven.it.Verifier.executeGoal (Verifier.java:1254)
    at org.apache.maven.it.Verifier.executeGoal (Verifier.java:1248)
    at org.apache.maven.it.MavenITmng4293RequiresCompilePlusRuntimeScopeTest.testit (MavenITmng4293RequiresCompilePlusRuntimeScopeTest.java:64)
    at sun.reflect.NativeMethodAccessorImpl.invoke0 (Native Method)
    at sun.reflect.NativeMethodAccessorImpl.invoke (NativeMethodAccessorImpl.java:62)
    at sun.reflect.DelegatingMethodAccessorImpl.invoke (DelegatingMethodAccessorImpl.java:43)
    at java.lang.reflect.Method.invoke (Method.java:498)
    at junit.framework.TestCase.runTest (TestCase.java:168)
    at org.apache.maven.it.AbstractMavenIntegrationTestCase.runTest (AbstractMavenIntegrationTestCase.java:222)
    at junit.framework.TestCase.runBare (TestCase.java:134)
    at junit.framework.TestResult$1.protect (TestResult.java:110)
    at junit.framework.TestResult.runProtected (TestResult.java:128)
    at junit.framework.TestResult.run (TestResult.java:113)
    at junit.framework.TestCase.run (TestCase.java:124)
    at junit.framework.TestSuite.runTest (TestSuite.java:243)
    at junit.framework.TestSuite.run (TestSuite.java:238)
    at junit.framework.TestSuite.runTest (TestSuite.java:243)
    at junit.framework.TestSuite.run (TestSuite.java:238)
    at org.junit.internal.runners.JUnit38ClassRunner.run (JUnit38ClassRunner.java:83)
    at org.apache.maven.surefire.junit4.JUnit4Provider.execute (JUnit4Provider.java:283)
    at org.apache.maven.surefire.junit4.JUnit4Provider.executeWithRerun (JUnit4Provider.java:173)
    at org.apache.maven.surefire.junit4.JUnit4Provider.executeTestSet (JUnit4Provider.java:153)
    at org.apache.maven.surefire.junit4.JUnit4Provider.invoke (JUnit4Provider.java:128)
    at org.apache.maven.surefire.booter.ForkedBooter.invokeProviderInSameClassLoader (ForkedBooter.java:203)
    at org.apache.maven.surefire.booter.ForkedBooter.runSuitesInProcess (ForkedBooter.java:155)
    at org.apache.maven.surefire.booter.ForkedBooter.main (ForkedBooter.java:103)
[ERROR]   
[ERROR]   The project org.apache.maven.its.mng4293:test:0.1 (/home/jenkins/jenkins-slave/workspace/maven-wip_maven_MNG-6255-K3D4U5CO77R4RHWNDN6SCWEQCXDBLNZ2JWORRMKCNPTLBZKNCPFQ/test/core-it-suite/target/test-classes/mng-4293/pom.xml) has 1 error
[ERROR]     'dependencies.dependency org.apache.maven.its.mng4293:test:0.1' for org.apache.maven.its.mng4293:test:0.1 is referencing itself. @ line 53, column 17
[ERROR] 
[ERROR] Re-run Maven using the -X switch to enable full debug logging.
[ERROR] 
[ERROR] For more information about the errors and possible solutions, please read the following articles:
[ERROR] [Help 1] http://cwiki.apache.org/confluence/display/MAVEN/ProjectBuildingException

	at org.apache.maven.it.Verifier.executeGoals(Verifier.java:1369)
	at org.apache.maven.it.Verifier.executeGoal(Verifier.java:1254)
	at org.apache.maven.it.Verifier.executeGoal(Verifier.java:1248)
	at org.apache.maven.it.MavenITmng4293RequiresCompilePlusRuntimeScopeTest.testit(MavenITmng4293RequiresCompilePlusRuntimeScopeTest.java:64)


FAILED:  org.apache.maven.it.MavenITmng6209MultipleBuildExtensions.testBuildExtensionClassloader

Error Message:
expected:<2> but was:<1>

Stack Trace:
junit.framework.AssertionFailedError: expected:<2> but was:<1>
	at junit.framework.Assert.fail(Assert.java:47)
	at junit.framework.Assert.failNotEquals(Assert.java:283)
	at junit.framework.Assert.assertEquals(Assert.java:64)
	at junit.framework.Assert.assertEquals(Assert.java:195)
	at junit.framework.Assert.assertEquals(Assert.java:201)
	at org.apache.maven.it.MavenITmng6209MultipleBuildExtensions.testBuildExtensionClassloader(MavenITmng6209MultipleBuildExtensions.java:57)


FAILED:  org.apache.maven.it.MavenITmng6057CheckReactorOrderTest.testitReactorShouldResultInExpectedOrder

Error Message:
expected:<3> but was:<5>

Stack Trace:
junit.framework.AssertionFailedError: expected:<3> but was:<5>
	at junit.framework.Assert.fail(Assert.java:47)
	at junit.framework.Assert.failNotEquals(Assert.java:283)
	at junit.framework.Assert.assertEquals(Assert.java:64)
	at junit.framework.Assert.assertEquals(Assert.java:195)
	at junit.framework.Assert.assertEquals(Assert.java:201)
	at org.apache.maven.it.MavenITmng6057CheckReactorOrderTest.testitReactorShouldResultInExpectedOrder(MavenITmng6057CheckReactorOrderTest.java:69)


FAILED:  org.apache.maven.it.MavenITmng4293RequiresCompilePlusRuntimeScopeTest.testit

Error Message:
Exit code was non-zero: 1; command line and log = 
/home/jenkins/jenkins-slave/workspace/maven-wip_maven_MNG-6255-K3D4U5CO77R4RHWNDN6SCWEQCXDBLNZ2JWORRMKCNPTLBZKNCPFQ/test/core-it-suite/target/apache-maven/bin/mvn --global-settings /home/jenkins/jenkins-slave/workspace/maven-wip_maven_MNG-6255-K3D4U5CO77R4RHWNDN6SCWEQCXDBLNZ2JWORRMKCNPTLBZKNCPFQ/test/core-it-suite/target/test-classes/settings.xml --settings settings.xml -e --batch-mode -Dmaven.repo.local=/home/jenkins/jenkins-slave/workspace/maven-wip_maven_MNG-6255-K3D4U5CO77R4RHWNDN6SCWEQCXDBLNZ2JWORRMKCNPTLBZKNCPFQ/test/it-local-repo validate
[INFO] [jenkins-event-spy] Generate /home/jenkins/jenkins-slave/workspace/maven-wip_maven_MNG-6255-K3D4U5CO77R4RHWNDN6SCWEQCXDBLNZ2JWORRMKCNPTLBZKNCPFQ/test@tmp/withMaven0f9ad762/maven-spy-20180209-003020-8996683429519186806498.log.tmp ...
[INFO] Error stacktraces are turned on.
[INFO] Scanning for projects...
[ERROR] [ERROR] Some problems were encountered while processing the POMs:
[WARNING] 'dependencies.dependency.systemPath' for org.apache.maven.its.mng4293:system:jar should use a variable instead of a hard-coded path /home/jenkins/jenkins-slave/workspace/maven-wip_maven_MNG-6255-K3D4U5CO77R4RHWNDN6SCWEQCXDBLNZ2JWORRMKCNPTLBZKNCPFQ/test/core-it-suite/target/test-classes/mng-4293/system-0.1.jar @ line 64, column 19
[FATAL] 'dependencies.dependency org.apache.maven.its.mng4293:test:0.1' for org.apache.maven.its.mng4293:test:0.1 is referencing itself. @ line 53, column 17
 @ 
[INFO] [jenkins-event-spy] Generated /home/jenkins/jenkins-slave/workspace/maven-wip_maven_MNG-6255-K3D4U5CO77R4RHWNDN6SCWEQCXDBLNZ2JWORRMKCNPTLBZKNCPFQ/test@tmp/withMaven0f9ad762/maven-spy-20180209-003020-8996683429519186806498.log
[ERROR] The build could not read 1 project -> [Help 1]
org.apache.maven.project.ProjectBuildingException: Some problems were encountered while processing the POMs:
[WARNING] 'dependencies.dependency.systemPath' for org.apache.maven.its.mng4293:system:jar should use a variable instead of a hard-coded path /home/jenkins/jenkins-slave/workspace/maven-wip_maven_MNG-6255-K3D4U5CO77R4RHWNDN6SCWEQCXDBLNZ2JWORRMKCNPTLBZKNCPFQ/test/core-it-suite/target/test-classes/mng-4293/system-0.1.jar @ line 64, column 19
[FATAL] 'dependencies.dependency org.apache.maven.its.mng4293:test:0.1' for org.apache.maven.its.mng4293:test:0.1 is referencing itself. @ line 53, column 17

    at org.apache.maven.project.DefaultProjectBuilder.build (DefaultProjectBuilder.java:382)
    at org.apache.maven.graph.DefaultGraphBuilder.collectProjects (DefaultGraphBuilder.java:400)
    at org.apache.maven.graph.DefaultGraphBuilder.getProjectsForMavenReactor (DefaultGraphBuilder.java:391)
    at org.apache.maven.graph.DefaultGraphBuilder.build (DefaultGraphBuilder.java:78)
    at org.apache.maven.DefaultMaven.buildGraph (DefaultMaven.java:511)
    at org.apache.maven.DefaultMaven.doExecute (DefaultMaven.java:221)
    at org.apache.maven.DefaultMaven.doExecute (DefaultMaven.java:194)
    at org.apache.maven.DefaultMaven.execute (DefaultMaven.java:107)
    at org.apache.maven.cli.MavenCli.execute (MavenCli.java:955)
    at org.apache.maven.cli.MavenCli.doMain (MavenCli.java:290)
    at org.apache.maven.cli.MavenCli.doMain (MavenCli.java:245)
    at sun.reflect.GeneratedMethodAccessor57.invoke (Unknown Source)
    at sun.reflect.DelegatingMethodAccessorImpl.invoke (DelegatingMethodAccessorImpl.java:43)
    at java.lang.reflect.Method.invoke (Method.java:606)
    at org.apache.maven.it.Embedded3xLauncher.run (Embedded3xLauncher.java:247)
    at org.apache.maven.it.Verifier.executeGoals (Verifier.java:1354)
    at org.apache.maven.it.Verifier.executeGoal (Verifier.java:1254)
    at org.apache.maven.it.Verifier.executeGoal (Verifier.java:1248)
    at org.apache.maven.it.MavenITmng4293RequiresCompilePlusRuntimeScopeTest.testit (MavenITmng4293RequiresCompilePlusRuntimeScopeTest.java:64)
    at sun.reflect.NativeMethodAccessorImpl.invoke0 (Native Method)
    at sun.reflect.NativeMethodAccessorImpl.invoke (NativeMethodAccessorImpl.java:57)
    at sun.reflect.DelegatingMethodAccessorImpl.invoke (DelegatingMethodAccessorImpl.java:43)
    at java.lang.reflect.Method.invoke (Method.java:606)
    at junit.framework.TestCase.runTest (TestCase.java:168)
    at org.apache.maven.it.AbstractMavenIntegrationTestCase.runTest (AbstractMavenIntegrationTestCase.java:222)
    at junit.framework.TestCase.runBare (TestCase.java:134)
    at junit.framework.TestResult$1.protect (TestResult.java:110)
    at junit.framework.TestResult.runProtected (TestResult.java:128)
    at junit.framework.TestResult.run (TestResult.java:113)
    at junit.framework.TestCase.run (TestCase.java:124)
    at junit.framework.TestSuite.runTest (TestSuite.java:243)
    at junit.framework.TestSuite.run (TestSuite.java:238)
    at junit.framework.TestSuite.runTest (TestSuite.java:243)
    at junit.framework.TestSuite.run (TestSuite.java:238)
    at org.junit.internal.runners.JUnit38ClassRunner.run (JUnit38ClassRunner.java:83)
    at org.apache.maven.surefire.junit4.JUnit4Provider.execute (JUnit4Provider.java:283)
    at org.apache.maven.surefire.junit4.JUnit4Provider.executeWithRerun (JUnit4Provider.java:173)
    at org.apache.maven.surefire.junit4.JUnit4Provider.executeTestSet (JUnit4Provider.java:153)
    at org.apache.maven.surefire.junit4.JUnit4Provider.invoke (JUnit4Provider.java:128)
    at org.apache.maven.surefire.booter.ForkedBooter.invokeProviderInSameClassLoader (ForkedBooter.java:203)
    at org.apache.maven.surefire.booter.ForkedBooter.runSuitesInProcess (ForkedBooter.java:155)
    at org.apache.maven.surefire.booter.ForkedBooter.main (ForkedBooter.java:103)
[ERROR]   
[ERROR]   The project org.apache.maven.its.mng4293:test:0.1 (/home/jenkins/jenkins-slave/workspace/maven-wip_maven_MNG-6255-K3D4U5CO77R4RHWNDN6SCWEQCXDBLNZ2JWORRMKCNPTLBZKNCPFQ/test/core-it-suite/target/test-classes/mng-4293/pom.xml) has 1 error
[ERROR]     'dependencies.dependency org.apache.maven.its.mng4293:test:0.1' for org.apache.maven.its.mng4293:test:0.1 is referencing itself. @ line 53, column 17
[ERROR] 
[ERROR] Re-run Maven using the -X switch to enable full debug logging.
[ERROR] 
[ERROR] For more information about the errors and possible solutions, please read the following articles:
[ERROR] [Help 1] http://cwiki.apache.org/confluence/display/MAVEN/ProjectBuildingException


Stack Trace:
org.apache.maven.it.VerificationException: Exit code was non-zero: 1; command line and log = 
/home/jenkins/jenkins-slave/workspace/maven-wip_maven_MNG-6255-K3D4U5CO77R4RHWNDN6SCWEQCXDBLNZ2JWORRMKCNPTLBZKNCPFQ/test/core-it-suite/target/apache-maven/bin/mvn --global-settings /home/jenkins/jenkins-slave/workspace/maven-wip_maven_MNG-6255-K3D4U5CO77R4RHWNDN6SCWEQCXDBLNZ2JWORRMKCNPTLBZKNCPFQ/test/core-it-suite/target/test-classes/settings.xml --settings settings.xml -e --batch-mode -Dmaven.repo.local=/home/jenkins/jenkins-slave/workspace/maven-wip_maven_MNG-6255-K3D4U5CO77R4RHWNDN6SCWEQCXDBLNZ2JWORRMKCNPTLBZKNCPFQ/test/it-local-repo validate
[INFO] [jenkins-event-spy] Generate /home/jenkins/jenkins-slave/workspace/maven-wip_maven_MNG-6255-K3D4U5CO77R4RHWNDN6SCWEQCXDBLNZ2JWORRMKCNPTLBZKNCPFQ/test@tmp/withMaven0f9ad762/maven-spy-20180209-003020-8996683429519186806498.log.tmp ...
[INFO] Error stacktraces are turned on.
[INFO] Scanning for projects...
[ERROR] [ERROR] Some problems were encountered while processing the POMs:
[WARNING] 'dependencies.dependency.systemPath' for org.apache.maven.its.mng4293:system:jar should use a variable instead of a hard-coded path /home/jenkins/jenkins-slave/workspace/maven-wip_maven_MNG-6255-K3D4U5CO77R4RHWNDN6SCWEQCXDBLNZ2JWORRMKCNPTLBZKNCPFQ/test/core-it-suite/target/test-classes/mng-4293/system-0.1.jar @ line 64, column 19
[FATAL] 'dependencies.dependency org.apache.maven.its.mng4293:test:0.1' for org.apache.maven.its.mng4293:test:0.1 is referencing itself. @ line 53, column 17
 @ 
[INFO] [jenkins-event-spy] Generated /home/jenkins/jenkins-slave/workspace/maven-wip_maven_MNG-6255-K3D4U5CO77R4RHWNDN6SCWEQCXDBLNZ2JWORRMKCNPTLBZKNCPFQ/test@tmp/withMaven0f9ad762/maven-spy-20180209-003020-8996683429519186806498.log
[ERROR] The build could not read 1 project -> [Help 1]
org.apache.maven.project.ProjectBuildingException: Some problems were encountered while processing the POMs:
[WARNING] 'dependencies.dependency.systemPath' for org.apache.maven.its.mng4293:system:jar should use a variable instead of a hard-coded path /home/jenkins/jenkins-slave/workspace/maven-wip_maven_MNG-6255-K3D4U5CO77R4RHWNDN6SCWEQCXDBLNZ2JWORRMKCNPTLBZKNCPFQ/test/core-it-suite/target/test-classes/mng-4293/system-0.1.jar @ line 64, column 19
[FATAL] 'dependencies.dependency org.apache.maven.its.mng4293:test:0.1' for org.apache.maven.its.mng4293:test:0.1 is referencing itself. @ line 53, column 17

    at org.apache.maven.project.DefaultProjectBuilder.build (DefaultProjectBuilder.java:382)
    at org.apache.maven.graph.DefaultGraphBuilder.collectProjects (DefaultGraphBuilder.java:400)
    at org.apache.maven.graph.DefaultGraphBuilder.getProjectsForMavenReactor (DefaultGraphBuilder.java:391)
    at org.apache.maven.graph.DefaultGraphBuilder.build (DefaultGraphBuilder.java:78)
    at org.apache.maven.DefaultMaven.buildGraph (DefaultMaven.java:511)
    at org.apache.maven.DefaultMaven.doExecute (DefaultMaven.java:221)
    at org.apache.maven.DefaultMaven.doExecute (DefaultMaven.java:194)
    at org.apache.maven.DefaultMaven.execute (DefaultMaven.java:107)
    at org.apache.maven.cli.MavenCli.execute (MavenCli.java:955)
    at org.apache.maven.cli.MavenCli.doMain (MavenCli.java:290)
    at org.apache.maven.cli.MavenCli.doMain (MavenCli.java:245)
    at sun.reflect.GeneratedMethodAccessor57.invoke (Unknown Source)
    at sun.reflect.DelegatingMethodAccessorImpl.invoke (DelegatingMethodAccessorImpl.java:43)
    at java.lang.reflect.Method.invoke (Method.java:606)
    at org.apache.maven.it.Embedded3xLauncher.run (Embedded3xLauncher.java:247)
    at org.apache.maven.it.Verifier.executeGoals (Verifier.java:1354)
    at org.apache.maven.it.Verifier.executeGoal (Verifier.java:1254)
    at org.apache.maven.it.Verifier.executeGoal (Verifier.java:1248)
    at org.apache.maven.it.MavenITmng4293RequiresCompilePlusRuntimeScopeTest.testit (MavenITmng4293RequiresCompilePlusRuntimeScopeTest.java:64)
    at sun.reflect.NativeMethodAccessorImpl.invoke0 (Native Method)
    at sun.reflect.NativeMethodAccessorImpl.invoke (NativeMethodAccessorImpl.java:57)
    at sun.reflect.DelegatingMethodAccessorImpl.invoke (DelegatingMethodAccessorImpl.java:43)
    at java.lang.reflect.Method.invoke (Method.java:606)
    at junit.framework.TestCase.runTest (TestCase.java:168)
    at org.apache.maven.it.AbstractMavenIntegrationTestCase.runTest (AbstractMavenIntegrationTestCase.java:222)
    at junit.framework.TestCase.runBare (TestCase.java:134)
    at junit.framework.TestResult$1.protect (TestResult.java:110)
    at junit.framework.TestResult.runProtected (TestResult.java:128)
    at junit.framework.TestResult.run (TestResult.java:113)
    at junit.framework.TestCase.run (TestCase.java:124)
    at junit.framework.TestSuite.runTest (TestSuite.java:243)
    at junit.framework.TestSuite.run (TestSuite.java:238)
    at junit.framework.TestSuite.runTest (TestSuite.java:243)
    at junit.framework.TestSuite.run (TestSuite.java:238)
    at org.junit.internal.runners.JUnit38ClassRunner.run (JUnit38ClassRunner.java:83)
    at org.apache.maven.surefire.junit4.JUnit4Provider.execute (JUnit4Provider.java:283)
    at org.apache.maven.surefire.junit4.JUnit4Provider.executeWithRerun (JUnit4Provider.java:173)
    at org.apache.maven.surefire.junit4.JUnit4Provider.executeTestSet (JUnit4Provider.java:153)
    at org.apache.maven.surefire.junit4.JUnit4Provider.invoke (JUnit4Provider.java:128)
    at org.apache.maven.surefire.booter.ForkedBooter.invokeProviderInSameClassLoader (ForkedBooter.java:203)
    at org.apache.maven.surefire.booter.ForkedBooter.runSuitesInProcess (ForkedBooter.java:155)
    at org.apache.maven.surefire.booter.ForkedBooter.main (ForkedBooter.java:103)
[ERROR]   
[ERROR]   The project org.apache.maven.its.mng4293:test:0.1 (/home/jenkins/jenkins-slave/workspace/maven-wip_maven_MNG-6255-K3D4U5CO77R4RHWNDN6SCWEQCXDBLNZ2JWORRMKCNPTLBZKNCPFQ/test/core-it-suite/target/test-classes/mng-4293/pom.xml) has 1 error
[ERROR]     'dependencies.dependency org.apache.maven.its.mng4293:test:0.1' for org.apache.maven.its.mng4293:test:0.1 is referencing itself. @ line 53, column 17
[ERROR] 
[ERROR] Re-run Maven using the -X switch to enable full debug logging.
[ERROR] 
[ERROR] For more information about the errors and possible solutions, please read the following articles:
[ERROR] [Help 1] http://cwiki.apache.org/confluence/display/MAVEN/ProjectBuildingException

	at org.apache.maven.it.Verifier.executeGoals(Verifier.java:1369)
	at org.apache.maven.it.Verifier.executeGoal(Verifier.java:1254)
	at org.apache.maven.it.Verifier.executeGoal(Verifier.java:1248)
	at org.apache.maven.it.MavenITmng4293RequiresCompilePlusRuntimeScopeTest.testit(MavenITmng4293RequiresCompilePlusRuntimeScopeTest.java:64)


FAILED:  org.apache.maven.it.MavenITmng6209MultipleBuildExtensions.testBuildExtensionClassloader

Error Message:
expected:<2> but was:<1>

Stack Trace:
junit.framework.AssertionFailedError: expected:<2> but was:<1>
	at junit.framework.Assert.fail(Assert.java:47)
	at junit.framework.Assert.failNotEquals(Assert.java:283)
	at junit.framework.Assert.assertEquals(Assert.java:64)
	at junit.framework.Assert.assertEquals(Assert.java:195)
	at junit.framework.Assert.assertEquals(Assert.java:201)
	at org.apache.maven.it.MavenITmng6209MultipleBuildExtensions.testBuildExtensionClassloader(MavenITmng6209MultipleBuildExtensions.java:57)


FAILED:  org.apache.maven.its.mng5640.FailingTest.testApp

Error Message:
null

Stack Trace:
junit.framework.AssertionFailedError
	at junit.framework.Assert.fail(Assert.java:47)
	at junit.framework.Assert.assertTrue(Assert.java:20)
	at junit.framework.Assert.assertTrue(Assert.java:27)
	at org.apache.maven.its.mng5640.FailingTest.testApp(FailingTest.java:16)


FAILED:  org.apache.maven.its.mng5640.FailingTest.testApp

Error Message:
null

Stack Trace:
junit.framework.AssertionFailedError
	at junit.framework.Assert.fail(Assert.java:47)
	at junit.framework.Assert.assertTrue(Assert.java:20)
	at junit.framework.Assert.assertTrue(Assert.java:27)
	at org.apache.maven.its.mng5640.FailingTest.testApp(FailingTest.java:16)




Build log:
[...truncated 23.23 MB...]
[linuxJava7] [TASKS] Found 40 open tasks.
[linuxJava7] Skipping warnings blame since pipelines do not have an SCM link.%n
[linuxJava7] [withMaven] artifactsPublisher - Archive artifact core-it-suite/target/test-classes/it0087/pom.xml under org/apache/maven/its/it0087/maven-it-it0087/1.0/maven-it-it0087-1.0.pom
[linuxJava7] [Fast Archiver] No prior successful build to compare, so performing full copy of artifacts
[linuxJava7] [TASKS] Scanning folder '/home/jenkins/jenkins-slave/workspace/maven-wip_maven_MNG-6255-K3D4U5CO77R4RHWNDN6SCWEQCXDBLNZ2JWORRMKCNPTLBZKNCPFQ/test' for files matching the pattern '**/*.java' - excludes: null
[linuxJava7] [TASKS] Found 1157 files to scan for tasks
[linuxJava7] [TASKS] Found 40 open tasks.
[linuxJava7] Skipping warnings blame since pipelines do not have an SCM link.%n
[linuxJava7] [withMaven] artifactsPublisher - Archive artifact core-it-suite/target/test-classes/it0086/pom.xml under org/apache/maven/its/it0086/maven-it-it0086/1.0/maven-it-it0086-1.0.pom
[linuxJava7] [Fast Archiver] No prior successful build to compare, so performing full copy of artifacts
[linuxJava7] [TASKS] Scanning folder '/home/jenkins/jenkins-slave/workspace/maven-wip_maven_MNG-6255-K3D4U5CO77R4RHWNDN6SCWEQCXDBLNZ2JWORRMKCNPTLBZKNCPFQ/test' for files matching the pattern '**/*.java' - excludes: null
[linuxJava7] [TASKS] Found 1157 files to scan for tasks
[linuxJava7] [TASKS] Found 40 open tasks.
[linuxJava7] Skipping warnings blame since pipelines do not have an SCM link.%n
[linuxJava7] [withMaven] artifactsPublisher - Archive artifact core-it-suite/target/test-classes/it0085/pom.xml under org/apache/maven/its/it0085/test/1.0/test-1.0.pom
[linuxJava7] [Fast Archiver] No prior successful build to compare, so performing full copy of artifacts
[linuxJava7] [TASKS] Scanning folder '/home/jenkins/jenkins-slave/workspace/maven-wip_maven_MNG-6255-K3D4U5CO77R4RHWNDN6SCWEQCXDBLNZ2JWORRMKCNPTLBZKNCPFQ/test' for files matching the pattern '**/*.java' - excludes: null
[linuxJava7] [TASKS] Found 1157 files to scan for tasks
[linuxJava7] [TASKS] Found 40 open tasks.
[linuxJava7] Skipping warnings blame since pipelines do not have an SCM link.%n
[linuxJava7] [withMaven] artifactsPublisher - Archive artifact core-it-suite/target/test-classes/it0072/pom.xml under org/apache/maven/its/it0072/maven-it-it0072/1.0-SNAPSHOT/maven-it-it0072-1.0-SNAPSHOT.pom
[linuxJava7] [Fast Archiver] No prior successful build to compare, so performing full copy of artifacts
[linuxJava7] [TASKS] Scanning folder '/home/jenkins/jenkins-slave/workspace/maven-wip_maven_MNG-6255-K3D4U5CO77R4RHWNDN6SCWEQCXDBLNZ2JWORRMKCNPTLBZKNCPFQ/test' for files matching the pattern '**/*.java' - excludes: null
[linuxJava7] [TASKS] Found 1157 files to scan for tasks
[linuxJava7] [TASKS] Found 40 open tasks.
[linuxJava7] Skipping warnings blame since pipelines do not have an SCM link.%n
[linuxJava7] [withMaven] artifactsPublisher - Archive artifact core-it-suite/target/test-classes/it0071/pom.xml under org/apache/maven/its/it0071/maven-it-it0071/1.0-SNAPSHOT/maven-it-it0071-1.0-SNAPSHOT.pom
[linuxJava7] [Fast Archiver] No prior successful build to compare, so performing full copy of artifacts
[linuxJava7] [TASKS] Scanning folder '/home/jenkins/jenkins-slave/workspace/maven-wip_maven_MNG-6255-K3D4U5CO77R4RHWNDN6SCWEQCXDBLNZ2JWORRMKCNPTLBZKNCPFQ/test' for files matching the pattern '**/*.java' - excludes: null
[linuxJava7] [TASKS] Found 1157 files to scan for tasks
[linuxJava7] [TASKS] Found 40 open tasks.
[linuxJava7] Skipping warnings blame since pipelines do not have an SCM link.%n
[linuxJava7] [withMaven] artifactsPublisher - Archive artifact core-it-suite/target/test-classes/it0064/pom.xml under org/apache/maven/its/it0064/test/1.0/test-1.0.pom
[linuxJava7] [Fast Archiver] No prior successful build to compare, so performing full copy of artifacts
[linuxJava7] [TASKS] Scanning folder '/home/jenkins/jenkins-slave/workspace/maven-wip_maven_MNG-6255-K3D4U5CO77R4RHWNDN6SCWEQCXDBLNZ2JWORRMKCNPTLBZKNCPFQ/test' for files matching the pattern '**/*.java' - excludes: null
[linuxJava7] [TASKS] Found 1157 files to scan for tasks
[linuxJava7] [TASKS] Found 40 open tasks.
[linuxJava7] Skipping warnings blame since pipelines do not have an SCM link.%n
[linuxJava7] [withMaven] artifactsPublisher - Archive artifact core-it-suite/target/test-classes/it0063/pom.xml under org/apache/maven/its/it0063/maven-it-it0063/1.0/maven-it-it0063-1.0.pom
[linuxJava7] [Fast Archiver] No prior successful build to compare, so performing full copy of artifacts
[linuxJava7] [TASKS] Scanning folder '/home/jenkins/jenkins-slave/workspace/maven-wip_maven_MNG-6255-K3D4U5CO77R4RHWNDN6SCWEQCXDBLNZ2JWORRMKCNPTLBZKNCPFQ/test' for files matching the pattern '**/*.java' - excludes: null
[linuxJava7] [TASKS] Found 1157 files to scan for tasks
[linuxJava7] [TASKS] Found 40 open tasks.
[linuxJava7] Skipping warnings blame since pipelines do not have an SCM link.%n
[linuxJava7] [withMaven] artifactsPublisher - Archive artifact core-it-suite/target/test-classes/it0056/pom.xml under org/apache/maven/its/it0056/maven-it-it0056/1.0/maven-it-it0056-1.0.pom
[linuxJava7] [Fast Archiver] No prior successful build to compare, so performing full copy of artifacts
[linuxJava7] [TASKS] Scanning folder '/home/jenkins/jenkins-slave/workspace/maven-wip_maven_MNG-6255-K3D4U5CO77R4RHWNDN6SCWEQCXDBLNZ2JWORRMKCNPTLBZKNCPFQ/test' for files matching the pattern '**/*.java' - excludes: null
[linuxJava7] [TASKS] Found 1157 files to scan for tasks
[linuxJava7] [TASKS] Found 40 open tasks.
[linuxJava7] Skipping warnings blame since pipelines do not have an SCM link.%n
[linuxJava7] [withMaven] artifactsPublisher - Archive artifact core-it-suite/target/test-classes/it0052/pom.xml under org/apache/maven/its/it0052/maven-it-it0052/1.0/maven-it-it0052-1.0.pom
[linuxJava7] [Fast Archiver] No prior successful build to compare, so performing full copy of artifacts
[linuxJava7] [withMaven] No <reportsDirectory> element found for <plugin> in <?xml version="1.0" encoding="UTF-8"?><ExecutionEvent _time="2018-02-09 00:33:11.555" class="org.apache.maven.lifecycle.internal.DefaultExecutionEvent" type="MojoSucceeded">
[linuxJava7]     <project artifactId="maven-it-it0052" baseDir="/home/jenkins/jenkins-slave/workspace/maven-wip_maven_MNG-6255-K3D4U5CO77R4RHWNDN6SCWEQCXDBLNZ2JWORRMKCNPTLBZKNCPFQ/test/core-it-suite/target/test-classes/it0052" file="/home/jenkins/jenkins-slave/workspace/maven-wip_maven_MNG-6255-K3D4U5CO77R4RHWNDN6SCWEQCXDBLNZ2JWORRMKCNPTLBZKNCPFQ/test/core-it-suite/target/test-classes/it0052/pom.xml" groupId="org.apache.maven.its.it0052" name="Maven Integration Test :: it0052" version="1.0">
[linuxJava7]       <build directory="/home/jenkins/jenkins-slave/workspace/maven-wip_maven_MNG-6255-K3D4U5CO77R4RHWNDN6SCWEQCXDBLNZ2JWORRMKCNPTLBZKNCPFQ/test/core-it-suite/target/test-classes/it0052/target" sourceDirectory="/home/jenkins/jenkins-slave/workspace/maven-wip_maven_MNG-6255-K3D4U5CO77R4RHWNDN6SCWEQCXDBLNZ2JWORRMKCNPTLBZKNCPFQ/test/core-it-suite/target/test-classes/it0052/src/main/java"/>
[linuxJava7]     </project>
[linuxJava7]     <plugin artifactId="maven-surefire-plugin" executionId="default-test" goal="test" groupId="org.apache.maven.plugins" lifecyclePhase="test" version="0.1-stub-SNAPSHOT"/>
[linuxJava7]   </ExecutionEvent>
[linuxJava7] [TASKS] Scanning folder '/home/jenkins/jenkins-slave/workspace/maven-wip_maven_MNG-6255-K3D4U5CO77R4RHWNDN6SCWEQCXDBLNZ2JWORRMKCNPTLBZKNCPFQ/test' for files matching the pattern '**/*.java' - excludes: null
[linuxJava7] [TASKS] Found 1157 files to scan for tasks
[linuxJava7] [TASKS] Found 40 open tasks.
[linuxJava7] Skipping warnings blame since pipelines do not have an SCM link.%n
[linuxJava7] [withMaven] artifactsPublisher - Archive artifact core-it-suite/target/test-classes/it0051/pom.xml under org/apache/maven/its/it0051/maven-it-it0051/1.0/maven-it-it0051-1.0.pom
[linuxJava7] [Fast Archiver] No prior successful build to compare, so performing full copy of artifacts
[linuxJava7] [withMaven] No <reportsDirectory> element found for <plugin> in <?xml version="1.0" encoding="UTF-8"?><ExecutionEvent _time="2018-02-09 00:33:11.775" class="org.apache.maven.lifecycle.internal.DefaultExecutionEvent" type="MojoSucceeded">
[linuxJava7]     <project artifactId="maven-it-it0051" baseDir="/home/jenkins/jenkins-slave/workspace/maven-wip_maven_MNG-6255-K3D4U5CO77R4RHWNDN6SCWEQCXDBLNZ2JWORRMKCNPTLBZKNCPFQ/test/core-it-suite/target/test-classes/it0051" file="/home/jenkins/jenkins-slave/workspace/maven-wip_maven_MNG-6255-K3D4U5CO77R4RHWNDN6SCWEQCXDBLNZ2JWORRMKCNPTLBZKNCPFQ/test/core-it-suite/target/test-classes/it0051/pom.xml" groupId="org.apache.maven.its.it0051" name="Maven Integration Test :: it0051" version="1.0">
[linuxJava7]       <build directory="/home/jenkins/jenkins-slave/workspace/maven-wip_maven_MNG-6255-K3D4U5CO77R4RHWNDN6SCWEQCXDBLNZ2JWORRMKCNPTLBZKNCPFQ/test/core-it-suite/target/test-classes/it0051/target" sourceDirectory="/home/jenkins/jenkins-slave/workspace/maven-wip_maven_MNG-6255-K3D4U5CO77R4RHWNDN6SCWEQCXDBLNZ2JWORRMKCNPTLBZKNCPFQ/test/core-it-suite/target/test-classes/it0051/src/main/java"/>
[linuxJava7]     </project>
[linuxJava7]     <plugin artifactId="maven-surefire-plugin" executionId="default-test" goal="test" groupId="org.apache.maven.plugins" lifecyclePhase="test" version="0.1-stub-SNAPSHOT"/>
[linuxJava7]   </ExecutionEvent>
[linuxJava7] [TASKS] Scanning folder '/home/jenkins/jenkins-slave/workspace/maven-wip_maven_MNG-6255-K3D4U5CO77R4RHWNDN6SCWEQCXDBLNZ2JWORRMKCNPTLBZKNCPFQ/test' for files matching the pattern '**/*.java' - excludes: null
[linuxJava7] [TASKS] Found 1157 files to scan for tasks
[linuxJava7] [TASKS] Found 40 open tasks.
[linuxJava7] Skipping warnings blame since pipelines do not have an SCM link.%n
[linuxJava7] [withMaven] artifactsPublisher - Archive artifact core-it-suite/target/test-classes/it0041/pom.xml under org/apache/maven/its/it0041/test/1.0-SNAPSHOT/test-1.0-SNAPSHOT.pom
[linuxJava7] [Fast Archiver] No prior successful build to compare, so performing full copy of artifacts
[linuxJava7] [TASKS] Scanning folder '/home/jenkins/jenkins-slave/workspace/maven-wip_maven_MNG-6255-K3D4U5CO77R4RHWNDN6SCWEQCXDBLNZ2JWORRMKCNPTLBZKNCPFQ/test' for files matching the pattern '**/*.java' - excludes: null
[linuxJava7] [TASKS] Found 1157 files to scan for tasks
[linuxJava7] [TASKS] Found 40 open tasks.
[linuxJava7] Skipping warnings blame since pipelines do not have an SCM link.%n
[linuxJava7] [withMaven] artifactsPublisher - Archive artifact core-it-suite/target/test-classes/it0040/pom.xml under org/apache/maven/its/it0040/maven-it-it0040/1.0/maven-it-it0040-1.0.pom
[linuxJava7] [Fast Archiver] No prior successful build to compare, so performing full copy of artifacts
[linuxJava7] [TASKS] Scanning folder '/home/jenkins/jenkins-slave/workspace/maven-wip_maven_MNG-6255-K3D4U5CO77R4RHWNDN6SCWEQCXDBLNZ2JWORRMKCNPTLBZKNCPFQ/test' for files matching the pattern '**/*.java' - excludes: null
[linuxJava7] [TASKS] Found 1157 files to scan for tasks
[linuxJava7] [TASKS] Found 40 open tasks.
[linuxJava7] Skipping warnings blame since pipelines do not have an SCM link.%n
[linuxJava7] [withMaven] artifactsPublisher - Archive artifact core-it-suite/target/test-classes/it0038/project/pom2.xml under org/apache/maven/its/it0038/test/0.2/test-0.2.pom
[linuxJava7] [Fast Archiver] No prior successful build to compare, so performing full copy of artifacts
[linuxJava7] [TASKS] Scanning folder '/home/jenkins/jenkins-slave/workspace/maven-wip_maven_MNG-6255-K3D4U5CO77R4RHWNDN6SCWEQCXDBLNZ2JWORRMKCNPTLBZKNCPFQ/test' for files matching the pattern '**/*.java' - excludes: null
[linuxJava7] [TASKS] Found 1157 files to scan for tasks
[linuxJava7] [TASKS] Found 40 open tasks.
[linuxJava7] Skipping warnings blame since pipelines do not have an SCM link.%n
[linuxJava7] [withMaven] artifactsPublisher - Archive artifact core-it-suite/target/test-classes/it0037/pom2.xml under org/apache/maven/its/it0037/test/0.1/test-0.1.pom
[linuxJava7] [Fast Archiver] No prior successful build to compare, so performing full copy of artifacts
[linuxJava7] [TASKS] Scanning folder '/home/jenkins/jenkins-slave/workspace/maven-wip_maven_MNG-6255-K3D4U5CO77R4RHWNDN6SCWEQCXDBLNZ2JWORRMKCNPTLBZKNCPFQ/test' for files matching the pattern '**/*.java' - excludes: null
[linuxJava7] [TASKS] Found 1157 files to scan for tasks
[linuxJava7] [TASKS] Found 40 open tasks.
[linuxJava7] Skipping warnings blame since pipelines do not have an SCM link.%n
[linuxJava7] [withMaven] artifactsPublisher - Archive artifact core-it-suite/target/test-classes/it0032/pom.xml under org/apache/maven/its/it0032/test/1.0/test-1.0.pom
[linuxJava7] [Fast Archiver] No prior successful build to compare, so performing full copy of artifacts
[linuxJava7] [TASKS] Scanning folder '/home/jenkins/jenkins-slave/workspace/maven-wip_maven_MNG-6255-K3D4U5CO77R4RHWNDN6SCWEQCXDBLNZ2JWORRMKCNPTLBZKNCPFQ/test' for files matching the pattern '**/*.java' - excludes: null
[linuxJava7] [TASKS] Found 1157 files to scan for tasks
[linuxJava7] [TASKS] Found 40 open tasks.
[linuxJava7] Skipping warnings blame since pipelines do not have an SCM link.%n
[linuxJava7] [withMaven] artifactsPublisher - Archive artifact core-it-suite/target/test-classes/it0030/pom.xml under org/apache/maven/its/it0030/maven-it-it0030/1.0-SNAPSHOT/maven-it-it0030-1.0-SNAPSHOT.pom
[linuxJava7] [withMaven] artifactsPublisher - Archive artifact core-it-suite/target/test-classes/it0030/child-hierarchy/pom.xml under org/apache/maven/its/it0030/child-hierarchy/1.0-SNAPSHOT/child-hierarchy-1.0-SNAPSHOT.pom
[linuxJava7] [withMaven] artifactsPublisher - Archive artifact core-it-suite/target/test-classes/it0030/child-hierarchy/project1/pom.xml under org/apache/maven/its/it0030/project1/1.0-SNAPSHOT/project1-1.0-SNAPSHOT.pom
[linuxJava7] [withMaven] artifactsPublisher - Archive artifact core-it-suite/target/test-classes/it0030/child-hierarchy/project1/target/project1-1.0-SNAPSHOT.jar under org/apache/maven/its/it0030/project1/1.0-SNAPSHOT/project1-1.0-SNAPSHOT.jar
[linuxJava7] [withMaven] artifactsPublisher - Archive artifact core-it-suite/target/test-classes/it0030/child-hierarchy/project2/pom.xml under org/apache/maven/its/it0030/project2/1.0-SNAPSHOT/project2-1.0-SNAPSHOT.pom
[linuxJava7] [withMaven] artifactsPublisher - Archive artifact core-it-suite/target/test-classes/it0030/child-hierarchy/project2/target/project2-1.0-SNAPSHOT.jar under org/apache/maven/its/it0030/project2/1.0-SNAPSHOT/project2-1.0-SNAPSHOT.jar
[linuxJava7] [Fast Archiver] No prior successful build to compare, so performing full copy of artifacts
[linuxJava7] [withMaven] junitPublisher - Archive test results for Maven artifact org.apache.maven.its.it0030:project1:1.0-SNAPSHOT generated by maven-surefire-plugin:test (default-test): core-it-suite/target/test-classes/it0030/child-hierarchy/project1/target/surefire-reports/*.xml
[linuxJava7] [withMaven] junitPublisher - Jenkins JUnit Attachments Plugin not found, can't publish test attachments.Recording test results
[linuxJava7] None of the test reports contained any result
[linuxJava7] [withMaven] junitPublisher - Archive test results for Maven artifact org.apache.maven.its.it0030:project2:1.0-SNAPSHOT generated by maven-surefire-plugin:test (default-test): core-it-suite/target/test-classes/it0030/child-hierarchy/project2/target/surefire-reports/*.xml
[linuxJava7] [withMaven] junitPublisher - Jenkins JUnit Attachments Plugin not found, can't publish test attachments.Recording test results
[linuxJava7] None of the test reports contained any result
[linuxJava7] [withMaven] openTasksPublisher - Scan Tasks for Maven artifact org.apache.maven.its.it0030:project2:1.0-SNAPSHOT in source directory core-it-suite/target/test-classes/it0030/child-hierarchy/project2/src/main/java
[linuxJava7] [TASKS] Scanning folder '/home/jenkins/jenkins-slave/workspace/maven-wip_maven_MNG-6255-K3D4U5CO77R4RHWNDN6SCWEQCXDBLNZ2JWORRMKCNPTLBZKNCPFQ/test' for files matching the pattern 'core-it-suite/target/test-classes/it0030/child-hierarchy/project2/src/main/java/**/*' - excludes: null
[linuxJava7] [TASKS] Found 1 files to scan for tasks
[linuxJava7] [TASKS] Found 0 open tasks.
[linuxJava7] Skipping warnings blame since pipelines do not have an SCM link.%n
[linuxJava7] [withMaven] artifactsPublisher - Archive artifact core-it-suite/target/test-classes/it0025/pom.xml under org/apache/maven/its/it0025/maven-it-it0025/1.0-SNAPSHOT/maven-it-it0025-1.0-SNAPSHOT.pom
[linuxJava7] [Fast Archiver] No prior successful build to compare, so performing full copy of artifacts
[linuxJava7] [TASKS] Scanning folder '/home/jenkins/jenkins-slave/workspace/maven-wip_maven_MNG-6255-K3D4U5CO77R4RHWNDN6SCWEQCXDBLNZ2JWORRMKCNPTLBZKNCPFQ/test' for files matching the pattern '**/*.java' - excludes: null
[linuxJava7] [TASKS] Found 1157 files to scan for tasks
[linuxJava7] [TASKS] Found 40 open tasks.
[linuxJava7] Skipping warnings blame since pipelines do not have an SCM link.%n
[linuxJava7] [withMaven] artifactsPublisher - Archive artifact core-it-suite/target/test-classes/it0024/pom.xml under org/apache/maven/its/it0024/maven-it-it0024/1.0/maven-it-it0024-1.0.pom
[linuxJava7] [Fast Archiver] No prior successful build to compare, so performing full copy of artifacts
[linuxJava7] [TASKS] Scanning folder '/home/jenkins/jenkins-slave/workspace/maven-wip_maven_MNG-6255-K3D4U5CO77R4RHWNDN6SCWEQCXDBLNZ2JWORRMKCNPTLBZKNCPFQ/test' for files matching the pattern '**/*.java' - excludes: null
[linuxJava7] [TASKS] Found 1157 files to scan for tasks
[linuxJava7] [TASKS] Found 40 open tasks.
[linuxJava7] Skipping warnings blame since pipelines do not have an SCM link.%n
[linuxJava7] [withMaven] artifactsPublisher - Archive artifact core-it-suite/target/test-classes/it0023/pom.xml under org/apache/maven/its/it0023/maven-it-it0023/1.0-SNAPSHOT/maven-it-it0023-1.0-SNAPSHOT.pom
[linuxJava7] [Fast Archiver] No prior successful build to compare, so performing full copy of artifacts
[linuxJava7] [TASKS] Scanning folder '/home/jenkins/jenkins-slave/workspace/maven-wip_maven_MNG-6255-K3D4U5CO77R4RHWNDN6SCWEQCXDBLNZ2JWORRMKCNPTLBZKNCPFQ/test' for files matching the pattern '**/*.java' - excludes: null
[linuxJava7] [TASKS] Found 1157 files to scan for tasks
[linuxJava7] [TASKS] Found 40 open tasks.
[linuxJava7] Skipping warnings blame since pipelines do not have an SCM link.%n
[linuxJava7] [withMaven] artifactsPublisher - Archive artifact core-it-suite/target/test-classes/it0021/pom.xml under org/apache/maven/its/it0021/test/1.0-SNAPSHOT/test-1.0-SNAPSHOT.pom
[linuxJava7] [Fast Archiver] No prior successful build to compare, so performing full copy of artifacts
[linuxJava7] [TASKS] Scanning folder '/home/jenkins/jenkins-slave/workspace/maven-wip_maven_MNG-6255-K3D4U5CO77R4RHWNDN6SCWEQCXDBLNZ2JWORRMKCNPTLBZKNCPFQ/test' for files matching the pattern '**/*.java' - excludes: null
[linuxJava7] [TASKS] Found 1157 files to scan for tasks
[linuxJava7] [TASKS] Found 40 open tasks.
[linuxJava7] Skipping warnings blame since pipelines do not have an SCM link.%n
[linuxJava7] [withMaven] artifactsPublisher - Archive artifact core-it-suite/target/test-classes/it0019/pom.xml under org/apache/maven/its/it0019/maven-it-it0019/1.0/maven-it-it0019-1.0.pom
[linuxJava7] [Fast Archiver] No prior successful build to compare, so performing full copy of artifacts
[linuxJava7] [TASKS] Scanning folder '/home/jenkins/jenkins-slave/workspace/maven-wip_maven_MNG-6255-K3D4U5CO77R4RHWNDN6SCWEQCXDBLNZ2JWORRMKCNPTLBZKNCPFQ/test' for files matching the pattern '**/*.java' - excludes: null
[linuxJava7] [TASKS] Found 1157 files to scan for tasks
[linuxJava7] [TASKS] Found 40 open tasks.
[linuxJava7] Skipping warnings blame since pipelines do not have an SCM link.%n
[linuxJava7] [withMaven] artifactsPublisher - Archive artifact core-it-suite/target/test-classes/it0018/pom.xml under org/apache/maven/its/it0018/maven-it-it0018/1.0/maven-it-it0018-1.0.pom
[linuxJava7] [Fast Archiver] No prior successful build to compare, so performing full copy of artifacts
[linuxJava7] [TASKS] Scanning folder '/home/jenkins/jenkins-slave/workspace/maven-wip_maven_MNG-6255-K3D4U5CO77R4RHWNDN6SCWEQCXDBLNZ2JWORRMKCNPTLBZKNCPFQ/test' for files matching the pattern '**/*.java' - excludes: null
[linuxJava7] [TASKS] Found 1157 files to scan for tasks
[linuxJava7] [TASKS] Found 40 open tasks.
[linuxJava7] Skipping warnings blame since pipelines do not have an SCM link.%n
[linuxJava7] [withMaven] artifactsPublisher - Archive artifact core-it-suite/target/test-classes/it0012/child-project/pom.xml under org/apache/maven/child-project/3.0.3/child-project-3.0.3.pom
[linuxJava7] [withMaven] artifactsPublisher - Archive artifact core-it-suite/target/test-classes/it0012/pom.xml under org/apache/maven/its/it0012/maven-it-it0012/3.8.1/maven-it-it0012-3.8.1.pom
[linuxJava7] [Fast Archiver] No prior successful build to compare, so performing full copy of artifacts
[linuxJava7] [TASKS] Scanning folder '/home/jenkins/jenkins-slave/workspace/maven-wip_maven_MNG-6255-K3D4U5CO77R4RHWNDN6SCWEQCXDBLNZ2JWORRMKCNPTLBZKNCPFQ/test' for files matching the pattern '**/*.java' - excludes: null
[linuxJava7] [TASKS] Found 1157 files to scan for tasks
[linuxJava7] [TASKS] Found 40 open tasks.
[linuxJava7] Skipping warnings blame since pipelines do not have an SCM link.%n
[linuxJava7] [withMaven] artifactsPublisher - Archive artifact core-it-suite/target/test-classes/it0011/pom.xml under org/apache/maven/its/it0011/test/1.0/test-1.0.pom
[linuxJava7] [Fast Archiver] No prior successful build to compare, so performing full copy of artifacts
[linuxJava7] [TASKS] Scanning folder '/home/jenkins/jenkins-slave/workspace/maven-wip_maven_MNG-6255-K3D4U5CO77R4RHWNDN6SCWEQCXDBLNZ2JWORRMKCNPTLBZKNCPFQ/test' for files matching the pattern '**/*.java' - excludes: null
[linuxJava7] [TASKS] Found 1157 files to scan for tasks
[linuxJava7] [TASKS] Found 40 open tasks.
[linuxJava7] Skipping warnings blame since pipelines do not have an SCM link.%n
[linuxJava7] [withMaven] artifactsPublisher - Archive artifact core-it-suite/target/test-classes/it0010/pom.xml under org/apache/maven/its/it0010/test/1.0/test-1.0.pom
[linuxJava7] [Fast Archiver] No prior successful build to compare, so performing full copy of artifacts
[linuxJava7] [TASKS] Scanning folder '/home/jenkins/jenkins-slave/workspace/maven-wip_maven_MNG-6255-K3D4U5CO77R4RHWNDN6SCWEQCXDBLNZ2JWORRMKCNPTLBZKNCPFQ/test' for files matching the pattern '**/*.java' - excludes: null
[linuxJava7] [TASKS] Found 1157 files to scan for tasks
[linuxJava7] [TASKS] Found 40 open tasks.
[linuxJava7] Skipping warnings blame since pipelines do not have an SCM link.%n
[linuxJava7] [withMaven] artifactsPublisher - Archive artifact core-it-suite/target/test-classes/it0009/pom.xml under org/apache/maven/its/it0009/test/1.0/test-1.0.pom
[linuxJava7] [Fast Archiver] No prior successful build to compare, so performing full copy of artifacts
[linuxJava7] [TASKS] Scanning folder '/home/jenkins/jenkins-slave/workspace/maven-wip_maven_MNG-6255-K3D4U5CO77R4RHWNDN6SCWEQCXDBLNZ2JWORRMKCNPTLBZKNCPFQ/test' for files matching the pattern '**/*.java' - excludes: null
[linuxJava7] [TASKS] Found 1157 files to scan for tasks
[linuxJava7] [TASKS] Found 40 open tasks.
[linuxJava7] Skipping warnings blame since pipelines do not have an SCM link.%n
[linuxJava7] [withMaven] artifactsPublisher - Archive artifact core-it-suite/target/test-classes/it0008/pom.xml under org/apache/maven/its/it0008/test/1.0/test-1.0.pom
[linuxJava7] [Fast Archiver] No prior successful build to compare, so performing full copy of artifacts
[linuxJava7] [TASKS] Scanning folder '/home/jenkins/jenkins-slave/workspace/maven-wip_maven_MNG-6255-K3D4U5CO77R4RHWNDN6SCWEQCXDBLNZ2JWORRMKCNPTLBZKNCPFQ/test' for files matching the pattern '**/*.java' - excludes: null
[linuxJava7] [TASKS] Found 1157 files to scan for tasks
[linuxJava7] [TASKS] Found 40 open tasks.
[linuxJava7] Skipping warnings blame since pipelines do not have an SCM link.%n
[linuxJava7] [withMaven] artifactsPublisher - Archive artifact core-it-suite/target/test-classes/mng-6209-multiple-build-extensions/plugin-a/pom.xml under mng-6209-multiple-build-extensions/mng-6209-multiple-build-extensions-plugin-a/0.1/mng-6209-multiple-build-extensions-plugin-a-0.1.pom
[linuxJava7] [withMaven] artifactsPublisher - Archive artifact core-it-suite/target/test-classes/mng-6209-multiple-build-extensions/plugin-a/target/mng-6209-multiple-build-extensions-plugin-a-0.1.jar under mng-6209-multiple-build-extensions/mng-6209-multiple-build-extensions-plugin-a/0.1/mng-6209-multiple-build-extensions-plugin-a-0.1.jar
[linuxJava7] [Fast Archiver] No prior successful build to compare, so performing full copy of artifacts
[linuxJava7] [withMaven] junitPublisher - Archive test results for Maven artifact mng-6209-multiple-build-extensions:mng-6209-multiple-build-extensions-plugin-a:0.1 generated by maven-surefire-plugin:test (default-test): core-it-suite/target/test-classes/mng-6209-multiple-build-extensions/plugin-a/target/surefire-reports/*.xml
[linuxJava7] [withMaven] junitPublisher - Jenkins JUnit Attachments Plugin not found, can't publish test attachments.Recording test results
[linuxJava7] None of the test reports contained any result
[linuxJava7] [withMaven] openTasksPublisher - Scan Tasks for Maven artifact mng-6209-multiple-build-extensions:mng-6209-multiple-build-extensions-plugin-a:0.1 in source directory core-it-suite/target/test-classes/mng-6209-multiple-build-extensions/plugin-a/src/main/java
[linuxJava7] [TASKS] Scanning folder '/home/jenkins/jenkins-slave/workspace/maven-wip_maven_MNG-6255-K3D4U5CO77R4RHWNDN6SCWEQCXDBLNZ2JWORRMKCNPTLBZKNCPFQ/test' for files matching the pattern 'core-it-suite/target/test-classes/mng-6209-multiple-build-extensions/plugin-a/src/main/java/**/*' - excludes: null
[linuxJava7] [TASKS] Found 2 files to scan for tasks
[linuxJava7] [TASKS] Found 0 open tasks.
[linuxJava7] Skipping warnings blame since pipelines do not have an SCM link.%n
[linuxJava7] [withMaven] artifactsPublisher - Archive artifact core-it-suite/target/test-classes/mng-6209-multiple-build-extensions/plugin-b/pom.xml under mng-6209-multiple-build-extensions/mng-6209-multiple-build-extensions-plugin-b/0.1/mng-6209-multiple-build-extensions-plugin-b-0.1.pom
[linuxJava7] [withMaven] artifactsPublisher - Archive artifact core-it-suite/target/test-classes/mng-6209-multiple-build-extensions/plugin-b/target/mng-6209-multiple-build-extensions-plugin-b-0.1.jar under mng-6209-multiple-build-extensions/mng-6209-multiple-build-extensions-plugin-b/0.1/mng-6209-multiple-build-extensions-plugin-b-0.1.jar
[linuxJava7] [Fast Archiver] No prior successful build to compare, so performing full copy of artifacts
[linuxJava7] [withMaven] junitPublisher - Archive test results for Maven artifact mng-6209-multiple-build-extensions:mng-6209-multiple-build-extensions-plugin-b:0.1 generated by maven-surefire-plugin:test (default-test): core-it-suite/target/test-classes/mng-6209-multiple-build-extensions/plugin-b/target/surefire-reports/*.xml
[linuxJava7] [withMaven] junitPublisher - Jenkins JUnit Attachments Plugin not found, can't publish test attachments.Recording test results
[linuxJava7] None of the test reports contained any result
[linuxJava7] [withMaven] openTasksPublisher - Scan Tasks for Maven artifact mng-6209-multiple-build-extensions:mng-6209-multiple-build-extensions-plugin-b:0.1 in source directory core-it-suite/target/test-classes/mng-6209-multiple-build-extensions/plugin-b/src/main/java
[linuxJava7] [TASKS] Scanning folder '/home/jenkins/jenkins-slave/workspace/maven-wip_maven_MNG-6255-K3D4U5CO77R4RHWNDN6SCWEQCXDBLNZ2JWORRMKCNPTLBZKNCPFQ/test' for files matching the pattern 'core-it-suite/target/test-classes/mng-6209-multiple-build-extensions/plugin-b/src/main/java/**/*' - excludes: null
[linuxJava7] [TASKS] Found 1 files to scan for tasks
[linuxJava7] [TASKS] Found 0 open tasks.
[linuxJava7] Skipping warnings blame since pipelines do not have an SCM link.%n
[linuxJava7] [withMaven] artifactsPublisher - Archive artifact core-it-suite/target/test-classes/mng-6209-multiple-build-extensions/project/pom.xml under mng-6209-multiple-build-extensions/mng-6209-multiple-build-extensions-project/0.1/mng-6209-multiple-build-extensions-project-0.1.pom
[linuxJava7] [Fast Archiver] No prior successful build to compare, so performing full copy of artifacts
[linuxJava7] [TASKS] Scanning folder '/home/jenkins/jenkins-slave/workspace/maven-wip_maven_MNG-6255-K3D4U5CO77R4RHWNDN6SCWEQCXDBLNZ2JWORRMKCNPTLBZKNCPFQ/test' for files matching the pattern '**/*.java' - excludes: null
[linuxJava7] [TASKS] Found 1157 files to scan for tasks
[linuxJava7] [TASKS] Found 40 open tasks.
[linuxJava7] Skipping warnings blame since pipelines do not have an SCM link.%n
[linuxJava7] [withMaven] artifactsPublisher - Archive artifact core-it-suite/target/test-classes/mng-6210-core-extensions-scopes/client/pom.xml under org/apache/maven/its/it-core-extensions-custom-scopes/test/0.1/test-0.1.pom
[linuxJava7] [Fast Archiver] No prior successful build to compare, so performing full copy of artifacts
[linuxJava7] [TASKS] Scanning folder '/home/jenkins/jenkins-slave/workspace/maven-wip_maven_MNG-6255-K3D4U5CO77R4RHWNDN6SCWEQCXDBLNZ2JWORRMKCNPTLBZKNCPFQ/test' for files matching the pattern '**/*.java' - excludes: null
[linuxJava7] [TASKS] Found 1157 files to scan for tasks
[linuxJava7] [TASKS] Found 40 open tasks.
[linuxJava7] Skipping warnings blame since pipelines do not have an SCM link.%n
[linuxJava7] [withMaven] One or multiple Maven executions have been ignored by the Jenkins Pipeline Maven Plugin because they have been interrupted before completion (4). See Pipeline Maven Plugin FAQ for more details.
[Pipeline] [linuxJava7] }
[Pipeline] [linuxJava8] deleteDir
[Pipeline] [linuxJava7] // withMaven
[Pipeline] [linuxJava7] deleteDir
[Pipeline] [linuxJava8] }
[Pipeline] [linuxJava8] // dir
[Pipeline] [linuxJava8] }
[Pipeline] [linuxJava8] // stage
[Pipeline] [linuxJava8] }
[Pipeline] [linuxJava8] // node
[Pipeline] [linuxJava8] }
[Pipeline] [linuxJava7] }
[Pipeline] [linuxJava7] // dir
[Pipeline] [linuxJava7] }
[Pipeline] [linuxJava7] // stage
[Pipeline] [linuxJava7] }
[Pipeline] [linuxJava7] // node
[Pipeline] [linuxJava7] }
[Pipeline] // parallel
[Pipeline] stage
[Pipeline] { (Notifications)
[Pipeline] echo
Build result: UNSTABLE
[Pipeline] jiraIssueSelector
[Pipeline] emailext
Mime
  • Unnamed multipart/mixed (inline, None, 0 bytes)
View raw message