maven-notifications mailing list archives

Site index · List index
Message view « Date » · « Thread »
Top « Date » · « Thread »
From Apache Jenkins Server <jenk...@builds.apache.org>
Subject Build failed in Jenkins: Maven TLP » maven-dependency-plugin » MDEP-599 #1
Date Tue, 13 Feb 2018 18:59:44 GMT
See https://builds.apache.org/job/maven-box/job/maven-dependency-plugin/job/MDEP-599/1/

No changes.

All tests passed

Build log:
[...truncated 1.52 MB...]
[linux-jdk8] [INFO] Tests run: 6, Failures: 0, Errors: 0, Skipped: 0, Time elapsed: 0.694
s - in org.apache.maven.plugins.dependency.utils.translators.TestClassifierTypeTranslator
[linux-jdk8] [INFO] Running org.apache.maven.plugins.dependency.utils.TestSilentLog
[linux-jdk8] [INFO] Tests run: 2, Failures: 0, Errors: 0, Skipped: 0, Time elapsed: 0 s -
in org.apache.maven.plugins.dependency.utils.TestSilentLog
[linux-jdk8] [INFO] Running org.apache.maven.plugins.dependency.utils.markers.TestSourcesMarkerFileHandler
[linux-jdk8] [INFO] Tests run: 10, Failures: 0, Errors: 0, Skipped: 0, Time elapsed: 0.01
s - in org.apache.maven.plugins.dependency.utils.markers.TestSourcesMarkerFileHandler
[linux-jdk8] [INFO] Running org.apache.maven.plugins.dependency.utils.markers.TestDefaultMarkerFileHandler
[linux-jdk8] [INFO] Tests run: 6, Failures: 0, Errors: 0, Skipped: 0, Time elapsed: 0.007
s - in org.apache.maven.plugins.dependency.utils.markers.TestDefaultMarkerFileHandler
[linux-jdk8] [INFO] Running org.apache.maven.plugins.dependency.utils.markers.TestUnpackMarkerFileHandler
[windows-jdk7] [INFO] There are 3 errors reported by Checkstyle 6.18 with config/maven_checks.xml
ruleset.
[windows-jdk7] [ERROR] src\main\java\org\apache\maven\plugins\dependency\PurgeLocalRepositoryMojo.java:[248,9]
(modifier) RedundantModifier: Redundant 'public' modifier.
[windows-jdk7] [ERROR] src\main\java\org\apache\maven\plugins\dependency\tree\TGFDependencyNodeVisitor.java:[70,9]
(modifier) RedundantModifier: Redundant 'public' modifier.
[windows-jdk7] [INFO] Ignored 1 error, 2 violations remaining.
[windows-jdk7] [INFO] ------------------------------------------------------------------------
[windows-jdk7] [INFO] BUILD FAILURE
[windows-jdk7] [INFO] ------------------------------------------------------------------------
[windows-jdk7] [INFO] Total time: 05:24 min
[windows-jdk7] [INFO] Finished at: 2018-02-13T18:59:08Z
[windows-jdk7] [INFO] Final Memory: 56M/518M
[windows-jdk7] [INFO] ------------------------------------------------------------------------
[windows-jdk7] [INFO] [jenkins-event-spy] Generated F:\jenkins\jenkins-slave\workspace\-dependency-plugin_MDEP-599-GXX474QCFQGSC3DNH2FLQYLQUVF3C5YMYONGRD2LVYVVDYQXVZMQ@tmp\withMaveneaa1be11\maven-spy-20180213-185343-5622780096814211508284.log
[windows-jdk7] [ERROR] Failed to execute goal org.apache.maven.plugins:maven-checkstyle-plugin:3.0.0:check
(checkstyle-check) on project maven-dependency-plugin: You have 2 Checkstyle violations. ->
[Help 1]
[windows-jdk7] [ERROR] 
[windows-jdk7] [ERROR] To see the full stack trace of the errors, re-run Maven with the -e
switch.
[windows-jdk7] [ERROR] Re-run Maven using the -X switch to enable full debug logging.
[windows-jdk7] [ERROR] 
[windows-jdk7] [ERROR] For more information about the errors and possible solutions, please
read the following articles:
[windows-jdk7] [ERROR] [Help 1] http://cwiki.apache.org/confluence/display/MAVEN/MojoFailureException
[windows-jdk7] Picked up JAVA_TOOL_OPTIONS: -Dmaven.ext.class.path="f:\jenkins\jenkins-slave\workspace\-dependency-plugin_MDEP-599-GXX474QCFQGSC3DNH2FLQYLQUVF3C5YMYONGRD2LVYVVDYQXVZMQ@tmp\withMaveneaa1be11\pipeline-maven-spy.jar"
-Dorg.jenkinsci.plugins.pipeline.maven.reportsFolder="f:\jenkins\jenkins-slave\workspace\-dependency-plugin_MDEP-599-GXX474QCFQGSC3DNH2FLQYLQUVF3C5YMYONGRD2LVYVVDYQXVZMQ@tmp\withMaveneaa1be11"

[windows-jdk8] [INFO] run post-build script verify.bsh
[windows-jdk8] [INFO]           get-artifact-no-transitive\pom.xml ............... SUCCESS
(8.1 s)
[windows-jdk8] [INFO] Building: get-gav\pom.xml
[windows-jdk8] [INFO] run pre-build script setup.bsh
[Pipeline] [windows-jdk7] }
[Pipeline] [windows-jdk7] // dir
[linux-jdk8] [INFO] Tests run: 9, Failures: 0, Errors: 0, Skipped: 0, Time elapsed: 1.226
s - in org.apache.maven.plugins.dependency.utils.markers.TestUnpackMarkerFileHandler
[linux-jdk8] [INFO] Running org.apache.maven.plugins.dependency.utils.filters.TestDestFileFilter
[linux-jdk8] [INFO] Tests run: 8, Failures: 0, Errors: 0, Skipped: 0, Time elapsed: 0.008
s - in org.apache.maven.plugins.dependency.utils.filters.TestDestFileFilter
[linux-jdk8] [INFO] Running org.apache.maven.plugins.dependency.utils.filters.TestResolveMarkerFileFilter
[linux-jdk8] [INFO] Tests run: 1, Failures: 0, Errors: 0, Skipped: 0, Time elapsed: 0.001
s - in org.apache.maven.plugins.dependency.utils.filters.TestResolveMarkerFileFilter
[linux-jdk8] [INFO] Running org.apache.maven.plugins.dependency.utils.filters.TestMarkerFileFilter
[linux-jdk8] [INFO] Tests run: 5, Failures: 0, Errors: 0, Skipped: 0, Time elapsed: 0.002
s - in org.apache.maven.plugins.dependency.utils.filters.TestMarkerFileFilter
[linux-jdk8] [INFO] Running org.apache.maven.plugins.dependency.tree.TestTreeMojo
[linux-jdk8] [INFO] Tests run: 1, Failures: 0, Errors: 0, Skipped: 0, Time elapsed: 0.08 s
- in org.apache.maven.plugins.dependency.tree.TestTreeMojo
[linux-jdk8] [INFO] Running org.apache.maven.plugins.dependency.TestPropertiesMojo
[linux-jdk8] [INFO] Tests run: 1, Failures: 0, Errors: 0, Skipped: 0, Time elapsed: 0.099
s - in org.apache.maven.plugins.dependency.TestPropertiesMojo
[linux-jdk8] [INFO] Running org.apache.maven.plugins.dependency.resolvers.TestResolveMojo
[linux-jdk8] [INFO] Tests run: 2, Failures: 0, Errors: 0, Skipped: 0, Time elapsed: 0.251
s - in org.apache.maven.plugins.dependency.resolvers.TestResolveMojo
[linux-jdk8] [INFO] Running org.apache.maven.plugins.dependency.resolvers.ResolveDependenciesMojoTest
[linux-jdk8] [INFO] Tests run: 3, Failures: 0, Errors: 0, Skipped: 0, Time elapsed: 0.251
s - in org.apache.maven.plugins.dependency.resolvers.ResolveDependenciesMojoTest
[linux-jdk8] [INFO] Running org.apache.maven.plugins.dependency.fromDependencies.TestCopyDependenciesMojo2
[linux-jdk8] [INFO] Tests run: 11, Failures: 0, Errors: 0, Skipped: 0, Time elapsed: 1.01
s - in org.apache.maven.plugins.dependency.fromDependencies.TestCopyDependenciesMojo2
[linux-jdk8] [INFO] Running org.apache.maven.plugins.dependency.fromDependencies.TestCopyDependenciesMojo
[windows-jdk8] [INFO] run post-build script verify.bsh
[windows-jdk8] [INFO]           get-gav\pom.xml .................................. SUCCESS
(7.1 s)
[windows-jdk8] [INFO] Building: go-offline\pom.xml
[windows-jdk9] [INFO]           mdep-439-analyze-java8\pom.xml ................... SUCCESS
(10.3 s)
[windows-jdk9] [INFO] Building: mdep-450-project-with-ancestor\pom.xml
[linux-jdk8] [INFO] Tests run: 33, Failures: 0, Errors: 0, Skipped: 0, Time elapsed: 5.386
s - in org.apache.maven.plugins.dependency.fromDependencies.TestCopyDependenciesMojo
[linux-jdk8] [INFO] Running org.apache.maven.plugins.dependency.fromDependencies.TestUnpackDependenciesMojo2
[windows-jdk9] [INFO] run post-build script verify.groovy
[windows-jdk9] [INFO]           mdep-450-project-with-ancestor\pom.xml ........... SUCCESS
(7.2 s)
[windows-jdk9] [INFO] Building: mdep-450-project-without-ancestor\pom.xml
[linux-jdk8] [INFO] Tests run: 5, Failures: 0, Errors: 0, Skipped: 0, Time elapsed: 6.982
s - in org.apache.maven.plugins.dependency.fromDependencies.TestUnpackDependenciesMojo2
[linux-jdk8] [INFO] Running org.apache.maven.plugins.dependency.fromDependencies.TestIncludeExcludeUnpackDependenciesMojo
[linux-jdk8] [INFO] Tests run: 7, Failures: 0, Errors: 0, Skipped: 0, Time elapsed: 1.169
s - in org.apache.maven.plugins.dependency.fromDependencies.TestIncludeExcludeUnpackDependenciesMojo
[linux-jdk8] [INFO] Running org.apache.maven.plugins.dependency.fromDependencies.TestUnpackDependenciesMojo
[Pipeline] [windows-jdk7] }
[windows-jdk7] [withMaven] Skip 'Generated Artifacts Publisher' disabled by configuration
[windows-jdk7] [withMaven] junitPublisher - Archive test results for Maven artifact org.apache.maven.plugins:maven-dependency-plugin:3.0.3-SNAPSHOT
generated by maven-surefire-plugin:test (default-test): m\target\surefire-reports\*.xml
[windows-jdk7] [withMaven] junitPublisher - Jenkins JUnit Attachments Plugin not found, can't
publish test attachments.Recording test results
[windows-jdk7] [withMaven] Skip 'Findbugs Publisher' disabled by configuration
[windows-jdk7] [withMaven] Skip 'Open Task Scanner Publisher' disabled by configuration
[Pipeline] [windows-jdk7] // withMaven
[Pipeline] [windows-jdk7] echo
[windows-jdk7] [FAIL FAST] This is the first failure and likely root cause
[Pipeline] [windows-jdk7] }
[Pipeline] [windows-jdk7] // stage
[Pipeline] [windows-jdk7] }
[Pipeline] [windows-jdk7] // node
[Pipeline] [windows-jdk7] }
[windows-jdk7] Failed in branch windows-jdk7
[windows-jdk8] [INFO]           go-offline\pom.xml ............................... SUCCESS
(11.4 s)
[windows-jdk8] [INFO] Building: list-repositories\pom.xml
[linux-jdk7] Sending interrupt signal to process
[windows-jdk9] [INFO] run post-build script verify.groovy
[windows-jdk9] [INFO]           mdep-450-project-without-ancestor\pom.xml ........ SUCCESS
(7.0 s)
[windows-jdk9] [INFO] Building: mdep-506-dependency-without-version-in-depmgt\pom.xml
[linux-jdk8] [INFO] Tests run: 28, Failures: 0, Errors: 0, Skipped: 0, Time elapsed: 5.767
s - in org.apache.maven.plugins.dependency.fromDependencies.TestUnpackDependenciesMojo
[linux-jdk8] [INFO] Running org.apache.maven.plugins.dependency.fromDependencies.TestBuildClasspathMojo
[linux-jdk8] [INFO] Dependencies classpath:
[linux-jdk8] /home/jenkins/jenkins-slave/workspace/-dependency-plugin_MDEP-599-GXX474QCFQGSC3DNH2FLQYLQUVF3C5YMYONGRD2LVYVVDYQXVZMQ/m/target/unit-tests/build-classpath/localTestRepo/release-1.0.jar:/home/jenkins/jenkins-slave/workspace/-dependency-plugin_MDEP-599-GXX474QCFQGSC3DNH2FLQYLQUVF3C5YMYONGRD2LVYVVDYQXVZMQ/m/target/unit-tests/build-classpath/localTestRepo/runtime-1.0.jar:/home/jenkins/jenkins-slave/workspace/-dependency-plugin_MDEP-599-GXX474QCFQGSC3DNH2FLQYLQUVF3C5YMYONGRD2LVYVVDYQXVZMQ/m/target/unit-tests/build-classpath/localTestRepo/compile-1.0.jar:/home/jenkins/jenkins-slave/workspace/-dependency-plugin_MDEP-599-GXX474QCFQGSC3DNH2FLQYLQUVF3C5YMYONGRD2LVYVVDYQXVZMQ/m/target/unit-tests/build-classpath/localTestRepo/provided-1.0.jar:/home/jenkins/jenkins-slave/workspace/-dependency-plugin_MDEP-599-GXX474QCFQGSC3DNH2FLQYLQUVF3C5YMYONGRD2LVYVVDYQXVZMQ/m/target/unit-tests/build-classpath/localTestRepo/test-1.0.jar:/home/jenkins/jenkins-slave/workspace/-dependency-plugin_MDEP-599-GXX474QCFQGSC3DNH2FLQYLQUVF3C5YMYONGRD2LVYVVDYQXVZMQ/m/target/unit-tests/build-classpath/localTestRepo/snapshot-2.0-SNAPSHOT.jar:/home/jenkins/jenkins-slave/workspace/-dependency-plugin_MDEP-599-GXX474QCFQGSC3DNH2FLQYLQUVF3C5YMYONGRD2LVYVVDYQXVZMQ/m/target/unit-tests/build-classpath/localTestRepo/system-1.0.jar
[linux-jdk8] [INFO] Wrote classpath file '/home/jenkins/jenkins-slave/workspace/-dependency-plugin_MDEP-599-GXX474QCFQGSC3DNH2FLQYLQUVF3C5YMYONGRD2LVYVVDYQXVZMQ/m/target/unit-tests/build-classpath/buildClasspath.txt'.
[linux-jdk8] [INFO] Wrote classpath file '/home/jenkins/jenkins-slave/workspace/-dependency-plugin_MDEP-599-GXX474QCFQGSC3DNH2FLQYLQUVF3C5YMYONGRD2LVYVVDYQXVZMQ/m/target/unit-tests/build-classpath/buildClasspath.txt'.
[linux-jdk8] [INFO] Skipped writing classpath file '/home/jenkins/jenkins-slave/workspace/-dependency-plugin_MDEP-599-GXX474QCFQGSC3DNH2FLQYLQUVF3C5YMYONGRD2LVYVVDYQXVZMQ/m/target/unit-tests/build-classpath/buildClasspath.txt'.
 No changes found.
[linux-jdk8] [INFO] Tests run: 2, Failures: 0, Errors: 0, Skipped: 0, Time elapsed: 0.132
s - in org.apache.maven.plugins.dependency.fromDependencies.TestBuildClasspathMojo
[linux-jdk8] [INFO] Running org.apache.maven.plugins.dependency.fromConfiguration.TestIncludeExcludeUnpackMojo
[linux-jdk8] [INFO] Configured Artifact: test:test:1.0:jar
[linux-jdk8] [INFO] Unpacking /home/jenkins/jenkins-slave/workspace/-dependency-plugin_MDEP-599-GXX474QCFQGSC3DNH2FLQYLQUVF3C5YMYONGRD2LVYVVDYQXVZMQ/m/target/unit-tests/unpack/localTestRepo/test/test/1.0/test-1.0.jar
to /home/jenkins/jenkins-slave/workspace/-dependency-plugin_MDEP-599-GXX474QCFQGSC3DNH2FLQYLQUVF3C5YMYONGRD2LVYVVDYQXVZMQ/m/target/unit-tests/unpack/outputDirectory
with includes "" and excludes ""
[linux-jdk8] [INFO] Configured Artifact: test:test:1.0:jar
[linux-jdk8] [INFO] Unpacking /home/jenkins/jenkins-slave/workspace/-dependency-plugin_MDEP-599-GXX474QCFQGSC3DNH2FLQYLQUVF3C5YMYONGRD2LVYVVDYQXVZMQ/m/target/unit-tests/unpack/localTestRepo/test/test/1.0/test-1.0.jar
to /home/jenkins/jenkins-slave/workspace/-dependency-plugin_MDEP-599-GXX474QCFQGSC3DNH2FLQYLQUVF3C5YMYONGRD2LVYVVDYQXVZMQ/m/target/unit-tests/unpack/outputDirectory
with includes "**/*" and excludes ""
[linux-jdk8] Sending interrupt signal to process
[linux-jdk8] [INFO] Configured Artifact: test:test:1.0:jar
[linux-jdk8] [INFO] Unpacking /home/jenkins/jenkins-slave/workspace/-dependency-plugin_MDEP-599-GXX474QCFQGSC3DNH2FLQYLQUVF3C5YMYONGRD2LVYVVDYQXVZMQ/m/target/unit-tests/unpack/localTestRepo/test/test/1.0/test-1.0.jar
to /home/jenkins/jenkins-slave/workspace/-dependency-plugin_MDEP-599-GXX474QCFQGSC3DNH2FLQYLQUVF3C5YMYONGRD2LVYVVDYQXVZMQ/m/target/unit-tests/unpack/outputDirectory
with includes "**/*1.txt" and excludes ""
[linux-jdk8] [INFO] Configured Artifact: test:test:1.0:jar
[linux-jdk8] [INFO] Unpacking /home/jenkins/jenkins-slave/workspace/-dependency-plugin_MDEP-599-GXX474QCFQGSC3DNH2FLQYLQUVF3C5YMYONGRD2LVYVVDYQXVZMQ/m/target/unit-tests/unpack/localTestRepo/test/test/1.0/test-1.0.jar
to /home/jenkins/jenkins-slave/workspace/-dependency-plugin_MDEP-599-GXX474QCFQGSC3DNH2FLQYLQUVF3C5YMYONGRD2LVYVVDYQXVZMQ/m/target/unit-tests/unpack/outputDirectory
with includes "" and excludes "**/*"
[linux-jdk8] [INFO] Configured Artifact: test:test:1.0:jar
[linux-jdk8] [INFO] Unpacking /home/jenkins/jenkins-slave/workspace/-dependency-plugin_MDEP-599-GXX474QCFQGSC3DNH2FLQYLQUVF3C5YMYONGRD2LVYVVDYQXVZMQ/m/target/unit-tests/unpack/localTestRepo/test/test/1.0/test-1.0.jar
to /home/jenkins/jenkins-slave/workspace/-dependency-plugin_MDEP-599-GXX474QCFQGSC3DNH2FLQYLQUVF3C5YMYONGRD2LVYVVDYQXVZMQ/m/target/unit-tests/unpack/outputDirectory
with includes "" and excludes "**/*"
[linux-jdk8] [INFO] Configured Artifact: test:test:1.0:jar
[linux-jdk8] [INFO] Unpacking /home/jenkins/jenkins-slave/workspace/-dependency-plugin_MDEP-599-GXX474QCFQGSC3DNH2FLQYLQUVF3C5YMYONGRD2LVYVVDYQXVZMQ/m/target/unit-tests/unpack/localTestRepo/test/test/1.0/test-1.0.jar
to /home/jenkins/jenkins-slave/workspace/-dependency-plugin_MDEP-599-GXX474QCFQGSC3DNH2FLQYLQUVF3C5YMYONGRD2LVYVVDYQXVZMQ/m/target/unit-tests/unpack/outputDirectory
with includes "**/*" and excludes ""
[linux-jdk8] [INFO] 
[linux-jdk8] [INFO] Results:
[linux-jdk8] [INFO] 
[linux-jdk8] [INFO] Tests run: 154, Failures: 0, Errors: 0, Skipped: 0
[linux-jdk8] [INFO] 
[linux-jdk8] [ERROR] There are test failures.
[linux-jdk8] 
[linux-jdk8] Please refer to /home/jenkins/jenkins-slave/workspace/-dependency-plugin_MDEP-599-GXX474QCFQGSC3DNH2FLQYLQUVF3C5YMYONGRD2LVYVVDYQXVZMQ/m/target/surefire-reports
for the individual test results.
[linux-jdk8] Please refer to dump files (if any exist) [date]-jvmRun[N].dump, [date].dumpstream
and [date]-jvmRun[N].dumpstream.
[linux-jdk8] The forked VM terminated without properly saying goodbye. VM crash or System.exit
called?
[linux-jdk8] Command was /bin/sh -c cd /home/jenkins/jenkins-slave/workspace/-dependency-plugin_MDEP-599-GXX474QCFQGSC3DNH2FLQYLQUVF3C5YMYONGRD2LVYVVDYQXVZMQ/m
&& /usr/local/asfpackages/java/jdk1.8.0_152/jre/bin/java -Xmx384m -jar /home/jenkins/jenkins-slave/workspace/-dependency-plugin_MDEP-599-GXX474QCFQGSC3DNH2FLQYLQUVF3C5YMYONGRD2LVYVVDYQXVZMQ/m/target/surefire/surefirebooter4919414903226311663.jar
/home/jenkins/jenkins-slave/workspace/-dependency-plugin_MDEP-599-GXX474QCFQGSC3DNH2FLQYLQUVF3C5YMYONGRD2LVYVVDYQXVZMQ/m/target/surefire
2018-02-13T18-59-04_452-jvmRun1 surefire866532213577651910tmp surefire_02796863277514684076tmp
[linux-jdk8] Error occurred in starting fork, check output in log
[linux-jdk8] Process Exit Code: 143
[linux-jdk8] Crashed tests:
[linux-jdk8] org.apache.maven.plugins.dependency.fromConfiguration.TestIncludeExcludeUnpackMojo
[linux-jdk8] org.apache.maven.surefire.booter.SurefireBooterForkException: The forked VM terminated
without properly saying goodbye. VM crash or System.exit called?
[linux-jdk8] Command was /bin/sh -c cd /home/jenkins/jenkins-slave/workspace/-dependency-plugin_MDEP-599-GXX474QCFQGSC3DNH2FLQYLQUVF3C5YMYONGRD2LVYVVDYQXVZMQ/m
&& /usr/local/asfpackages/java/jdk1.8.0_152/jre/bin/java -Xmx384m -jar /home/jenkins/jenkins-slave/workspace/-dependency-plugin_MDEP-599-GXX474QCFQGSC3DNH2FLQYLQUVF3C5YMYONGRD2LVYVVDYQXVZMQ/m/target/surefire/surefirebooter4919414903226311663.jar
/home/jenkins/jenkins-slave/workspace/-dependency-plugin_MDEP-599-GXX474QCFQGSC3DNH2FLQYLQUVF3C5YMYONGRD2LVYVVDYQXVZMQ/m/target/surefire
2018-02-13T18-59-04_452-jvmRun1 surefire866532213577651910tmp surefire_02796863277514684076tmp
[linux-jdk8] Error occurred in starting fork, check output in log
[linux-jdk8] Process Exit Code: 143
[linux-jdk8] Crashed tests:
[linux-jdk8] org.apache.maven.plugins.dependency.fromConfiguration.TestIncludeExcludeUnpackMojo
[linux-jdk8] 	at org.apache.maven.plugin.surefire.booterclient.ForkStarter.fork(ForkStarter.java:686)
[linux-jdk8] 	at org.apache.maven.plugin.surefire.booterclient.ForkStarter.fork(ForkStarter.java:535)
[linux-jdk8] 	at org.apache.maven.plugin.surefire.booterclient.ForkStarter.run(ForkStarter.java:280)
[linux-jdk8] 	at org.apache.maven.plugin.surefire.booterclient.ForkStarter.run(ForkStarter.java:245)
[linux-jdk8] 	at org.apache.maven.plugin.surefire.AbstractSurefireMojo.executeProvider(AbstractSurefireMojo.java:1124)
[linux-jdk8] 	at org.apache.maven.plugin.surefire.AbstractSurefireMojo.executeAfterPreconditionsChecked(AbstractSurefireMojo.java:954)
[linux-jdk8] 	at org.apache.maven.plugin.surefire.AbstractSurefireMojo.execute(AbstractSurefireMojo.java:832)
[linux-jdk8] 	at org.apache.maven.plugin.DefaultBuildPluginManager.executeMojo(DefaultBuildPluginManager.java:134)
[linux-jdk8] 	at org.apache.maven.lifecycle.internal.MojoExecutor.execute(MojoExecutor.java:208)
[linux-jdk8] 	at org.apache.maven.lifecycle.internal.MojoExecutor.execute(MojoExecutor.java:154)
[linux-jdk8] 	at org.apache.maven.lifecycle.internal.MojoExecutor.execute(MojoExecutor.java:146)
[linux-jdk8] 	at org.apache.maven.lifecycle.internal.LifecycleModuleBuilder.buildProject(LifecycleModuleBuilder.java:117)
[linux-jdk8] 	at org.apache.maven.lifecycle.internal.LifecycleModuleBuilder.buildProject(LifecycleModuleBuilder.java:81)
[linux-jdk8] 	at org.apache.maven.lifecycle.internal.builder.singlethreaded.SingleThreadedBuilder.build(SingleThreadedBuilder.java:51)
[linux-jdk8] 	at org.apache.maven.lifecycle.internal.LifecycleStarter.execute(LifecycleStarter.java:128)
[linux-jdk8] 	at org.apache.maven.DefaultMaven.doExecute(DefaultMaven.java:309)
[linux-jdk8] 	at org.apache.maven.DefaultMaven.doExecute(DefaultMaven.java:194)
[linux-jdk8] 	at org.apache.maven.DefaultMaven.execute(DefaultMaven.java:107)
[linux-jdk8] 	at org.apache.maven.cli.MavenCli.execute(MavenCli.java:955)
[linux-jdk8] 	at org.apache.maven.cli.MavenCli.doMain(MavenCli.java:290)
[linux-jdk8] 	at org.apache.maven.cli.MavenCli.main(MavenCli.java:194)
[linux-jdk8] 	at sun.reflect.NativeMethodAccessorImpl.invoke0(Native Method)
[linux-jdk8] 	at sun.reflect.NativeMethodAccessorImpl.invoke(NativeMethodAccessorImpl.java:62)
[linux-jdk8] 	at sun.reflect.DelegatingMethodAccessorImpl.invoke(DelegatingMethodAccessorImpl.java:43)
[linux-jdk8] 	at java.lang.reflect.Method.invoke(Method.java:498)
[linux-jdk8] 	at org.codehaus.plexus.classworlds.launcher.Launcher.launchEnhanced(Launcher.java:289)
[linux-jdk8] 	at org.codehaus.plexus.classworlds.launcher.Launcher.launch(Launcher.java:229)
[linux-jdk8] 	at org.codehaus.plexus.classworlds.launcher.Launcher.mainWithExitCode(Launcher.java:415)
[linux-jdk8] 	at org.codehaus.plexus.classworlds.launcher.Launcher.main(Launcher.java:356)
[linux-jdk8] 
[linux-jdk8] [INFO] 
[linux-jdk8] [INFO] --- maven-jar-plugin:3.0.2:jar (default-jar) @ maven-dependency-plugin
---
[linux-jdk8] [INFO] Downloading from central: https://repo.maven.apache.org/maven2/org/apache/maven/maven-archiver/3.1.1/maven-archiver-3.1.1.pom
[linux-jdk8] [INFO] Downloaded from central: https://repo.maven.apache.org/maven2/org/apache/maven/maven-archiver/3.1.1/maven-archiver-3.1.1.pom
(4.3 kB at 290 kB/s)
[linux-jdk8] [INFO] Downloading from central: https://repo.maven.apache.org/maven2/org/apache/maven/shared/maven-shared-utils/3.0.1/maven-shared-utils-3.0.1.pom
[linux-jdk8] [INFO] Downloaded from central: https://repo.maven.apache.org/maven2/org/apache/maven/shared/maven-shared-utils/3.0.1/maven-shared-utils-3.0.1.pom
(4.6 kB at 382 kB/s)
[linux-jdk8] [INFO] Downloading from central: https://repo.maven.apache.org/maven2/org/codehaus/plexus/plexus-archiver/3.3/plexus-archiver-3.3.pom
[linux-jdk8] [INFO] Downloaded from central: https://repo.maven.apache.org/maven2/org/codehaus/plexus/plexus-archiver/3.3/plexus-archiver-3.3.pom
(5.3 kB at 410 kB/s)
[linux-jdk8] [INFO] Downloading from central: https://repo.maven.apache.org/maven2/org/apache/maven/maven-archiver/3.1.1/maven-archiver-3.1.1.jar
[linux-jdk8] [INFO] Downloading from central: https://repo.maven.apache.org/maven2/org/apache/maven/shared/maven-shared-utils/3.0.1/maven-shared-utils-3.0.1.jar
[linux-jdk8] [INFO] Downloading from central: https://repo.maven.apache.org/maven2/org/codehaus/plexus/plexus-io/2.7.1/plexus-io-2.7.1.jar
[linux-jdk8] [INFO] Downloaded from central: https://repo.maven.apache.org/maven2/org/apache/maven/maven-archiver/3.1.1/maven-archiver-3.1.1.jar
(24 kB at 1.7 MB/s)
[linux-jdk8] [INFO] Downloaded from central: https://repo.maven.apache.org/maven2/org/apache/maven/shared/maven-shared-utils/3.0.1/maven-shared-utils-3.0.1.jar
(154 kB at 7.0 MB/s)
[linux-jdk8] Terminated
[windows-jdk8] Sending interrupt signal to process
[windows-jdk8] [INFO]           list-repositories\pom.xml ........................ FAILED
(6.0 s)
[windows-jdk8] [INFO]   The build exited with code -1. See f:\jenkins\jenkins-slave\workspace\-dependency-plugin_MDEP-599-GXX474QCFQGSC3DNH2FLQYLQUVF3C5YMYONGRD2LVYVVDYQXVZMQ\m\target\it\list-repositories\build.log
for details.
[windows-jdk8] [INFO] Building: mdep-439-analyze-java8\pom.xml
[windows-jdk9] Sending interrupt signal to process
[Pipeline] [linux-jdk9] // node
[Pipeline] [linux-jdk9] }
[linux-jdk9] Failed in branch linux-jdk9
[Pipeline] [linux-jdk8] }
[Pipeline] [linux-jdk8] // dir
[windows-jdk9] [INFO]           mdep-506-dependency-without-version-in-depmgt\pom.xml FAILED
(3.8 s)
[windows-jdk9] [INFO]   The build exited with code -1. See f:\jenkins\jenkins-slave\workspace\-dependency-plugin_MDEP-599-GXX474QCFQGSC3DNH2FLQYLQUVF3C5YMYONGRD2LVYVVDYQXVZMQ\m\target\it\mdep-506-dependency-without-version-in-depmgt\build.log
for details.
[windows-jdk9] [INFO] Building: mdep-571-resolve-java9\pom.xml
[Pipeline] [linux-jdk8] }
[linux-jdk8] [withMaven] One or multiple Maven executions have been ignored by the Jenkins
Pipeline Maven Plugin because they have been interrupted before completion (1). See Pipeline
Maven Plugin FAQ for more details.
[Pipeline] [linux-jdk8] // withMaven
[Pipeline] [linux-jdk8] echo
[linux-jdk8] [FAIL FAST] windows-jdk7 had first failure, ignoring script returned exit code
143
[Pipeline] [linux-jdk8] }
[Pipeline] [linux-jdk8] // stage
[Pipeline] [linux-jdk8] }
[Pipeline] [linux-jdk8] // node
[Pipeline] [linux-jdk8] }
[linux-jdk7] After 10s process did not stop
[Pipeline] [linux-jdk7] }
[Pipeline] [linux-jdk7] // dir
[Pipeline] [linux-jdk7] }
[linux-jdk7] [withMaven] One or multiple Maven executions have been ignored by the Jenkins
Pipeline Maven Plugin because they have been interrupted before completion (1). See Pipeline
Maven Plugin FAQ for more details.
[Pipeline] [linux-jdk7] // withMaven
[Pipeline] [linux-jdk7] echo
[linux-jdk7] [FAIL FAST] windows-jdk7 had first failure, ignoring null
[Pipeline] [linux-jdk7] }
[Pipeline] [linux-jdk7] // stage
[Pipeline] [linux-jdk7] }
[Pipeline] [linux-jdk7] // node
[Pipeline] [linux-jdk7] }
[windows-jdk8] After 10s process did not stop
[Pipeline] [windows-jdk8] }
[Pipeline] [windows-jdk8] // dir
[windows-jdk9] After 10s process did not stop
[Pipeline] [windows-jdk8] }
[windows-jdk8] [withMaven] One or multiple Maven executions have been ignored by the Jenkins
Pipeline Maven Plugin because they have been interrupted before completion (1). See Pipeline
Maven Plugin FAQ for more details.
[Pipeline] [windows-jdk8] // withMaven
[Pipeline] [windows-jdk8] echo
[windows-jdk8] [FAIL FAST] windows-jdk7 had first failure, ignoring null
[Pipeline] [windows-jdk8] }
[Pipeline] [windows-jdk9] }
[Pipeline] [windows-jdk8] // stage
[Pipeline] [windows-jdk9] // dir
[Pipeline] [windows-jdk8] }
[Pipeline] [windows-jdk9] }
[windows-jdk9] [withMaven] One or multiple Maven executions have been ignored by the Jenkins
Pipeline Maven Plugin because they have been interrupted before completion (1). See Pipeline
Maven Plugin FAQ for more details.
[Pipeline] [windows-jdk8] // node
[Pipeline] [windows-jdk9] // withMaven
[Pipeline] [windows-jdk8] }
[Pipeline] [windows-jdk9] echo
[windows-jdk9] [FAIL FAST] windows-jdk7 had first failure, ignoring null
[Pipeline] [windows-jdk9] }
[Pipeline] [windows-jdk9] // stage
[Pipeline] [windows-jdk9] }
[Pipeline] [windows-jdk9] // node
[Pipeline] [windows-jdk9] }
[Pipeline] // parallel
[Pipeline] echo
***** FAST FAILURE *****

Fast failure triggered by windows-jdk7

***** FAST FAILURE *****
[Pipeline] stage
[Pipeline] { (Notifications)
[Pipeline] echo
Build result: FAILURE
[Pipeline] jiraIssueSelector
[Pipeline] emailext
Mime
  • Unnamed multipart/mixed (inline, None, 0 bytes)
View raw message