maven-notifications mailing list archives

Site index · List index
Message view « Date » · « Thread »
Top « Date » · « Thread »
From Apache Jenkins Server <jenk...@builds.apache.org>
Subject Build failed in Jenkins: Maven TLP » maven-doxia » master #17
Date Wed, 07 Feb 2018 08:26:53 GMT
See https://builds.apache.org/job/maven-box/job/maven-doxia/job/master/17/

Changes:

* [CLOSES INFRA-15651] ubuntu-4 is confirmed fixed
* Stop commenting on INFRA tickets
* Add JDK 10 b37 (early access build) (Windows Only)
* Better fail-fast diagnostics (hopefully)
* Better fail-fast diagnostics (hopefully)
* fix scoping
* Correctly attribute fast failure root node
* Correctly attribute fast failure root node
* Handle other parts of the parallel being interrupted by fast fail
* suppress duplicate changelogs
* take 2 on changelog optimization
* debug
* Seems we have to live with duplicate changelogs
* [DOXIA-409] Upgrade to FOP 2.2
* [DOXIA-409] Upgrade to FOP 2.2
* [DOXIA-409] Upgrade to FOP 2.2
* [DOXIA-409] Upgrade to FOP 2.2
* [DOXIA-409] Upgrade to FOP 2.2

All tests passed

Build log:
[...truncated 2.45 MB...]
[linux-jdk8] None of the test reports contained any result
[linux-jdk8] [withMaven] junitPublisher - Archive test results for Maven artifact org.apache.maven.doxia:doxia-sink-api:1.9-SNAPSHOT
generated by maven-surefire-plugin:test (default-test): m/doxia-sink-api/target/surefire-reports/*.xml
[linux-jdk8] [withMaven] junitPublisher - Jenkins JUnit Attachments Plugin not found, can't
publish test attachments.Recording test results
[linux-jdk8] None of the test reports contained any result
[linux-jdk8] [withMaven] junitPublisher - Archive test results for Maven artifact org.apache.maven.doxia:doxia-test-docs:1.9-SNAPSHOT
generated by maven-surefire-plugin:test (default-test): m/doxia-test-docs/target/surefire-reports/*.xml
[linux-jdk8] [withMaven] junitPublisher - Jenkins JUnit Attachments Plugin not found, can't
publish test attachments.Recording test results
[linux-jdk8] None of the test reports contained any result
[linux-jdk8] [withMaven] junitPublisher - Archive test results for Maven artifact org.apache.maven.doxia:doxia-core:1.9-SNAPSHOT
generated by maven-surefire-plugin:test (default-test): m/doxia-core/target/surefire-reports/*.xml
[linux-jdk8] [withMaven] junitPublisher - Jenkins JUnit Attachments Plugin not found, can't
publish test attachments.Recording test results
[linux-jdk8] [withMaven] junitPublisher - Archive test results for Maven artifact org.apache.maven.doxia:doxia-module-apt:1.9-SNAPSHOT
generated by maven-surefire-plugin:test (default-test): m/doxia-modules/doxia-module-apt/target/surefire-reports/*.xml
[linux-jdk8] [withMaven] junitPublisher - Jenkins JUnit Attachments Plugin not found, can't
publish test attachments.Recording test results
[linux-jdk8] [withMaven] junitPublisher - Archive test results for Maven artifact org.apache.maven.doxia:doxia-module-confluence:1.9-SNAPSHOT
generated by maven-surefire-plugin:test (default-test): m/doxia-modules/doxia-module-confluence/target/surefire-reports/*.xml
[linux-jdk8] [withMaven] junitPublisher - Jenkins JUnit Attachments Plugin not found, can't
publish test attachments.Recording test results
[linux-jdk8] [withMaven] junitPublisher - Archive test results for Maven artifact org.apache.maven.doxia:doxia-module-docbook-simple:1.9-SNAPSHOT
generated by maven-surefire-plugin:test (default-test): m/doxia-modules/doxia-module-docbook-simple/target/surefire-reports/*.xml
[linux-jdk8] [withMaven] junitPublisher - Jenkins JUnit Attachments Plugin not found, can't
publish test attachments.Recording test results
[linux-jdk8] [withMaven] junitPublisher - Archive test results for Maven artifact org.apache.maven.doxia:doxia-module-fml:1.9-SNAPSHOT
generated by maven-surefire-plugin:test (default-test): m/doxia-modules/doxia-module-fml/target/surefire-reports/*.xml
[linux-jdk8] [withMaven] junitPublisher - Jenkins JUnit Attachments Plugin not found, can't
publish test attachments.Recording test results
[linux-jdk8] [withMaven] junitPublisher - Archive test results for Maven artifact org.apache.maven.doxia:doxia-module-fo:1.9-SNAPSHOT
generated by maven-surefire-plugin:test (default-test): m/doxia-modules/doxia-module-fo/target/surefire-reports/*.xml
[linux-jdk8] [withMaven] junitPublisher - Jenkins JUnit Attachments Plugin not found, can't
publish test attachments.Recording test results
[linux-jdk8] [withMaven] Skip 'Findbugs Publisher' disabled by configuration
[linux-jdk8] [withMaven] Skip 'Open Task Scanner Publisher' disabled by configuration
[Pipeline] [linux-jdk8] // withMaven
[Pipeline] [linux-jdk9] }
[Pipeline] [linux-jdk8] echo
[linux-jdk8] [FAIL FAST] This is the first failure and likely root cause
[Pipeline] [linux-jdk8] }
[Pipeline] [linux-jdk7] }
[Pipeline] [windows-jdk7] }
[Pipeline] [windows-jdk8] }
[Pipeline] [windows-jdk9] }
[Pipeline] [linux-jdk9] // dir
[Pipeline] [linux-jdk8] // stage
[Pipeline] [linux-jdk7] // dir
[Pipeline] [windows-jdk7] // dir
[Pipeline] [windows-jdk8] // dir
[Pipeline] [windows-jdk9] // dir
[Pipeline] [linux-jdk8] }
[Pipeline] [linux-jdk9] }
[linux-jdk9] [withMaven] Skip 'Generated Artifacts Publisher' disabled by configuration
[linux-jdk9] [withMaven] junitPublisher - Archive test results for Maven artifact org.apache.maven.doxia:doxia-logging-api:1.9-SNAPSHOT
generated by maven-surefire-plugin:test (default-test): m/doxia-logging-api/target/surefire-reports/*.xml
[linux-jdk9] [withMaven] junitPublisher - Jenkins JUnit Attachments Plugin not found, can't
publish test attachments.Recording test results
[linux-jdk9] None of the test reports contained any result
[linux-jdk9] [withMaven] junitPublisher - Archive test results for Maven artifact org.apache.maven.doxia:doxia-sink-api:1.9-SNAPSHOT
generated by maven-surefire-plugin:test (default-test): m/doxia-sink-api/target/surefire-reports/*.xml
[linux-jdk9] [withMaven] junitPublisher - Jenkins JUnit Attachments Plugin not found, can't
publish test attachments.Recording test results
[linux-jdk9] None of the test reports contained any result
[linux-jdk9] [withMaven] junitPublisher - Archive test results for Maven artifact org.apache.maven.doxia:doxia-test-docs:1.9-SNAPSHOT
generated by maven-surefire-plugin:test (default-test): m/doxia-test-docs/target/surefire-reports/*.xml
[linux-jdk9] [withMaven] junitPublisher - Jenkins JUnit Attachments Plugin not found, can't
publish test attachments.Recording test results
[linux-jdk9] None of the test reports contained any result
[linux-jdk9] [withMaven] junitPublisher - Archive test results for Maven artifact org.apache.maven.doxia:doxia-core:1.9-SNAPSHOT
generated by maven-surefire-plugin:test (default-test): m/doxia-core/target/surefire-reports/*.xml
[linux-jdk9] [withMaven] junitPublisher - Jenkins JUnit Attachments Plugin not found, can't
publish test attachments.Recording test results
[linux-jdk9] [withMaven] junitPublisher - Archive test results for Maven artifact org.apache.maven.doxia:doxia-module-apt:1.9-SNAPSHOT
generated by maven-surefire-plugin:test (default-test): m/doxia-modules/doxia-module-apt/target/surefire-reports/*.xml
[linux-jdk9] [withMaven] junitPublisher - Jenkins JUnit Attachments Plugin not found, can't
publish test attachments.Recording test results
[linux-jdk9] [withMaven] junitPublisher - Archive test results for Maven artifact org.apache.maven.doxia:doxia-module-confluence:1.9-SNAPSHOT
generated by maven-surefire-plugin:test (default-test): m/doxia-modules/doxia-module-confluence/target/surefire-reports/*.xml
[linux-jdk9] [withMaven] junitPublisher - Jenkins JUnit Attachments Plugin not found, can't
publish test attachments.Recording test results
[linux-jdk9] [withMaven] junitPublisher - Archive test results for Maven artifact org.apache.maven.doxia:doxia-module-docbook-simple:1.9-SNAPSHOT
generated by maven-surefire-plugin:test (default-test): m/doxia-modules/doxia-module-docbook-simple/target/surefire-reports/*.xml
[linux-jdk9] [withMaven] junitPublisher - Jenkins JUnit Attachments Plugin not found, can't
publish test attachments.Recording test results
[linux-jdk9] [withMaven] junitPublisher - Archive test results for Maven artifact org.apache.maven.doxia:doxia-module-fml:1.9-SNAPSHOT
generated by maven-surefire-plugin:test (default-test): m/doxia-modules/doxia-module-fml/target/surefire-reports/*.xml
[linux-jdk9] [withMaven] junitPublisher - Jenkins JUnit Attachments Plugin not found, can't
publish test attachments.Recording test results
[linux-jdk9] [withMaven] junitPublisher - Archive test results for Maven artifact org.apache.maven.doxia:doxia-module-fo:1.9-SNAPSHOT
generated by maven-surefire-plugin:test (default-test): m/doxia-modules/doxia-module-fo/target/surefire-reports/*.xml
[linux-jdk9] [withMaven] junitPublisher - Jenkins JUnit Attachments Plugin not found, can't
publish test attachments.Recording test results
[linux-jdk9] [withMaven] Skip 'Findbugs Publisher' disabled by configuration
[linux-jdk9] [withMaven] Skip 'Open Task Scanner Publisher' disabled by configuration
[Pipeline] [linux-jdk7] }
[linux-jdk7] [withMaven] artifactsPublisher - Archive artifact m/pom.xml under org/apache/maven/doxia/doxia/1.9-SNAPSHOT/doxia-1.9-SNAPSHOT.pom
[linux-jdk7] [withMaven] artifactsPublisher - Archive artifact m/doxia-logging-api/pom.xml
under org/apache/maven/doxia/doxia-logging-api/1.9-SNAPSHOT/doxia-logging-api-1.9-SNAPSHOT.pom
[linux-jdk7] [withMaven] artifactsPublisher - Archive artifact m/doxia-logging-api/target/doxia-logging-api-1.9-SNAPSHOT.jar
under org/apache/maven/doxia/doxia-logging-api/1.9-SNAPSHOT/doxia-logging-api-1.9-SNAPSHOT.jar
[linux-jdk7] [withMaven] artifactsPublisher - Archive artifact m/doxia-sink-api/pom.xml under
org/apache/maven/doxia/doxia-sink-api/1.9-SNAPSHOT/doxia-sink-api-1.9-SNAPSHOT.pom
[linux-jdk7] [withMaven] artifactsPublisher - Archive artifact m/doxia-sink-api/target/doxia-sink-api-1.9-SNAPSHOT.jar
under org/apache/maven/doxia/doxia-sink-api/1.9-SNAPSHOT/doxia-sink-api-1.9-SNAPSHOT.jar
[linux-jdk7] [withMaven] artifactsPublisher - Archive artifact m/doxia-test-docs/pom.xml under
org/apache/maven/doxia/doxia-test-docs/1.9-SNAPSHOT/doxia-test-docs-1.9-SNAPSHOT.pom
[linux-jdk7] [withMaven] artifactsPublisher - Archive artifact m/doxia-test-docs/target/doxia-test-docs-1.9-SNAPSHOT.jar
under org/apache/maven/doxia/doxia-test-docs/1.9-SNAPSHOT/doxia-test-docs-1.9-SNAPSHOT.jar
[linux-jdk7] [withMaven] artifactsPublisher - Archive artifact m/doxia-core/pom.xml under
org/apache/maven/doxia/doxia-core/1.9-SNAPSHOT/doxia-core-1.9-SNAPSHOT.pom
[linux-jdk7] [withMaven] artifactsPublisher - Archive artifact m/doxia-core/target/doxia-core-1.9-SNAPSHOT.jar
under org/apache/maven/doxia/doxia-core/1.9-SNAPSHOT/doxia-core-1.9-SNAPSHOT.jar
[linux-jdk7] [withMaven] artifactsPublisher - Archive artifact m/doxia-modules/pom.xml under
org/apache/maven/doxia/doxia-modules/1.9-SNAPSHOT/doxia-modules-1.9-SNAPSHOT.pom
[linux-jdk7] [withMaven] artifactsPublisher - Archive artifact m/doxia-modules/doxia-module-apt/pom.xml
under org/apache/maven/doxia/doxia-module-apt/1.9-SNAPSHOT/doxia-module-apt-1.9-SNAPSHOT.pom
[linux-jdk7] [withMaven] artifactsPublisher - Archive artifact m/doxia-modules/doxia-module-apt/target/doxia-module-apt-1.9-SNAPSHOT.jar
under org/apache/maven/doxia/doxia-module-apt/1.9-SNAPSHOT/doxia-module-apt-1.9-SNAPSHOT.jar
[linux-jdk7] [withMaven] artifactsPublisher - Archive artifact m/doxia-modules/doxia-module-confluence/pom.xml
under org/apache/maven/doxia/doxia-module-confluence/1.9-SNAPSHOT/doxia-module-confluence-1.9-SNAPSHOT.pom
[linux-jdk7] [withMaven] artifactsPublisher - Archive artifact m/doxia-modules/doxia-module-confluence/target/doxia-module-confluence-1.9-SNAPSHOT.jar
under org/apache/maven/doxia/doxia-module-confluence/1.9-SNAPSHOT/doxia-module-confluence-1.9-SNAPSHOT.jar
[linux-jdk7] [withMaven] artifactsPublisher - Archive artifact m/doxia-modules/doxia-module-docbook-simple/pom.xml
under org/apache/maven/doxia/doxia-module-docbook-simple/1.9-SNAPSHOT/doxia-module-docbook-simple-1.9-SNAPSHOT.pom
[linux-jdk7] [withMaven] artifactsPublisher - Archive artifact m/doxia-modules/doxia-module-docbook-simple/target/doxia-module-docbook-simple-1.9-SNAPSHOT.jar
under org/apache/maven/doxia/doxia-module-docbook-simple/1.9-SNAPSHOT/doxia-module-docbook-simple-1.9-SNAPSHOT.jar
[linux-jdk7] [withMaven] artifactsPublisher - Archive artifact m/doxia-modules/doxia-module-fml/pom.xml
under org/apache/maven/doxia/doxia-module-fml/1.9-SNAPSHOT/doxia-module-fml-1.9-SNAPSHOT.pom
[linux-jdk7] [withMaven] artifactsPublisher - Archive artifact m/doxia-modules/doxia-module-fml/target/doxia-module-fml-1.9-SNAPSHOT.jar
under org/apache/maven/doxia/doxia-module-fml/1.9-SNAPSHOT/doxia-module-fml-1.9-SNAPSHOT.jar
[linux-jdk7] [withMaven] artifactsPublisher - Archive artifact m/target/doxia-1.9-SNAPSHOT-site.xml
under org/apache/maven/doxia/doxia/1.9-SNAPSHOT/doxia-1.9-SNAPSHOT-site.xml
[linux-jdk7] [withMaven] artifactsPublisher - Archive artifact m/doxia-core/target/doxia-core-1.9-SNAPSHOT-tests.jar
under org/apache/maven/doxia/doxia-core/1.9-SNAPSHOT/doxia-core-1.9-SNAPSHOT-tests.jar
[linux-jdk7] [withMaven] artifactsPublisher - Archive artifact m/doxia-modules/target/doxia-modules-1.9-SNAPSHOT-site.xml
under org/apache/maven/doxia/doxia-modules/1.9-SNAPSHOT/doxia-modules-1.9-SNAPSHOT-site.xml
[linux-jdk7] [withMaven] junitPublisher - Archive test results for Maven artifact org.apache.maven.doxia:doxia-logging-api:1.9-SNAPSHOT
generated by maven-surefire-plugin:test (default-test): m/doxia-logging-api/target/surefire-reports/*.xml
[linux-jdk7] [withMaven] junitPublisher - Jenkins JUnit Attachments Plugin not found, can't
publish test attachments.Recording test results
[linux-jdk7] None of the test reports contained any result
[linux-jdk7] [withMaven] junitPublisher - Archive test results for Maven artifact org.apache.maven.doxia:doxia-sink-api:1.9-SNAPSHOT
generated by maven-surefire-plugin:test (default-test): m/doxia-sink-api/target/surefire-reports/*.xml
[linux-jdk7] [withMaven] junitPublisher - Jenkins JUnit Attachments Plugin not found, can't
publish test attachments.Recording test results
[linux-jdk7] None of the test reports contained any result
[linux-jdk7] [withMaven] junitPublisher - Archive test results for Maven artifact org.apache.maven.doxia:doxia-test-docs:1.9-SNAPSHOT
generated by maven-surefire-plugin:test (default-test): m/doxia-test-docs/target/surefire-reports/*.xml
[linux-jdk7] [withMaven] junitPublisher - Jenkins JUnit Attachments Plugin not found, can't
publish test attachments.Recording test results
[linux-jdk7] None of the test reports contained any result
[linux-jdk7] [withMaven] junitPublisher - Archive test results for Maven artifact org.apache.maven.doxia:doxia-core:1.9-SNAPSHOT
generated by maven-surefire-plugin:test (default-test): m/doxia-core/target/surefire-reports/*.xml
[linux-jdk7] [withMaven] junitPublisher - Jenkins JUnit Attachments Plugin not found, can't
publish test attachments.Recording test results
[linux-jdk7] [withMaven] junitPublisher - Archive test results for Maven artifact org.apache.maven.doxia:doxia-module-apt:1.9-SNAPSHOT
generated by maven-surefire-plugin:test (default-test): m/doxia-modules/doxia-module-apt/target/surefire-reports/*.xml
[linux-jdk7] [withMaven] junitPublisher - Jenkins JUnit Attachments Plugin not found, can't
publish test attachments.Recording test results
[linux-jdk7] [withMaven] junitPublisher - Archive test results for Maven artifact org.apache.maven.doxia:doxia-module-confluence:1.9-SNAPSHOT
generated by maven-surefire-plugin:test (default-test): m/doxia-modules/doxia-module-confluence/target/surefire-reports/*.xml
[linux-jdk7] [withMaven] junitPublisher - Jenkins JUnit Attachments Plugin not found, can't
publish test attachments.Recording test results
[linux-jdk7] [withMaven] junitPublisher - Archive test results for Maven artifact org.apache.maven.doxia:doxia-module-docbook-simple:1.9-SNAPSHOT
generated by maven-surefire-plugin:test (default-test): m/doxia-modules/doxia-module-docbook-simple/target/surefire-reports/*.xml
[linux-jdk7] [withMaven] junitPublisher - Jenkins JUnit Attachments Plugin not found, can't
publish test attachments.Recording test results
[linux-jdk7] [withMaven] junitPublisher - Archive test results for Maven artifact org.apache.maven.doxia:doxia-module-fml:1.9-SNAPSHOT
generated by maven-surefire-plugin:test (default-test): m/doxia-modules/doxia-module-fml/target/surefire-reports/*.xml
[linux-jdk7] [withMaven] junitPublisher - Jenkins JUnit Attachments Plugin not found, can't
publish test attachments.Recording test results
[linux-jdk7] [withMaven] junitPublisher - Archive test results for Maven artifact org.apache.maven.doxia:doxia-module-fo:1.9-SNAPSHOT
generated by maven-surefire-plugin:test (default-test): m/doxia-modules/doxia-module-fo/target/surefire-reports/*.xml
[linux-jdk7] [withMaven] junitPublisher - Jenkins JUnit Attachments Plugin not found, can't
publish test attachments.Recording test results
[linux-jdk7] [withMaven] openTasksPublisher - Scan Tasks for Maven artifact org.apache.maven.doxia:doxia-logging-api:1.9-SNAPSHOT
in source directory m/doxia-logging-api/src/main/java
[linux-jdk7] [withMaven] openTasksPublisher - Scan Tasks for Maven artifact org.apache.maven.doxia:doxia-sink-api:1.9-SNAPSHOT
in source directory m/doxia-sink-api/src/main/java
[linux-jdk7] [withMaven] openTasksPublisher - Scan Tasks for Maven artifact org.apache.maven.doxia:doxia-core:1.9-SNAPSHOT
in source directory m/doxia-core/src/main/java
[linux-jdk7] [withMaven] openTasksPublisher - Scan Tasks for Maven artifact org.apache.maven.doxia:doxia-module-apt:1.9-SNAPSHOT
in source directory m/doxia-modules/doxia-module-apt/src/main/java
[linux-jdk7] [withMaven] openTasksPublisher - Scan Tasks for Maven artifact org.apache.maven.doxia:doxia-module-confluence:1.9-SNAPSHOT
in source directory m/doxia-modules/doxia-module-confluence/src/main/java
[linux-jdk7] [withMaven] openTasksPublisher - Scan Tasks for Maven artifact org.apache.maven.doxia:doxia-module-docbook-simple:1.9-SNAPSHOT
in source directory m/doxia-modules/doxia-module-docbook-simple/src/main/java
[linux-jdk7] [withMaven] openTasksPublisher - Scan Tasks for Maven artifact org.apache.maven.doxia:doxia-module-fml:1.9-SNAPSHOT
in source directory m/doxia-modules/doxia-module-fml/src/main/java
[linux-jdk7] [withMaven] openTasksPublisher - Scan Tasks for Maven artifact org.apache.maven.doxia:doxia-module-fo:1.9-SNAPSHOT
in source directory m/doxia-modules/doxia-module-fo/src/main/java
[linux-jdk7] [TASKS] Scanning folder '/home/jenkins/jenkins-slave/workspace/aven-box_maven-doxia_master-4SHBBM33BQC2SGN65AA3AW6GPXIK6RA462YQND5AN3YPZ5U2VGSQ'
for files matching the pattern 'm/doxia-logging-api/src/main/java/**/*,m/doxia-sink-api/src/main/java/**/*,m/doxia-core/src/main/java/**/*,m/doxia-modules/doxia-module-apt/src/main/java/**/*,m/doxia-modules/doxia-module-confluence/src/main/java/**/*,m/doxia-modules/doxia-module-docbook-simple/src/main/java/**/*,m/doxia-modules/doxia-module-fml/src/main/java/**/*,m/doxia-modules/doxia-module-fo/src/main/java/**/*'
- excludes: null
[linux-jdk7] [TASKS] Found 132 files to scan for tasks
[linux-jdk7] [TASKS] Found 32 open tasks.
[linux-jdk7] Skipping warnings blame since pipelines do not have an SCM link.%n
[linux-jdk7] [TASKS] Computing warning deltas based on reference build #16
[Pipeline] [windows-jdk7] }
[windows-jdk7] [withMaven] Skip 'Generated Artifacts Publisher' disabled by configuration
[windows-jdk7] [withMaven] junitPublisher - Archive test results for Maven artifact org.apache.maven.doxia:doxia-logging-api:1.9-SNAPSHOT
generated by maven-surefire-plugin:test (default-test): m\doxia-logging-api\target\surefire-reports\*.xml
[windows-jdk7] [withMaven] junitPublisher - Jenkins JUnit Attachments Plugin not found, can't
publish test attachments.Recording test results
[windows-jdk7] None of the test reports contained any result
[windows-jdk7] [withMaven] junitPublisher - Archive test results for Maven artifact org.apache.maven.doxia:doxia-sink-api:1.9-SNAPSHOT
generated by maven-surefire-plugin:test (default-test): m\doxia-sink-api\target\surefire-reports\*.xml
[windows-jdk7] [withMaven] junitPublisher - Jenkins JUnit Attachments Plugin not found, can't
publish test attachments.Recording test results
[windows-jdk7] None of the test reports contained any result
[windows-jdk7] [withMaven] junitPublisher - Archive test results for Maven artifact org.apache.maven.doxia:doxia-test-docs:1.9-SNAPSHOT
generated by maven-surefire-plugin:test (default-test): m\doxia-test-docs\target\surefire-reports\*.xml
[windows-jdk7] [withMaven] junitPublisher - Jenkins JUnit Attachments Plugin not found, can't
publish test attachments.Recording test results
[windows-jdk7] None of the test reports contained any result
[windows-jdk7] [withMaven] junitPublisher - Archive test results for Maven artifact org.apache.maven.doxia:doxia-core:1.9-SNAPSHOT
generated by maven-surefire-plugin:test (default-test): m\doxia-core\target\surefire-reports\*.xml
[windows-jdk7] [withMaven] junitPublisher - Jenkins JUnit Attachments Plugin not found, can't
publish test attachments.Recording test results
[windows-jdk7] [withMaven] junitPublisher - Archive test results for Maven artifact org.apache.maven.doxia:doxia-module-apt:1.9-SNAPSHOT
generated by maven-surefire-plugin:test (default-test): m\doxia-modules\doxia-module-apt\target\surefire-reports\*.xml
[windows-jdk7] [withMaven] junitPublisher - Jenkins JUnit Attachments Plugin not found, can't
publish test attachments.Recording test results
[windows-jdk7] [withMaven] junitPublisher - Archive test results for Maven artifact org.apache.maven.doxia:doxia-module-confluence:1.9-SNAPSHOT
generated by maven-surefire-plugin:test (default-test): m\doxia-modules\doxia-module-confluence\target\surefire-reports\*.xml
[windows-jdk7] [withMaven] junitPublisher - Jenkins JUnit Attachments Plugin not found, can't
publish test attachments.Recording test results
[windows-jdk7] [withMaven] junitPublisher - Archive test results for Maven artifact org.apache.maven.doxia:doxia-module-docbook-simple:1.9-SNAPSHOT
generated by maven-surefire-plugin:test (default-test): m\doxia-modules\doxia-module-docbook-simple\target\surefire-reports\*.xml
[windows-jdk7] [withMaven] junitPublisher - Jenkins JUnit Attachments Plugin not found, can't
publish test attachments.Recording test results
[windows-jdk7] [withMaven] junitPublisher - Archive test results for Maven artifact org.apache.maven.doxia:doxia-module-fml:1.9-SNAPSHOT
generated by maven-surefire-plugin:test (default-test): m\doxia-modules\doxia-module-fml\target\surefire-reports\*.xml
[windows-jdk7] [withMaven] junitPublisher - Jenkins JUnit Attachments Plugin not found, can't
publish test attachments.Recording test results
[windows-jdk7] [withMaven] junitPublisher - Archive test results for Maven artifact org.apache.maven.doxia:doxia-module-fo:1.9-SNAPSHOT
generated by maven-surefire-plugin:test (default-test): m\doxia-modules\doxia-module-fo\target\surefire-reports\*.xml
[windows-jdk7] [withMaven] junitPublisher - Jenkins JUnit Attachments Plugin not found, can't
publish test attachments.Recording test results
[windows-jdk7] [withMaven] Skip 'Findbugs Publisher' disabled by configuration
[windows-jdk7] [withMaven] Skip 'Open Task Scanner Publisher' disabled by configuration
[Pipeline] [windows-jdk8] }
[windows-jdk8] [withMaven] Skip 'Generated Artifacts Publisher' disabled by configuration
[windows-jdk8] [withMaven] junitPublisher - Archive test results for Maven artifact org.apache.maven.doxia:doxia-logging-api:1.9-SNAPSHOT
generated by maven-surefire-plugin:test (default-test): m\doxia-logging-api\target\surefire-reports\*.xml
[windows-jdk8] [withMaven] junitPublisher - Jenkins JUnit Attachments Plugin not found, can't
publish test attachments.Recording test results
[windows-jdk8] None of the test reports contained any result
[windows-jdk8] [withMaven] junitPublisher - Archive test results for Maven artifact org.apache.maven.doxia:doxia-sink-api:1.9-SNAPSHOT
generated by maven-surefire-plugin:test (default-test): m\doxia-sink-api\target\surefire-reports\*.xml
[windows-jdk8] [withMaven] junitPublisher - Jenkins JUnit Attachments Plugin not found, can't
publish test attachments.Recording test results
[windows-jdk8] None of the test reports contained any result
[windows-jdk8] [withMaven] junitPublisher - Archive test results for Maven artifact org.apache.maven.doxia:doxia-test-docs:1.9-SNAPSHOT
generated by maven-surefire-plugin:test (default-test): m\doxia-test-docs\target\surefire-reports\*.xml
[windows-jdk8] [withMaven] junitPublisher - Jenkins JUnit Attachments Plugin not found, can't
publish test attachments.Recording test results
[windows-jdk8] None of the test reports contained any result
[windows-jdk8] [withMaven] junitPublisher - Archive test results for Maven artifact org.apache.maven.doxia:doxia-core:1.9-SNAPSHOT
generated by maven-surefire-plugin:test (default-test): m\doxia-core\target\surefire-reports\*.xml
[windows-jdk8] [withMaven] junitPublisher - Jenkins JUnit Attachments Plugin not found, can't
publish test attachments.Recording test results
[windows-jdk8] [withMaven] junitPublisher - Archive test results for Maven artifact org.apache.maven.doxia:doxia-module-apt:1.9-SNAPSHOT
generated by maven-surefire-plugin:test (default-test): m\doxia-modules\doxia-module-apt\target\surefire-reports\*.xml
[windows-jdk8] [withMaven] junitPublisher - Jenkins JUnit Attachments Plugin not found, can't
publish test attachments.Recording test results
[windows-jdk8] [withMaven] junitPublisher - Archive test results for Maven artifact org.apache.maven.doxia:doxia-module-confluence:1.9-SNAPSHOT
generated by maven-surefire-plugin:test (default-test): m\doxia-modules\doxia-module-confluence\target\surefire-reports\*.xml
[windows-jdk8] [withMaven] junitPublisher - Jenkins JUnit Attachments Plugin not found, can't
publish test attachments.Recording test results
[windows-jdk8] [withMaven] junitPublisher - Archive test results for Maven artifact org.apache.maven.doxia:doxia-module-docbook-simple:1.9-SNAPSHOT
generated by maven-surefire-plugin:test (default-test): m\doxia-modules\doxia-module-docbook-simple\target\surefire-reports\*.xml
[windows-jdk8] [withMaven] junitPublisher - Jenkins JUnit Attachments Plugin not found, can't
publish test attachments.Recording test results
[windows-jdk8] [withMaven] junitPublisher - Archive test results for Maven artifact org.apache.maven.doxia:doxia-module-fml:1.9-SNAPSHOT
generated by maven-surefire-plugin:test (default-test): m\doxia-modules\doxia-module-fml\target\surefire-reports\*.xml
[windows-jdk8] [withMaven] junitPublisher - Jenkins JUnit Attachments Plugin not found, can't
publish test attachments.Recording test results
[windows-jdk8] [withMaven] junitPublisher - Archive test results for Maven artifact org.apache.maven.doxia:doxia-module-fo:1.9-SNAPSHOT
generated by maven-surefire-plugin:test (default-test): m\doxia-modules\doxia-module-fo\target\surefire-reports\*.xml
[windows-jdk8] [withMaven] junitPublisher - Jenkins JUnit Attachments Plugin not found, can't
publish test attachments.Recording test results
[windows-jdk8] [withMaven] Skip 'Findbugs Publisher' disabled by configuration
[windows-jdk8] [withMaven] Skip 'Open Task Scanner Publisher' disabled by configuration
[Pipeline] [windows-jdk9] }
[windows-jdk9] [withMaven] Skip 'Generated Artifacts Publisher' disabled by configuration
[windows-jdk9] [withMaven] junitPublisher - Archive test results for Maven artifact org.apache.maven.doxia:doxia-logging-api:1.9-SNAPSHOT
generated by maven-surefire-plugin:test (default-test): m\doxia-logging-api\target\surefire-reports\*.xml
[windows-jdk9] [withMaven] junitPublisher - Jenkins JUnit Attachments Plugin not found, can't
publish test attachments.Recording test results
[windows-jdk9] None of the test reports contained any result
[windows-jdk9] [withMaven] junitPublisher - Archive test results for Maven artifact org.apache.maven.doxia:doxia-sink-api:1.9-SNAPSHOT
generated by maven-surefire-plugin:test (default-test): m\doxia-sink-api\target\surefire-reports\*.xml
[windows-jdk9] [withMaven] junitPublisher - Jenkins JUnit Attachments Plugin not found, can't
publish test attachments.Recording test results
[windows-jdk9] None of the test reports contained any result
[windows-jdk9] [withMaven] junitPublisher - Archive test results for Maven artifact org.apache.maven.doxia:doxia-test-docs:1.9-SNAPSHOT
generated by maven-surefire-plugin:test (default-test): m\doxia-test-docs\target\surefire-reports\*.xml
[windows-jdk9] [withMaven] junitPublisher - Jenkins JUnit Attachments Plugin not found, can't
publish test attachments.Recording test results
[windows-jdk9] None of the test reports contained any result
[windows-jdk9] [withMaven] junitPublisher - Archive test results for Maven artifact org.apache.maven.doxia:doxia-core:1.9-SNAPSHOT
generated by maven-surefire-plugin:test (default-test): m\doxia-core\target\surefire-reports\*.xml
[windows-jdk9] [withMaven] junitPublisher - Jenkins JUnit Attachments Plugin not found, can't
publish test attachments.Recording test results
[windows-jdk9] [withMaven] junitPublisher - Archive test results for Maven artifact org.apache.maven.doxia:doxia-module-apt:1.9-SNAPSHOT
generated by maven-surefire-plugin:test (default-test): m\doxia-modules\doxia-module-apt\target\surefire-reports\*.xml
[windows-jdk9] [withMaven] junitPublisher - Jenkins JUnit Attachments Plugin not found, can't
publish test attachments.Recording test results
[windows-jdk9] [withMaven] junitPublisher - Archive test results for Maven artifact org.apache.maven.doxia:doxia-module-confluence:1.9-SNAPSHOT
generated by maven-surefire-plugin:test (default-test): m\doxia-modules\doxia-module-confluence\target\surefire-reports\*.xml
[windows-jdk9] [withMaven] junitPublisher - Jenkins JUnit Attachments Plugin not found, can't
publish test attachments.Recording test results
[windows-jdk9] [withMaven] junitPublisher - Archive test results for Maven artifact org.apache.maven.doxia:doxia-module-docbook-simple:1.9-SNAPSHOT
generated by maven-surefire-plugin:test (default-test): m\doxia-modules\doxia-module-docbook-simple\target\surefire-reports\*.xml
[windows-jdk9] [withMaven] junitPublisher - Jenkins JUnit Attachments Plugin not found, can't
publish test attachments.Recording test results
[windows-jdk9] [withMaven] junitPublisher - Archive test results for Maven artifact org.apache.maven.doxia:doxia-module-fml:1.9-SNAPSHOT
generated by maven-surefire-plugin:test (default-test): m\doxia-modules\doxia-module-fml\target\surefire-reports\*.xml
[windows-jdk9] [withMaven] junitPublisher - Jenkins JUnit Attachments Plugin not found, can't
publish test attachments.Recording test results
[windows-jdk9] [withMaven] junitPublisher - Archive test results for Maven artifact org.apache.maven.doxia:doxia-module-fo:1.9-SNAPSHOT
generated by maven-surefire-plugin:test (default-test): m\doxia-modules\doxia-module-fo\target\surefire-reports\*.xml
[windows-jdk9] [withMaven] junitPublisher - Jenkins JUnit Attachments Plugin not found, can't
publish test attachments.Recording test results
[windows-jdk9] [withMaven] Skip 'Findbugs Publisher' disabled by configuration
[windows-jdk9] [withMaven] Skip 'Open Task Scanner Publisher' disabled by configuration
[Pipeline] [linux-jdk8] // node
[Pipeline] [linux-jdk9] // withMaven
[Pipeline] [linux-jdk7] // withMaven
[Pipeline] [windows-jdk7] // withMaven
[Pipeline] [windows-jdk8] // withMaven
[Pipeline] [windows-jdk9] // withMaven
[Pipeline] [linux-jdk8] }
[linux-jdk8] Failed in branch linux-jdk8
[Pipeline] [linux-jdk9] echo
[linux-jdk9] [FAIL FAST] linux-jdk8 had first failure, ignoring script returned exit code
1
[Pipeline] [linux-jdk9] }
[Pipeline] [linux-jdk7] echo
[linux-jdk7] [FAIL FAST] linux-jdk8 had first failure, ignoring script returned exit code
1
[Pipeline] [linux-jdk7] }
[Pipeline] [windows-jdk7] echo
[windows-jdk7] [FAIL FAST] linux-jdk8 had first failure, ignoring script returned exit code
1
[Pipeline] [windows-jdk7] }
[Pipeline] [windows-jdk8] echo
[windows-jdk8] [FAIL FAST] linux-jdk8 had first failure, ignoring script returned exit code
1
[Pipeline] [windows-jdk8] }
[Pipeline] [windows-jdk9] echo
[windows-jdk9] [FAIL FAST] linux-jdk8 had first failure, ignoring script returned exit code
1
[Pipeline] [windows-jdk9] }
[Pipeline] [linux-jdk9] // stage
[Pipeline] [linux-jdk7] // stage
[Pipeline] [windows-jdk7] // stage
[Pipeline] [windows-jdk8] // stage
[Pipeline] [windows-jdk9] // stage
[Pipeline] [linux-jdk7] }
[Pipeline] [linux-jdk9] }
[Pipeline] [windows-jdk7] }
[Pipeline] [windows-jdk8] }
[Pipeline] [windows-jdk9] }
[Pipeline] [linux-jdk7] // node
[Pipeline] [linux-jdk9] // node
[Pipeline] [windows-jdk7] // node
[Pipeline] [windows-jdk8] // node
[Pipeline] [windows-jdk9] // node
[Pipeline] [linux-jdk7] }
[Pipeline] [linux-jdk9] }
[Pipeline] [windows-jdk7] }
[Pipeline] [windows-jdk8] }
[Pipeline] [windows-jdk9] }
[Pipeline] // parallel
[Pipeline] echo
***** FAST FAILURE *****

Fast failure triggered by linux-jdk8

***** FAST FAILURE *****
[Pipeline] stage
[Pipeline] { (Notifications)
[Pipeline] echo
Build result: FAILURE
[Pipeline] jiraIssueSelector
[Pipeline] emailext
Mime
  • Unnamed multipart/mixed (inline, None, 0 bytes)
View raw message