maven-notifications mailing list archives

Site index · List index
Message view « Date » · « Thread »
Top « Date » · « Thread »
From Apache Jenkins Server <jenk...@builds.apache.org>
Subject Build failed in Jenkins: Maven TLP » maven-enforcer » MENFORCER-288 #2
Date Sat, 17 Feb 2018 12:33:40 GMT
See https://builds.apache.org/job/maven-box/job/maven-enforcer/job/MENFORCER-288/2/

Changes:

* Removed the need for powermock.  - Changed the implementation
* Removed the need for powermock.  - Changed the implementation
* Removed the need for powermock.  - Changed the implementation

1 tests failed.
FAILED:  org.apache.maven.plugins.enforcer.RequireJavaVesionTest.forth

Error Message:

Expected: (an instance of org.apache.maven.enforcer.rule.api.EnforcerRuleException and exception
with message a string containing "Detected JDK Version: 9.0.4 is not in the allowed range
9.0.5.")
     but: exception with message a string containing "Detected JDK Version: 9.0.4 is not in
the allowed range 9.0.5." message was "Detected JDK Version: 1.8.0-192 is not in the allowed
range 8."
Stacktrace was: org.apache.maven.enforcer.rule.api.EnforcerRuleException: Detected JDK Version:
1.8.0-192 is not in the allowed range 8.
 at org.apache.maven.plugins.enforcer.AbstractVersionEnforcer.enforceVersion(AbstractVersionEnforcer.java:106)
 at org.apache.maven.plugins.enforcer.RequireJavaVersion.execute(RequireJavaVersion.java:61)
 at org.apache.maven.plugins.enforcer.RequireJavaVesionTest.forth(RequireJavaVesionTest.java:108)
 at sun.reflect.NativeMethodAccessorImpl.invoke0(Native Method)
 at sun.reflect.NativeMethodAccessorImpl.invoke(NativeMethodAccessorImpl.java:62)
 at sun.reflect.DelegatingMethodAccessorImpl.invoke(DelegatingMethodAccessorImpl.java:43)
 at java.lang.reflect.Method.invoke(Method.java:498)
 at org.junit.runners.model.FrameworkMethod$1.runReflectiveCall(FrameworkMethod.java:47)
 at org.junit.internal.runners.model.ReflectiveCallable.run(ReflectiveCallable.java:12)
 at org.junit.runners.model.FrameworkMethod.invokeExplosively(FrameworkMethod.java:44)
 at org.junit.internal.runners.statements.InvokeMethod.evaluate(InvokeMethod.java:17)
 at org.junit.internal.runners.statements.RunBefores.evaluate(RunBefores.java:26)
 at org.junit.rules.ExpectedException$ExpectedExceptionStatement.evaluate(ExpectedException.java:168)
 at org.junit.rules.RunRules.evaluate(RunRules.java:20)
 at org.junit.runners.ParentRunner.runLeaf(ParentRunner.java:271)
 at org.junit.runners.BlockJUnit4ClassRunner.runChild(BlockJUnit4ClassRunner.java:70)
 at org.junit.runners.BlockJUnit4ClassRunner.runChild(BlockJUnit4ClassRunner.java:50)
 at org.junit.runners.ParentRunner$3.run(ParentRunner.java:238)
 at org.junit.runners.ParentRunner$1.schedule(ParentRunner.java:63)
 at org.junit.runners.ParentRunner.runChildren(ParentRunner.java:236)
 at org.junit.runners.ParentRunner.access$000(ParentRunner.java:53)
 at org.junit.runners.ParentRunner$2.evaluate(ParentRunner.java:229)
 at org.junit.runners.ParentRunner.run(ParentRunner.java:309)
 at org.apache.maven.surefire.junit4.JUnit4Provider.execute(JUnit4Provider.java:369)
 at org.apache.maven.surefire.junit4.JUnit4Provider.executeWithRerun(JUnit4Provider.java:275)
 at org.apache.maven.surefire.junit4.JUnit4Provider.executeTestSet(JUnit4Provider.java:239)
 at org.apache.maven.surefire.junit4.JUnit4Provider.invoke(JUnit4Provider.java:160)
 at org.apache.maven.surefire.booter.ForkedBooter.invokeProviderInSameClassLoader(ForkedBooter.java:373)
 at org.apache.maven.surefire.booter.ForkedBooter.runSuitesInProcess(ForkedBooter.java:334)
 at org.apache.maven.surefire.booter.ForkedBooter.execute(ForkedBooter.java:119)
 at org.apache.maven.surefire.booter.ForkedBooter.main(ForkedBooter.java:407)


Stack Trace:
java.lang.AssertionError: 

Expected: (an instance of org.apache.maven.enforcer.rule.api.EnforcerRuleException and exception
with message a string containing "Detected JDK Version: 9.0.4 is not in the allowed range
9.0.5.")
     but: exception with message a string containing "Detected JDK Version: 9.0.4 is not in
the allowed range 9.0.5." message was "Detected JDK Version: 1.8.0-192 is not in the allowed
range 8."
Stacktrace was: org.apache.maven.enforcer.rule.api.EnforcerRuleException: Detected JDK Version:
1.8.0-192 is not in the allowed range 8.
	at org.apache.maven.plugins.enforcer.AbstractVersionEnforcer.enforceVersion(AbstractVersionEnforcer.java:106)
	at org.apache.maven.plugins.enforcer.RequireJavaVersion.execute(RequireJavaVersion.java:61)
	at org.apache.maven.plugins.enforcer.RequireJavaVesionTest.forth(RequireJavaVesionTest.java:108)
	at sun.reflect.NativeMethodAccessorImpl.invoke0(Native Method)
	at sun.reflect.NativeMethodAccessorImpl.invoke(NativeMethodAccessorImpl.java:62)
	at sun.reflect.DelegatingMethodAccessorImpl.invoke(DelegatingMethodAccessorImpl.java:43)
	at java.lang.reflect.Method.invoke(Method.java:498)
	at org.junit.runners.model.FrameworkMethod$1.runReflectiveCall(FrameworkMethod.java:47)
	at org.junit.internal.runners.model.ReflectiveCallable.run(ReflectiveCallable.java:12)
	at org.junit.runners.model.FrameworkMethod.invokeExplosively(FrameworkMethod.java:44)
	at org.junit.internal.runners.statements.InvokeMethod.evaluate(InvokeMethod.java:17)
	at org.junit.internal.runners.statements.RunBefores.evaluate(RunBefores.java:26)
	at org.junit.rules.ExpectedException$ExpectedExceptionStatement.evaluate(ExpectedException.java:168)
	at org.junit.rules.RunRules.evaluate(RunRules.java:20)
	at org.junit.runners.ParentRunner.runLeaf(ParentRunner.java:271)
	at org.junit.runners.BlockJUnit4ClassRunner.runChild(BlockJUnit4ClassRunner.java:70)
	at org.junit.runners.BlockJUnit4ClassRunner.runChild(BlockJUnit4ClassRunner.java:50)
	at org.junit.runners.ParentRunner$3.run(ParentRunner.java:238)
	at org.junit.runners.ParentRunner$1.schedule(ParentRunner.java:63)
	at org.junit.runners.ParentRunner.runChildren(ParentRunner.java:236)
	at org.junit.runners.ParentRunner.access$000(ParentRunner.java:53)
	at org.junit.runners.ParentRunner$2.evaluate(ParentRunner.java:229)
	at org.junit.runners.ParentRunner.run(ParentRunner.java:309)
	at org.apache.maven.surefire.junit4.JUnit4Provider.execute(JUnit4Provider.java:369)
	at org.apache.maven.surefire.junit4.JUnit4Provider.executeWithRerun(JUnit4Provider.java:275)
	at org.apache.maven.surefire.junit4.JUnit4Provider.executeTestSet(JUnit4Provider.java:239)
	at org.apache.maven.surefire.junit4.JUnit4Provider.invoke(JUnit4Provider.java:160)
	at org.apache.maven.surefire.booter.ForkedBooter.invokeProviderInSameClassLoader(ForkedBooter.java:373)
	at org.apache.maven.surefire.booter.ForkedBooter.runSuitesInProcess(ForkedBooter.java:334)
	at org.apache.maven.surefire.booter.ForkedBooter.execute(ForkedBooter.java:119)
	at org.apache.maven.surefire.booter.ForkedBooter.main(ForkedBooter.java:407)





Build log:
[...truncated 1.48 MB...]
[windows-jdk8] [INFO] Exclude: .java-version
[windows-jdk8] [INFO] 14 resources included (use -debug for more details)
[windows-jdk8] [INFO] Rat check: Summary over all files. Unapproved: 0, unknown: 0, generated:
0, approved: 14 licenses.
[windows-jdk8] [INFO] 
[windows-jdk8] [INFO] --- maven-remote-resources-plugin:1.5:process (process-resource-bundles)
@ enforcer-api ---
[windows-jdk8] [INFO] 
[windows-jdk8] [INFO] --- maven-resources-plugin:3.0.2:resources (default-resources) @ enforcer-api
---
[windows-jdk8] [INFO] Downloading: https://repo.maven.apache.org/maven2/org/apache/maven/shared/maven-filtering/3.1.1/maven-filtering-3.1.1.pom
[windows-jdk8] [INFO] Downloaded: https://repo.maven.apache.org/maven2/org/apache/maven/shared/maven-filtering/3.1.1/maven-filtering-3.1.1.pom
(5.7 kB at 316 kB/s)
[windows-jdk8] [INFO] Downloading: https://repo.maven.apache.org/maven2/org/sonatype/plexus/plexus-build-api/0.0.7/plexus-build-api-0.0.7.pom
[windows-jdk8] [INFO] Downloaded: https://repo.maven.apache.org/maven2/org/sonatype/plexus/plexus-build-api/0.0.7/plexus-build-api-0.0.7.pom
(3.2 kB at 267 kB/s)
[windows-jdk8] [INFO] Downloading: https://repo.maven.apache.org/maven2/org/sonatype/spice/spice-parent/15/spice-parent-15.pom
[windows-jdk8] [INFO] Downloaded: https://repo.maven.apache.org/maven2/org/sonatype/spice/spice-parent/15/spice-parent-15.pom
(8.4 kB at 1.0 MB/s)
[windows-jdk8] [INFO] Downloading: https://repo.maven.apache.org/maven2/org/sonatype/plexus/plexus-build-api/0.0.7/plexus-build-api-0.0.7.jar
[windows-jdk8] [INFO] Downloading: https://repo.maven.apache.org/maven2/org/apache/maven/shared/maven-filtering/3.1.1/maven-filtering-3.1.1.jar
[windows-jdk8] [INFO] Downloaded: https://repo.maven.apache.org/maven2/org/sonatype/plexus/plexus-build-api/0.0.7/plexus-build-api-0.0.7.jar
(8.5 kB at 848 kB/s)
[windows-jdk8] [INFO] Downloaded: https://repo.maven.apache.org/maven2/org/apache/maven/shared/maven-filtering/3.1.1/maven-filtering-3.1.1.jar
(51 kB at 4.2 MB/s)
[windows-jdk9] [INFO] Downloaded: https://repo.maven.apache.org/maven2/org/apache/maven/plugin-tools/maven-plugin-annotations/3.3/maven-plugin-annotations-3.3.jar
(14 kB at 453 kB/s)
[windows-jdk9] [INFO] Downloaded: https://repo.maven.apache.org/maven2/org/apache/maven/surefire/surefire-api/2.20.1/surefire-api-2.20.1.jar
(183 kB at 5.2 MB/s)
[windows-jdk9] [INFO] Downloaded: https://repo.maven.apache.org/maven2/org/apache/maven/maven-toolchain/2.2.1/maven-toolchain-2.2.1.jar
(38 kB at 990 kB/s)
[windows-jdk9] [INFO] Downloaded: https://repo.maven.apache.org/maven2/junit/junit/4.12/junit-4.12.jar
(315 kB at 7.7 MB/s)
[windows-jdk9] [INFO] 
[windows-jdk9] [INFO] --- maven-jar-plugin:3.0.2:jar (default-jar) @ enforcer-api ---
[windows-jdk9] [INFO] Downloading: https://repo.maven.apache.org/maven2/org/apache/maven/shared/maven-shared-utils/3.0.1/maven-shared-utils-3.0.1.jar
[windows-jdk9] [INFO] Downloaded: https://repo.maven.apache.org/maven2/org/apache/maven/shared/maven-shared-utils/3.0.1/maven-shared-utils-3.0.1.jar
(154 kB at 12 MB/s)
[windows-jdk9] [INFO] Building jar: F:\jenkins\jenkins-slave\workspace\aven-enforcer_MENFORCER-288-GL5B4ERVFARMDDY5GUJ32NFJSOP7ZR6QLATDJG7AYHOHJMZGS6NA\m\enforcer-api\target\enforcer-api-3.0.0-SNAPSHOT.jar
[windows-jdk9] [INFO] 
[windows-jdk9] [INFO] --- maven-site-plugin:3.7:attach-descriptor (attach-descriptor) @ enforcer-api
---
[windows-jdk9] [INFO] Skipping because packaging 'jar' is not pom.
[windows-jdk9] [INFO] 
[windows-jdk9] [INFO] --- maven-checkstyle-plugin:3.0.0:check (checkstyle-check) @ enforcer-api
---
[linux-jdk9] [INFO] Tests run: 9, Failures: 0, Errors: 0, Skipped: 0, Time elapsed: 0.59 s
- in org.apache.maven.plugins.enforcer.RequirePrerequisiteTest
[linux-jdk9] [INFO] Running org.apache.maven.plugins.enforcer.TestRequireReleaseVersion
[linux-jdk9] [debug] This project cannot be a snapshot:testGroupId:snapshot:jar:2.0-SNAPSHOT
[linux-jdk9] [debug] Parent Cannot be a snapshot: testGroupId:snapshot:jar:2.0-SNAPSHOT
[linux-jdk9] [INFO] Tests run: 2, Failures: 0, Errors: 0, Skipped: 0, Time elapsed: 0.008
s - in org.apache.maven.plugins.enforcer.TestRequireReleaseVersion
[linux-jdk9] [INFO] Running org.apache.maven.plugins.enforcer.TestAbstractVersionEnforcer
[linux-jdk9] [debug] Detected test Version: 2.0.5 is allowed in the range [2.0.5,).
[linux-jdk9] [debug] Detected test Version: 2.0.5 is allowed in the range [2.0.4,).
[linux-jdk9] [debug] Detected test Version: 2.0.5 is allowed in the range [2.0.4,2.0.5].
[linux-jdk9] [debug] Detected test Version: 2.0.5 is allowed in the range [2.0.4,2.0.6].
[linux-jdk9] [debug] Detected test Version: 2.0.5 is allowed in the range [2.0.4,2.0.6).
[linux-jdk9] [debug] Detected test Version: 2.0.5 is allowed in the range [2.0,).
[linux-jdk9] [debug] Detected test Version: 2.0.5 is allowed in the range [2.0.0,).
[linux-jdk9] [debug] Detected test Version: 2.0.5 is allowed in the range 2.0.
[linux-jdk9] [debug] Detected test Version: 2.0.5 is allowed in the range 2.0.4.
[linux-jdk9] [debug] Detected test Version: 2.0.5 is allowed in the range 2.0.5.
[linux-jdk9] [INFO] Tests run: 2, Failures: 0, Errors: 0, Skipped: 0, Time elapsed: 0.004
s - in org.apache.maven.plugins.enforcer.TestAbstractVersionEnforcer
[linux-jdk9] [INFO] Running org.apache.maven.plugins.enforcer.TestRequireFilesDontExist
[linux-jdk9] [INFO] Tests run: 7, Failures: 0, Errors: 0, Skipped: 0, Time elapsed: 0.004
s - in org.apache.maven.plugins.enforcer.TestRequireFilesDontExist
[linux-jdk9] [INFO] Running org.apache.maven.plugins.enforcer.TestRequireFileChecksum
[linux-jdk9] [INFO] Tests run: 12, Failures: 0, Errors: 0, Skipped: 0, Time elapsed: 0.046
s - in org.apache.maven.plugins.enforcer.TestRequireFileChecksum
[linux-jdk9] [INFO] Running org.apache.maven.plugins.enforcer.TestBannedRepositories
[linux-jdk9] [INFO] Tests run: 4, Failures: 0, Errors: 0, Skipped: 0, Time elapsed: 0.009
s - in org.apache.maven.plugins.enforcer.TestBannedRepositories
[linux-jdk9] [INFO] Running org.apache.maven.plugins.enforcer.TestRequireSnapshotVersion
[linux-jdk9] [debug] Parent cannot be a release: testGroupId:release:jar:1.0
[linux-jdk9] [debug] This project cannot be a release:testGroupId:release:jar:1.0
[linux-jdk9] [INFO] Tests run: 3, Failures: 0, Errors: 0, Skipped: 0, Time elapsed: 0.004
s - in org.apache.maven.plugins.enforcer.TestRequireSnapshotVersion
[linux-jdk9] [INFO] Running org.apache.maven.plugins.enforcer.TestBannedDependencies
[linux-jdk9] [INFO] Tests run: 21, Failures: 0, Errors: 0, Skipped: 0, Time elapsed: 0.088
s - in org.apache.maven.plugins.enforcer.TestBannedDependencies
[linux-jdk9] [INFO] Running org.apache.maven.plugins.enforcer.TestRequirePluginVersions
[linux-jdk9] [INFO] 
[linux-jdk9] [INFO] Results:
[linux-jdk9] [INFO] 
[linux-jdk9] [INFO] Tests run: 75, Failures: 0, Errors: 0, Skipped: 0
[linux-jdk9] [INFO] 
[linux-jdk9] [ERROR] There are test failures.
[linux-jdk9] 
[linux-jdk9] Please refer to /home/jenkins/jenkins-slave/workspace/aven-enforcer_MENFORCER-288-GL5B4ERVFARMDDY5GUJ32NFJSOP7ZR6QLATDJG7AYHOHJMZGS6NA/m/enforcer-rules/target/surefire-reports
for the individual test results.
[linux-jdk9] Please refer to dump files (if any exist) [date]-jvmRun[N].dump, [date].dumpstream
and [date]-jvmRun[N].dumpstream.
[linux-jdk9] The forked VM terminated without properly saying goodbye. VM crash or System.exit
called?
[linux-jdk9] Command was /bin/sh -c cd /home/jenkins/jenkins-slave/workspace/aven-enforcer_MENFORCER-288-GL5B4ERVFARMDDY5GUJ32NFJSOP7ZR6QLATDJG7AYHOHJMZGS6NA/m/enforcer-rules
&& /usr/local/asfpackages/java/jdk-9.0.1/bin/java --add-modules java.se.ee -jar /home/jenkins/jenkins-slave/workspace/aven-enforcer_MENFORCER-288-GL5B4ERVFARMDDY5GUJ32NFJSOP7ZR6QLATDJG7AYHOHJMZGS6NA/m/enforcer-rules/target/surefire/surefirebooter8483649293579922287.jar
/home/jenkins/jenkins-slave/workspace/aven-enforcer_MENFORCER-288-GL5B4ERVFARMDDY5GUJ32NFJSOP7ZR6QLATDJG7AYHOHJMZGS6NA/m/enforcer-rules/target/surefire
2018-02-17T12-33-19_669-jvmRun1 surefire14172096144599390042tmp surefire_012791715290245577464tmp
[linux-jdk9] Error occurred in starting fork, check output in log
[linux-jdk9] Process Exit Code: 143
[linux-jdk9] Crashed tests:
[linux-jdk9] org.apache.maven.plugins.enforcer.TestRequirePluginVersions
[linux-jdk9] org.apache.maven.surefire.booter.SurefireBooterForkException: The forked VM terminated
without properly saying goodbye. VM crash or System.exit called?
[linux-jdk9] Command was /bin/sh -c cd /home/jenkins/jenkins-slave/workspace/aven-enforcer_MENFORCER-288-GL5B4ERVFARMDDY5GUJ32NFJSOP7ZR6QLATDJG7AYHOHJMZGS6NA/m/enforcer-rules
&& /usr/local/asfpackages/java/jdk-9.0.1/bin/java --add-modules java.se.ee -jar /home/jenkins/jenkins-slave/workspace/aven-enforcer_MENFORCER-288-GL5B4ERVFARMDDY5GUJ32NFJSOP7ZR6QLATDJG7AYHOHJMZGS6NA/m/enforcer-rules/target/surefire/surefirebooter8483649293579922287.jar
/home/jenkins/jenkins-slave/workspace/aven-enforcer_MENFORCER-288-GL5B4ERVFARMDDY5GUJ32NFJSOP7ZR6QLATDJG7AYHOHJMZGS6NA/m/enforcer-rules/target/surefire
2018-02-17T12-33-19_669-jvmRun1 surefire14172096144599390042tmp surefire_012791715290245577464tmp
[linux-jdk9] Error occurred in starting fork, check output in log
[linux-jdk9] Process Exit Code: 143
[linux-jdk9] Crashed tests:
[linux-jdk9] org.apache.maven.plugins.enforcer.TestRequirePluginVersions
[linux-jdk9] 	at org.apache.maven.plugin.surefire.booterclient.ForkStarter.fork(ForkStarter.java:686)
[linux-jdk9] 	at org.apache.maven.plugin.surefire.booterclient.ForkStarter.fork(ForkStarter.java:535)
[linux-jdk9] 	at org.apache.maven.plugin.surefire.booterclient.ForkStarter.run(ForkStarter.java:280)
[linux-jdk9] 	at org.apache.maven.plugin.surefire.booterclient.ForkStarter.run(ForkStarter.java:245)
[linux-jdk9] 	at org.apache.maven.plugin.surefire.AbstractSurefireMojo.executeProvider(AbstractSurefireMojo.java:1124)
[linux-jdk9] 	at org.apache.maven.plugin.surefire.AbstractSurefireMojo.executeAfterPreconditionsChecked(AbstractSurefireMojo.java:954)
[linux-jdk9] 	at org.apache.maven.plugin.surefire.AbstractSurefireMojo.execute(AbstractSurefireMojo.java:832)
[linux-jdk9] 	at org.apache.maven.plugin.DefaultBuildPluginManager.executeMojo(DefaultBuildPluginManager.java:134)
[linux-jdk9] 	at org.apache.maven.lifecycle.internal.MojoExecutor.execute(MojoExecutor.java:208)
[linux-jdk9] 	at org.apache.maven.lifecycle.internal.MojoExecutor.execute(MojoExecutor.java:154)
[linux-jdk9] 	at org.apache.maven.lifecycle.internal.MojoExecutor.execute(MojoExecutor.java:146)
[linux-jdk9] 	at org.apache.maven.lifecycle.internal.LifecycleModuleBuilder.buildProject(LifecycleModuleBuilder.java:117)
[linux-jdk9] 	at org.apache.maven.lifecycle.internal.LifecycleModuleBuilder.buildProject(LifecycleModuleBuilder.java:81)
[linux-jdk9] 	at org.apache.maven.lifecycle.internal.builder.singlethreaded.SingleThreadedBuilder.build(SingleThreadedBuilder.java:51)
[linux-jdk9] 	at org.apache.maven.lifecycle.internal.LifecycleStarter.execute(LifecycleStarter.java:128)
[linux-jdk9] 	at org.apache.maven.DefaultMaven.doExecute(DefaultMaven.java:309)
[linux-jdk9] 	at org.apache.maven.DefaultMaven.doExecute(DefaultMaven.java:194)
[linux-jdk9] 	at org.apache.maven.DefaultMaven.execute(DefaultMaven.java:107)
[linux-jdk9] 	at org.apache.maven.cli.MavenCli.execute(MavenCli.java:955)
[linux-jdk9] 	at org.apache.maven.cli.MavenCli.doMain(MavenCli.java:290)
[linux-jdk9] 	at org.apache.maven.cli.MavenCli.main(MavenCli.java:194)
[linux-jdk9] 	at java.base/jdk.internal.reflect.NativeMethodAccessorImpl.invoke0(Native Method)
[linux-jdk9] 	at java.base/jdk.internal.reflect.NativeMethodAccessorImpl.invoke(NativeMethodAccessorImpl.java:62)
[linux-jdk9] 	at java.base/jdk.internal.reflect.DelegatingMethodAccessorImpl.invoke(DelegatingMethodAccessorImpl.java:43)
[linux-jdk9] 	at java.base/java.lang.reflect.Method.invoke(Method.java:564)
[linux-jdk9] 	at org.codehaus.plexus.classworlds.launcher.Launcher.launchEnhanced(Launcher.java:289)
[linux-jdk9] 	at org.codehaus.plexus.classworlds.launcher.Launcher.launch(Launcher.java:229)
[linux-jdk9] 	at org.codehaus.plexus.classworlds.launcher.Launcher.mainWithExitCode(Launcher.java:415)
[linux-jdk9] 	at org.codehaus.plexus.classworlds.launcher.Launcher.main(Launcher.java:356)
[linux-jdk9] 
[linux-jdk9] [INFO] 
[linux-jdk9] [INFO] --- maven-jar-plugin:3.0.2:jar (default-jar) @ enforcer-rules ---
[linux-jdk9] [INFO] Building jar: /home/jenkins/jenkins-slave/workspace/aven-enforcer_MENFORCER-288-GL5B4ERVFARMDDY5GUJ32NFJSOP7ZR6QLATDJG7AYHOHJMZGS6NA/m/enforcer-rules/target/enforcer-rules-3.0.0-SNAPSHOT.jar
[linux-jdk9] [INFO] 
[linux-jdk9] [INFO] --- maven-site-plugin:3.7:attach-descriptor (attach-descriptor) @ enforcer-rules
---
[linux-jdk9] [INFO] Skipping because packaging 'jar' is not pom.
[linux-jdk9] [INFO] 
[linux-jdk9] [INFO] --- maven-jar-plugin:3.0.2:test-jar (default) @ enforcer-rules ---
[linux-jdk9] [INFO] Building jar: /home/jenkins/jenkins-slave/workspace/aven-enforcer_MENFORCER-288-GL5B4ERVFARMDDY5GUJ32NFJSOP7ZR6QLATDJG7AYHOHJMZGS6NA/m/enforcer-rules/target/enforcer-rules-3.0.0-SNAPSHOT-tests.jar
[linux-jdk9] [INFO] 
[linux-jdk9] [INFO] --- maven-checkstyle-plugin:3.0.0:check (checkstyle-check) @ enforcer-rules
---
[windows-jdk7] [INFO] Downloading: https://repo.maven.apache.org/maven2/org/codehaus/plexus/plexus-java/0.9.2/plexus-java-0.9.2.jar
[windows-jdk7] [INFO] Downloading: https://repo.maven.apache.org/maven2/com/thoughtworks/qdox/qdox/2.0-M7/qdox-2.0-M7.jar
[windows-jdk8] Sending interrupt signal to process
[windows-jdk8] [INFO] Using 'UTF-8' encoding to copy filtered resources.
[windows-jdk8] [INFO] skip non existing resourceDirectory F:\jenkins\jenkins-slave\workspace\aven-enforcer_MENFORCER-288-GL5B4ERVFARMDDY5GUJ32NFJSOP7ZR6QLATDJG7AYHOHJMZGS6NA@2\m\enforcer-api\src\main\resources
[windows-jdk8] [INFO] Copying 3 resources
[windows-jdk8] [INFO] 
[windows-jdk8] [INFO] --- maven-compiler-plugin:3.7.0:compile (default-compile) @ enforcer-api
---
[windows-jdk8] [INFO] Downloading: https://repo.maven.apache.org/maven2/org/apache/maven/shared/maven-shared-incremental/1.1/maven-shared-incremental-1.1.pom
[windows-jdk8] [INFO] Downloaded: https://repo.maven.apache.org/maven2/org/apache/maven/shared/maven-shared-incremental/1.1/maven-shared-incremental-1.1.pom
(4.7 kB at 395 kB/s)
[windows-jdk8] [INFO] Downloading: https://repo.maven.apache.org/maven2/org/apache/maven/shared/maven-shared-utils/0.1/maven-shared-utils-0.1.pom
[windows-jdk8] [INFO] Downloaded: https://repo.maven.apache.org/maven2/org/apache/maven/shared/maven-shared-utils/0.1/maven-shared-utils-0.1.pom
(4.0 kB at 506 kB/s)
[windows-jdk8] [INFO] Downloading: https://repo.maven.apache.org/maven2/org/codehaus/plexus/plexus-java/0.9.2/plexus-java-0.9.2.pom
[windows-jdk8] [INFO] Downloaded: https://repo.maven.apache.org/maven2/org/codehaus/plexus/plexus-java/0.9.2/plexus-java-0.9.2.pom
(2.4 kB at 51 kB/s)
[windows-jdk8] [INFO] Downloading: https://repo.maven.apache.org/maven2/org/codehaus/plexus/plexus-languages/0.9.2/plexus-languages-0.9.2.pom
[windows-jdk8] [INFO] Downloaded: https://repo.maven.apache.org/maven2/org/codehaus/plexus/plexus-languages/0.9.2/plexus-languages-0.9.2.pom
(2.3 kB at 380 kB/s)
[windows-jdk8] [INFO] Downloading: https://repo.maven.apache.org/maven2/org/ow2/asm/asm/6.0_BETA/asm-6.0_BETA.pom
[windows-jdk8] [INFO] Downloaded: https://repo.maven.apache.org/maven2/org/ow2/asm/asm/6.0_BETA/asm-6.0_BETA.pom
(1.9 kB at 277 kB/s)
[windows-jdk8] [INFO] Downloading: https://repo.maven.apache.org/maven2/org/ow2/asm/asm-parent/6.0_BETA/asm-parent-6.0_BETA.pom
[windows-jdk9] [INFO] 
[windows-jdk9] [INFO] ------------------------------------------------------------------------
[windows-jdk9] [INFO] Building Apache Maven Enforcer Built-In Rules 3.0.0-SNAPSHOT
[windows-jdk9] [INFO] ------------------------------------------------------------------------
[windows-jdk9] [INFO] Downloading: https://repo.maven.apache.org/maven2/org/apache/maven/shared/maven-common-artifact-filters/3.0.1/maven-common-artifact-filters-3.0.1.pom
[windows-jdk9] [INFO] Downloaded: https://repo.maven.apache.org/maven2/org/apache/maven/shared/maven-common-artifact-filters/3.0.1/maven-common-artifact-filters-3.0.1.pom
(4.8 kB at 691 kB/s)
[windows-jdk9] [INFO] Downloading: https://repo.maven.apache.org/maven2/org/apache/maven/plugin-testing/maven-plugin-testing-harness/2.1/maven-plugin-testing-harness-2.1.pom
[windows-jdk9] [INFO] Downloaded: https://repo.maven.apache.org/maven2/org/apache/maven/plugin-testing/maven-plugin-testing-harness/2.1/maven-plugin-testing-harness-2.1.pom
(3.2 kB at 461 kB/s)
[windows-jdk9] [INFO] Downloading: https://repo.maven.apache.org/maven2/org/apache/maven/plugin-testing/maven-plugin-testing/2.1/maven-plugin-testing-2.1.pom
[windows-jdk9] [INFO] Downloaded: https://repo.maven.apache.org/maven2/org/apache/maven/plugin-testing/maven-plugin-testing/2.1/maven-plugin-testing-2.1.pom
(10 kB at 1.4 MB/s)
[windows-jdk9] [INFO] Downloading: https://repo.maven.apache.org/maven2/commons-codec/commons-codec/1.6/commons-codec-1.6.pom
[windows-jdk9] [INFO] Downloaded: https://repo.maven.apache.org/maven2/commons-codec/commons-codec/1.6/commons-codec-1.6.pom
(11 kB at 2.2 MB/s)
[windows-jdk9] [INFO] Downloading: https://repo.maven.apache.org/maven2/org/apache/commons/commons-parent/22/commons-parent-22.pom
[windows-jdk9] [INFO] Downloaded: https://repo.maven.apache.org/maven2/org/apache/commons/commons-parent/22/commons-parent-22.pom
(42 kB at 6.0 MB/s)
[windows-jdk9] [INFO] Downloading: https://repo.maven.apache.org/maven2/org/mockito/mockito-core/2.11.0/mockito-core-2.11.0.pom
[windows-jdk9] [INFO] Downloaded: https://repo.maven.apache.org/maven2/org/mockito/mockito-core/2.11.0/mockito-core-2.11.0.pom
(15 kB at 2.2 MB/s)
[windows-jdk9] [INFO] Downloading: https://repo.maven.apache.org/maven2/net/bytebuddy/byte-buddy/1.7.4/byte-buddy-1.7.4.pom
[windows-jdk9] [INFO] Downloaded: https://repo.maven.apache.org/maven2/net/bytebuddy/byte-buddy/1.7.4/byte-buddy-1.7.4.pom
(12 kB at 2.0 MB/s)
[windows-jdk9] [INFO] Downloading: https://repo.maven.apache.org/maven2/net/bytebuddy/byte-buddy-parent/1.7.4/byte-buddy-parent-1.7.4.pom
[windows-jdk9] Sending interrupt signal to process
[windows-jdk9] [INFO] Downloaded: https://repo.maven.apache.org/maven2/net/bytebuddy/byte-buddy-parent/1.7.4/byte-buddy-parent-1.7.4.pom
(25 kB at 3.2 MB/s)
[windows-jdk9] [INFO] Downloading: https://repo.maven.apache.org/maven2/net/bytebuddy/byte-buddy-agent/1.7.4/byte-buddy-agent-1.7.4.pom
[windows-jdk9] [INFO] Downloaded: https://repo.maven.apache.org/maven2/net/bytebuddy/byte-buddy-agent/1.7.4/byte-buddy-agent-1.7.4.pom
(4.9 kB at 615 kB/s)
[windows-jdk9] [INFO] Downloading: https://repo.maven.apache.org/maven2/org/objenesis/objenesis/2.6/objenesis-2.6.pom
[windows-jdk9] [INFO] Downloaded: https://repo.maven.apache.org/maven2/org/objenesis/objenesis/2.6/objenesis-2.6.pom
(2.8 kB at 348 kB/s)
[windows-jdk9] [INFO] Downloading: https://repo.maven.apache.org/maven2/org/objenesis/objenesis-parent/2.6/objenesis-parent-2.6.pom
[windows-jdk9] [INFO] Downloaded: https://repo.maven.apache.org/maven2/org/objenesis/objenesis-parent/2.6/objenesis-parent-2.6.pom
(17 kB at 2.1 MB/s)
[windows-jdk9] [INFO] Downloading: https://repo.maven.apache.org/maven2/org/apache/maven/maven-compat/3.0/maven-compat-3.0.pom
[windows-jdk9] [INFO] Downloaded: https://repo.maven.apache.org/maven2/org/apache/maven/maven-compat/3.0/maven-compat-3.0.pom
(4.0 kB at 574 kB/s)
[windows-jdk9] [INFO] Downloading: https://repo.maven.apache.org/maven2/org/apache/maven/wagon/wagon-provider-api/1.0-beta-6/wagon-provider-api-1.0-beta-6.pom
[windows-jdk9] [INFO] Downloaded: https://repo.maven.apache.org/maven2/org/apache/maven/wagon/wagon-provider-api/1.0-beta-6/wagon-provider-api-1.0-beta-6.pom
(1.8 kB at 251 kB/s)
[windows-jdk9] [INFO] Downloading: https://repo.maven.apache.org/maven2/org/apache/maven/wagon/wagon/1.0-beta-6/wagon-1.0-beta-6.pom
[windows-jdk9] [INFO] Downloaded: https://repo.maven.apache.org/maven2/org/apache/maven/wagon/wagon/1.0-beta-6/wagon-1.0-beta-6.pom
(12 kB at 2.1 MB/s)
[windows-jdk9] [INFO] Downloading: https://repo.maven.apache.org/maven2/org/assertj/assertj-core/1.7.1/assertj-core-1.7.1.pom
[linux-jdk9] Terminated
[Pipeline] [linux-jdk9] }
[Pipeline] [linux-jdk7] }
[Pipeline] [windows-jdk7] }
[Pipeline] [linux-jdk9] // dir
[Pipeline] [linux-jdk7] // dir
[Pipeline] [windows-jdk7] // dir
[Pipeline] [linux-jdk9] }
[linux-jdk9] [withMaven] One or multiple Maven executions have been ignored by the Jenkins
Pipeline Maven Plugin because they have been interrupted before completion (1). See Pipeline
Maven Plugin FAQ for more details.
[Pipeline] [linux-jdk7] }
[linux-jdk7] [withMaven] One or multiple Maven executions have been ignored by the Jenkins
Pipeline Maven Plugin because they have been interrupted before completion (1). See Pipeline
Maven Plugin FAQ for more details.
[Pipeline] [windows-jdk7] }
[windows-jdk7] [withMaven] One or multiple Maven executions have been ignored by the Jenkins
Pipeline Maven Plugin because they have been interrupted before completion (1). See Pipeline
Maven Plugin FAQ for more details.
[Pipeline] [windows-jdk9] }
[Pipeline] [linux-jdk9] // withMaven
[Pipeline] [linux-jdk7] // withMaven
[Pipeline] [windows-jdk7] // withMaven
[Pipeline] [windows-jdk9] // dir
[Pipeline] [linux-jdk9] echo
[linux-jdk9] [FAIL FAST] linux-jdk8 had first failure, ignoring script returned exit code
143
[Pipeline] [linux-jdk9] }
[Pipeline] [linux-jdk7] echo
[linux-jdk7] [FAIL FAST] linux-jdk8 had first failure, ignoring script returned exit code
143
[Pipeline] [linux-jdk7] }
[Pipeline] [windows-jdk7] }
[Pipeline] [windows-jdk9] }
[windows-jdk9] [withMaven] One or multiple Maven executions have been ignored by the Jenkins
Pipeline Maven Plugin because they have been interrupted before completion (1). See Pipeline
Maven Plugin FAQ for more details.
[Pipeline] [linux-jdk9] // stage
[Pipeline] [linux-jdk7] // stage
[Pipeline] [windows-jdk7] // stage
[Pipeline] [windows-jdk9] // withMaven
[Pipeline] [linux-jdk7] }
[Pipeline] [linux-jdk9] }
[Pipeline] [windows-jdk7] }
[Pipeline] [windows-jdk9] echo
[windows-jdk9] [FAIL FAST] linux-jdk8 had first failure, ignoring script returned exit code
-1
[Pipeline] [windows-jdk9] }
[Pipeline] [linux-jdk7] // node
[Pipeline] [linux-jdk9] // node
[Pipeline] [windows-jdk7] // node
[Pipeline] [windows-jdk9] // stage
[Pipeline] [linux-jdk7] }
[Pipeline] [linux-jdk9] }
[Pipeline] [windows-jdk7] }
[Pipeline] [windows-jdk9] }
[Pipeline] [windows-jdk9] // node
[Pipeline] [windows-jdk9] }
[windows-jdk8] After 10s process did not stop
[Pipeline] [windows-jdk8] }
[Pipeline] [windows-jdk8] // dir
[Pipeline] [windows-jdk8] }
[windows-jdk8] [withMaven] One or multiple Maven executions have been ignored by the Jenkins
Pipeline Maven Plugin because they have been interrupted before completion (1). See Pipeline
Maven Plugin FAQ for more details.
[Pipeline] [windows-jdk8] // withMaven
[Pipeline] [windows-jdk8] echo
[windows-jdk8] [FAIL FAST] linux-jdk8 had first failure, ignoring null
[Pipeline] [windows-jdk8] }
[Pipeline] [windows-jdk8] // stage
[Pipeline] [windows-jdk8] }
[Pipeline] [windows-jdk8] // node
[Pipeline] [windows-jdk8] }
[Pipeline] // parallel
[Pipeline] echo
***** FAST FAILURE *****

Fast failure triggered by linux-jdk8

***** FAST FAILURE *****
[Pipeline] stage
[Pipeline] { (Notifications)
[Pipeline] echo
Build result: FAILURE
[Pipeline] jiraIssueSelector
[Pipeline] emailext
Mime
  • Unnamed multipart/mixed (inline, None, 0 bytes)
View raw message