maven-notifications mailing list archives

Site index · List index
Message view « Date » · « Thread »
Top « Date » · « Thread »
From Apache Jenkins Server <jenk...@builds.apache.org>
Subject Build failed in Jenkins: Maven TLP » maven-javadoc-plugin » MJAVADOC-515 #2
Date Tue, 13 Feb 2018 21:48:25 GMT
See https://builds.apache.org/job/maven-box/job/maven-javadoc-plugin/job/MJAVADOC-515/2/

Changes:

* [MJAVADOC-515] - Upgrade parent to 31  o Fixed checkstyle issues related
* [MJAVADOC-515] - Upgrade parent to 31  o Fixed checkstyle issues related

No tests ran.

Build log:
[...truncated 48.87 KB...]
[windows-jdk9] [INFO] Adding ignore: module-info
[windows-jdk7] [INFO] /f:/jenkins/jenkins-slave/workspace/javadoc-plugin_MJAVADOC-515-B55ESPLZJXU5ECAWKWIVPDGGDPEBAS2CZXJ3KWVUGGBWF6MWWHIQ/m/src/main/java/org/apache/maven/plugins/javadoc/JavadocReport.java:
Some input files use or override a deprecated API.
[windows-jdk7] [INFO] /f:/jenkins/jenkins-slave/workspace/javadoc-plugin_MJAVADOC-515-B55ESPLZJXU5ECAWKWIVPDGGDPEBAS2CZXJ3KWVUGGBWF6MWWHIQ/m/src/main/java/org/apache/maven/plugins/javadoc/JavadocReport.java:
Recompile with -Xlint:deprecation for details.
[windows-jdk7] [INFO] /f:/jenkins/jenkins-slave/workspace/javadoc-plugin_MJAVADOC-515-B55ESPLZJXU5ECAWKWIVPDGGDPEBAS2CZXJ3KWVUGGBWF6MWWHIQ/m/src/main/java/org/apache/maven/plugins/javadoc/AbstractJavadocMojo.java:
Some input files use unchecked or unsafe operations.
[windows-jdk7] [INFO] /f:/jenkins/jenkins-slave/workspace/javadoc-plugin_MJAVADOC-515-B55ESPLZJXU5ECAWKWIVPDGGDPEBAS2CZXJ3KWVUGGBWF6MWWHIQ/m/src/main/java/org/apache/maven/plugins/javadoc/AbstractJavadocMojo.java:
Recompile with -Xlint:unchecked for details.
[windows-jdk7] [INFO] 
[windows-jdk7] [INFO] --- maven-plugin-plugin:3.5:descriptor (default-descriptor) @ maven-javadoc-plugin
---
[windows-jdk7] [INFO] Using 'UTF-8' encoding to read mojo source files.
[windows-jdk8] [INFO] 
[windows-jdk8] [INFO] --- maven-resources-plugin:3.0.2:resources (default-resources) @ maven-javadoc-plugin
---
[windows-jdk8] [INFO] Using 'UTF-8' encoding to copy filtered resources.
[windows-jdk8] [INFO] Copying 22 resources
[windows-jdk8] [INFO] Copying 3 resources
[windows-jdk8] [INFO] 
[windows-jdk8] [INFO] --- maven-compiler-plugin:3.7.0:compile (default-compile) @ maven-javadoc-plugin
---
[windows-jdk8] [INFO] Changes detected - recompiling the module!
[windows-jdk8] [INFO] Compiling 36 source files to f:\jenkins\jenkins-slave\workspace\javadoc-plugin_MJAVADOC-515-B55ESPLZJXU5ECAWKWIVPDGGDPEBAS2CZXJ3KWVUGGBWF6MWWHIQ\m\target\classes
[windows-jdk7] [INFO] java-annotations mojo extractor found 15 mojo descriptors.
[windows-jdk9] [INFO] 
[windows-jdk9] [INFO] --- maven-enforcer-plugin:1.4.1:enforce (ban-known-bad-maven-versions)
@ maven-javadoc-plugin ---
[windows-jdk9] [INFO] 
[windows-jdk9] [INFO] --- maven-enforcer-plugin:1.4.1:enforce (ensure-no-container-api) @
maven-javadoc-plugin ---
[windows-jdk7] [INFO] java-javadoc mojo extractor found 0 mojo descriptor.
[windows-jdk7] [INFO] ------------------------------------------------------------------------
[windows-jdk7] [INFO] BUILD FAILURE
[windows-jdk7] [INFO] ------------------------------------------------------------------------
[windows-jdk7] [INFO] Total time: 19.847 s
[windows-jdk7] [INFO] Finished at: 2018-02-13T21:48:03Z
[windows-jdk7] [INFO] Final Memory: 60M/1011M
[windows-jdk7] [INFO] ------------------------------------------------------------------------
[windows-jdk7] [INFO] [jenkins-event-spy] Generated F:\jenkins\jenkins-slave\workspace\javadoc-plugin_MJAVADOC-515-B55ESPLZJXU5ECAWKWIVPDGGDPEBAS2CZXJ3KWVUGGBWF6MWWHIQ@tmp\withMavenbb857d77\maven-spy-20180213-214742-8518861533345717530391.log
[windows-jdk7] [ERROR] Failed to execute goal org.apache.maven.plugins:maven-plugin-plugin:3.5:descriptor
(default-descriptor) on project maven-javadoc-plugin: Execution default-descriptor of goal
org.apache.maven.plugins:maven-plugin-plugin:3.5:descriptor failed. NoSuchElementException
-> [Help 1]
[windows-jdk7] [ERROR] 
[windows-jdk7] [ERROR] To see the full stack trace of the errors, re-run Maven with the -e
switch.
[windows-jdk7] [ERROR] Re-run Maven using the -X switch to enable full debug logging.
[windows-jdk7] [ERROR] 
[windows-jdk7] [ERROR] For more information about the errors and possible solutions, please
read the following articles:
[windows-jdk7] [ERROR] [Help 1] http://cwiki.apache.org/confluence/display/MAVEN/PluginExecutionException
[windows-jdk7] Picked up JAVA_TOOL_OPTIONS: -Dmaven.ext.class.path="f:\jenkins\jenkins-slave\workspace\javadoc-plugin_MJAVADOC-515-B55ESPLZJXU5ECAWKWIVPDGGDPEBAS2CZXJ3KWVUGGBWF6MWWHIQ@tmp\withMavenbb857d77\pipeline-maven-spy.jar"
-Dorg.jenkinsci.plugins.pipeline.maven.reportsFolder="f:\jenkins\jenkins-slave\workspace\javadoc-plugin_MJAVADOC-515-B55ESPLZJXU5ECAWKWIVPDGGDPEBAS2CZXJ3KWVUGGBWF6MWWHIQ@tmp\withMavenbb857d77"

[windows-jdk9] [INFO] 
[windows-jdk9] [INFO] --- apache-rat-plugin:0.12:check (rat-check) @ maven-javadoc-plugin
---
[windows-jdk9] [INFO] Enabled default license matchers.
[windows-jdk9] [INFO] Will parse SCM ignores for exclusions...
[windows-jdk9] [INFO] Parsing exclusions from f:\jenkins\jenkins-slave\workspace\javadoc-plugin_MJAVADOC-515-B55ESPLZJXU5ECAWKWIVPDGGDPEBAS2CZXJ3KWVUGGBWF6MWWHIQ\m\.gitignore
[windows-jdk9] [INFO] Finished adding exclusions from SCM ignore files.
[windows-jdk9] [INFO] 72 implicit excludes (use -debug for more details).
[windows-jdk9] [INFO] Exclude: **/*.psd
[windows-jdk9] [INFO] Exclude: **/*.sha1
[windows-jdk9] [INFO] Exclude: **/*package-list*
[windows-jdk9] [INFO] Exclude: src/main/resources/org/apache/maven/plugins/javadoc/frame-injection-fix.txt
[windows-jdk9] [INFO] Exclude: src/test/resources/unit/test-javadoc-test/junit/junit/3.8.1/junit-3.8.1.pom
[windows-jdk9] [INFO] Exclude: javadoc-options-javadoc-resources.xml
[windows-jdk9] [INFO] Exclude: .repository/**
[windows-jdk9] [INFO] Exclude: .maven/spy.log
[windows-jdk9] [INFO] Exclude: dependency-reduced-pom.xml
[windows-jdk9] [INFO] Exclude: .java-version
[windows-jdk9] [INFO] 577 resources included (use -debug for more details)
[Pipeline] [windows-jdk7] }
[Pipeline] [windows-jdk7] // dir
[windows-jdk8] [INFO] /f:/jenkins/jenkins-slave/workspace/javadoc-plugin_MJAVADOC-515-B55ESPLZJXU5ECAWKWIVPDGGDPEBAS2CZXJ3KWVUGGBWF6MWWHIQ/m/src/main/java/org/apache/maven/plugins/javadoc/JavadocUtil.java:
Some input files use or override a deprecated API.
[windows-jdk8] [INFO] /f:/jenkins/jenkins-slave/workspace/javadoc-plugin_MJAVADOC-515-B55ESPLZJXU5ECAWKWIVPDGGDPEBAS2CZXJ3KWVUGGBWF6MWWHIQ/m/src/main/java/org/apache/maven/plugins/javadoc/JavadocUtil.java:
Recompile with -Xlint:deprecation for details.
[windows-jdk8] [INFO] /f:/jenkins/jenkins-slave/workspace/javadoc-plugin_MJAVADOC-515-B55ESPLZJXU5ECAWKWIVPDGGDPEBAS2CZXJ3KWVUGGBWF6MWWHIQ/m/src/main/java/org/apache/maven/plugins/javadoc/AbstractJavadocMojo.java:
Some input files use unchecked or unsafe operations.
[windows-jdk8] [INFO] /f:/jenkins/jenkins-slave/workspace/javadoc-plugin_MJAVADOC-515-B55ESPLZJXU5ECAWKWIVPDGGDPEBAS2CZXJ3KWVUGGBWF6MWWHIQ/m/src/main/java/org/apache/maven/plugins/javadoc/AbstractJavadocMojo.java:
Recompile with -Xlint:unchecked for details.
[windows-jdk8] [INFO] 
[windows-jdk8] [INFO] --- maven-plugin-plugin:3.5:descriptor (default-descriptor) @ maven-javadoc-plugin
---
[windows-jdk8] [INFO] Using 'UTF-8' encoding to read mojo source files.
[windows-jdk8] [INFO] java-javadoc mojo extractor found 0 mojo descriptor.
[windows-jdk8] [INFO] java-annotations mojo extractor found 15 mojo descriptors.
[windows-jdk8] [INFO] 
[windows-jdk8] [INFO] --- plexus-component-metadata:1.7.1:generate-metadata (default) @ maven-javadoc-plugin
---
[windows-jdk8] [INFO] Discovered 1 component descriptors(s)
[windows-jdk8] [INFO] 
[windows-jdk8] [INFO] --- maven-resources-plugin:3.0.2:testResources (default-testResources)
@ maven-javadoc-plugin ---
[windows-jdk8] [INFO] Using 'UTF-8' encoding to copy filtered resources.
[windows-jdk8] [INFO] Copying 192 resources
[windows-jdk9] [INFO] Rat check: Summary over all files. Unapproved: 0, unknown: 0, generated:
0, approved: 549 licenses.
[windows-jdk9] [INFO] 
[windows-jdk9] [INFO] --- maven-plugin-plugin:3.5:helpmojo (generate-helpmojo) @ maven-javadoc-plugin
---
[windows-jdk9] [INFO] Downloading: https://repo.maven.apache.org/maven2/org/ow2/asm/asm/6.0_ALPHA/asm-6.0_ALPHA.pom
[windows-jdk9] [INFO] Downloaded: https://repo.maven.apache.org/maven2/org/ow2/asm/asm/6.0_ALPHA/asm-6.0_ALPHA.pom
(1.9 kB at 6.4 kB/s)
[windows-jdk9] [INFO] Downloading: https://repo.maven.apache.org/maven2/org/ow2/asm/asm-parent/6.0_ALPHA/asm-parent-6.0_ALPHA.pom
[windows-jdk9] [INFO] Downloaded: https://repo.maven.apache.org/maven2/org/ow2/asm/asm-parent/6.0_ALPHA/asm-parent-6.0_ALPHA.pom
(5.5 kB at 289 kB/s)
[windows-jdk9] [INFO] Downloading: https://repo.maven.apache.org/maven2/org/ow2/asm/asm-commons/6.0_ALPHA/asm-commons-6.0_ALPHA.pom
[windows-jdk9] [INFO] Downloaded: https://repo.maven.apache.org/maven2/org/ow2/asm/asm-commons/6.0_ALPHA/asm-commons-6.0_ALPHA.pom
(2.1 kB at 131 kB/s)
[windows-jdk9] [INFO] Downloading: https://repo.maven.apache.org/maven2/org/ow2/asm/asm-tree/6.0_ALPHA/asm-tree-6.0_ALPHA.pom
[windows-jdk9] [INFO] Downloaded: https://repo.maven.apache.org/maven2/org/ow2/asm/asm-tree/6.0_ALPHA/asm-tree-6.0_ALPHA.pom
(2.1 kB at 95 kB/s)
[windows-jdk8] [INFO] Copying 3 resources
[windows-jdk8] [INFO] 
[windows-jdk8] [INFO] --- maven-compiler-plugin:3.7.0:testCompile (default-testCompile) @
maven-javadoc-plugin ---
[windows-jdk8] [INFO] Changes detected - recompiling the module!
[windows-jdk8] [INFO] Compiling 50 source files to f:\jenkins\jenkins-slave\workspace\javadoc-plugin_MJAVADOC-515-B55ESPLZJXU5ECAWKWIVPDGGDPEBAS2CZXJ3KWVUGGBWF6MWWHIQ\m\target\test-classes
[windows-jdk8] [INFO] /f:/jenkins/jenkins-slave/workspace/javadoc-plugin_MJAVADOC-515-B55ESPLZJXU5ECAWKWIVPDGGDPEBAS2CZXJ3KWVUGGBWF6MWWHIQ/m/src/test/java/org/apache/maven/plugins/javadoc/AbstractJavadocMojoTest.java:
Some input files use or override a deprecated API.
[windows-jdk8] [INFO] /f:/jenkins/jenkins-slave/workspace/javadoc-plugin_MJAVADOC-515-B55ESPLZJXU5ECAWKWIVPDGGDPEBAS2CZXJ3KWVUGGBWF6MWWHIQ/m/src/test/java/org/apache/maven/plugins/javadoc/AbstractJavadocMojoTest.java:
Recompile with -Xlint:deprecation for details.
[windows-jdk8] [INFO] 
[windows-jdk8] [INFO] --- plexus-component-metadata:1.7.1:generate-test-metadata (default)
@ maven-javadoc-plugin ---
[windows-jdk9] [INFO] Downloading: https://repo.maven.apache.org/maven2/org/ow2/asm/asm/6.0_ALPHA/asm-6.0_ALPHA.jar
[windows-jdk9] [INFO] Downloading: https://repo.maven.apache.org/maven2/org/ow2/asm/asm-tree/6.0_ALPHA/asm-tree-6.0_ALPHA.jar
[windows-jdk9] [INFO] Downloading: https://repo.maven.apache.org/maven2/org/ow2/asm/asm-commons/6.0_ALPHA/asm-commons-6.0_ALPHA.jar
[windows-jdk9] [INFO] Downloaded: https://repo.maven.apache.org/maven2/org/ow2/asm/asm/6.0_ALPHA/asm-6.0_ALPHA.jar
(56 kB at 542 kB/s)
[windows-jdk9] [INFO] Downloaded: https://repo.maven.apache.org/maven2/org/ow2/asm/asm-commons/6.0_ALPHA/asm-commons-6.0_ALPHA.jar
(49 kB at 244 kB/s)
[windows-jdk9] [INFO] Downloaded: https://repo.maven.apache.org/maven2/org/ow2/asm/asm-tree/6.0_ALPHA/asm-tree-6.0_ALPHA.jar
(32 kB at 159 kB/s)
[windows-jdk8] [INFO] 
[windows-jdk8] [INFO] --- maven-surefire-plugin:2.20.1:test (default-test) @ maven-javadoc-plugin
---
[windows-jdk8] [INFO] 
[windows-jdk8] [INFO] -------------------------------------------------------
[windows-jdk8] [INFO]  T E S T S
[windows-jdk8] [INFO] -------------------------------------------------------
[windows-jdk9] [INFO] Using 'UTF-8' encoding to read mojo source files.
[windows-jdk9] [INFO] java-javadoc mojo extractor found 0 mojo descriptor.
[windows-jdk9] [INFO] java-annotations mojo extractor found 0 mojo descriptor.
[windows-jdk9] [INFO] 
[windows-jdk9] [INFO] --- modello-maven-plugin:1.9.1:java (default) @ maven-javadoc-plugin
---
[windows-jdk8] [INFO] Running org.apache.maven.plugins.javadoc.AbstractFixJavadocMojoTest
[windows-jdk8] [INFO] Tests run: 10, Failures: 0, Errors: 0, Skipped: 0, Time elapsed: 0.031
s - in org.apache.maven.plugins.javadoc.AbstractFixJavadocMojoTest
[windows-jdk8] [INFO] Running org.apache.maven.plugins.javadoc.AbstractJavadocMojoTest
[windows-jdk9] [INFO] outputDirectory: f:\jenkins\jenkins-slave\workspace\javadoc-plugin_MJAVADOC-515-B55ESPLZJXU5ECAWKWIVPDGGDPEBAS2CZXJ3KWVUGGBWF6MWWHIQ\m\target\generated-sources\modello
[windows-jdk9] [INFO] Working on model: src/main/mdo/javadocOptions.mdo
[windows-jdk9] [INFO] Generating current version: 1.1.0
[windows-jdk9] [INFO] 
[windows-jdk9] [INFO] --- modello-maven-plugin:1.9.1:xpp3-reader (default) @ maven-javadoc-plugin
---
[windows-jdk9] [INFO] outputDirectory: f:\jenkins\jenkins-slave\workspace\javadoc-plugin_MJAVADOC-515-B55ESPLZJXU5ECAWKWIVPDGGDPEBAS2CZXJ3KWVUGGBWF6MWWHIQ\m\target\generated-sources\modello
[windows-jdk9] [INFO] Working on model: src/main/mdo/javadocOptions.mdo
[windows-jdk9] [INFO] Generating current version: 1.1.0
[windows-jdk9] [INFO] 
[windows-jdk9] [INFO] --- modello-maven-plugin:1.9.1:xpp3-writer (default) @ maven-javadoc-plugin
---
[windows-jdk9] [INFO] outputDirectory: f:\jenkins\jenkins-slave\workspace\javadoc-plugin_MJAVADOC-515-B55ESPLZJXU5ECAWKWIVPDGGDPEBAS2CZXJ3KWVUGGBWF6MWWHIQ\m\target\generated-sources\modello
[windows-jdk9] [INFO] Working on model: src/main/mdo/javadocOptions.mdo
[windows-jdk9] [INFO] Generating current version: 1.1.0
[windows-jdk9] [INFO] 
[windows-jdk9] [INFO] --- maven-remote-resources-plugin:1.5:process (process-resource-bundles)
@ maven-javadoc-plugin ---
[windows-jdk8] [INFO] Tests run: 1, Failures: 0, Errors: 0, Skipped: 0, Time elapsed: 1.219
s - in org.apache.maven.plugins.javadoc.AbstractJavadocMojoTest
[windows-jdk8] [INFO] Running org.apache.maven.plugins.javadoc.AggregatorJavadocReportTest
[windows-jdk9] [INFO] 
[windows-jdk9] [INFO] --- maven-resources-plugin:3.0.2:resources (default-resources) @ maven-javadoc-plugin
---
[windows-jdk9] [INFO] Using 'UTF-8' encoding to copy filtered resources.
[windows-jdk9] [INFO] Copying 22 resources
[windows-jdk9] [INFO] Copying 3 resources
[windows-jdk9] [INFO] 
[windows-jdk9] [INFO] --- maven-compiler-plugin:3.7.0:compile (default-compile) @ maven-javadoc-plugin
---
[windows-jdk8] [ERROR] no reactor project: org.apache.maven.plugins.maven-javadoc-plugin.unit:aggregate-resources-test
[windows-jdk8] [ERROR] no reactor project: org.apache.maven.plugins.maven-javadoc-plugin.unit:project1
[windows-jdk8] [ERROR] no reactor project: org.apache.maven.plugins.maven-javadoc-plugin.unit:project2
[windows-jdk9] [INFO] Changes detected - recompiling the module!
[windows-jdk9] [INFO] Compiling 36 source files to f:\jenkins\jenkins-slave\workspace\javadoc-plugin_MJAVADOC-515-B55ESPLZJXU5ECAWKWIVPDGGDPEBAS2CZXJ3KWVUGGBWF6MWWHIQ\m\target\classes
[windows-jdk8] [INFO] 
[windows-jdk8] 1 warning
[windows-jdk8] [WARNING] Javadoc Warnings
[windows-jdk8] [WARNING] javadoc: warning - Multiple sources of package comments found for
package "resources.test"
[windows-jdk8] [WARNING] Picked up JAVA_TOOL_OPTIONS: -Dmaven.ext.class.path="f:\jenkins\jenkins-slave\workspace\javadoc-plugin_MJAVADOC-515-B55ESPLZJXU5ECAWKWIVPDGGDPEBAS2CZXJ3KWVUGGBWF6MWWHIQ@tmp\withMaven4cbe00a0\pipeline-maven-spy.jar"
-Dorg.jenkinsci.plugins.pipeline.maven.reportsFolder="f:\jenkins\jenkins-slave\workspace\javadoc-plugin_MJAVADOC-515-B55ESPLZJXU5ECAWKWIVPDGGDPEBAS2CZXJ3KWVUGGBWF6MWWHIQ@tmp\withMaven4cbe00a0"
[windows-jdk9] [INFO] /F:/jenkins/jenkins-slave/workspace/javadoc-plugin_MJAVADOC-515-B55ESPLZJXU5ECAWKWIVPDGGDPEBAS2CZXJ3KWVUGGBWF6MWWHIQ/m/src/main/java/org/apache/maven/plugins/javadoc/JavadocUtil.java:
Some input files use or override a deprecated API.
[windows-jdk9] [INFO] /F:/jenkins/jenkins-slave/workspace/javadoc-plugin_MJAVADOC-515-B55ESPLZJXU5ECAWKWIVPDGGDPEBAS2CZXJ3KWVUGGBWF6MWWHIQ/m/src/main/java/org/apache/maven/plugins/javadoc/JavadocUtil.java:
Recompile with -Xlint:deprecation for details.
[windows-jdk9] [INFO] /F:/jenkins/jenkins-slave/workspace/javadoc-plugin_MJAVADOC-515-B55ESPLZJXU5ECAWKWIVPDGGDPEBAS2CZXJ3KWVUGGBWF6MWWHIQ/m/src/main/java/org/apache/maven/plugins/javadoc/AbstractJavadocMojo.java:
Some input files use unchecked or unsafe operations.
[windows-jdk9] [INFO] /F:/jenkins/jenkins-slave/workspace/javadoc-plugin_MJAVADOC-515-B55ESPLZJXU5ECAWKWIVPDGGDPEBAS2CZXJ3KWVUGGBWF6MWWHIQ/m/src/main/java/org/apache/maven/plugins/javadoc/AbstractJavadocMojo.java:
Recompile with -Xlint:unchecked for details.
[windows-jdk9] [INFO] 
[windows-jdk9] [INFO] --- maven-plugin-plugin:3.5:descriptor (default-descriptor) @ maven-javadoc-plugin
---
[windows-jdk9] [INFO] Using 'UTF-8' encoding to read mojo source files.
[windows-jdk9] [INFO] java-javadoc mojo extractor found 0 mojo descriptor.
[windows-jdk8] [ERROR] no reactor project: org.apache.maven.plugins.maven-javadoc-plugin.unit:aggregate-test
[windows-jdk8] [ERROR] no reactor project: org.apache.maven.plugins.maven-javadoc-plugin.unit:aggregate-test-project1
[windows-jdk8] [ERROR] no reactor project: org.apache.maven.plugins.maven-javadoc-plugin.unit:aggregate-test-project2
[windows-jdk9] [INFO] java-annotations mojo extractor found 15 mojo descriptors.
[windows-jdk9] [INFO] 
[windows-jdk9] [INFO] --- plexus-component-metadata:1.7.1:generate-metadata (default) @ maven-javadoc-plugin
---
[windows-jdk9] [INFO] Discovered 1 component descriptors(s)
[windows-jdk9] [INFO] 
[windows-jdk9] [INFO] --- maven-resources-plugin:3.0.2:testResources (default-testResources)
@ maven-javadoc-plugin ---
[windows-jdk9] [INFO] Using 'UTF-8' encoding to copy filtered resources.
[windows-jdk9] [INFO] Copying 192 resources
[windows-jdk8] [WARNING] Javadoc Warnings
[windows-jdk8] [WARNING] Picked up JAVA_TOOL_OPTIONS: -Dmaven.ext.class.path="f:\jenkins\jenkins-slave\workspace\javadoc-plugin_MJAVADOC-515-B55ESPLZJXU5ECAWKWIVPDGGDPEBAS2CZXJ3KWVUGGBWF6MWWHIQ@tmp\withMaven4cbe00a0\pipeline-maven-spy.jar"
-Dorg.jenkinsci.plugins.pipeline.maven.reportsFolder="f:\jenkins\jenkins-slave\workspace\javadoc-plugin_MJAVADOC-515-B55ESPLZJXU5ECAWKWIVPDGGDPEBAS2CZXJ3KWVUGGBWF6MWWHIQ@tmp\withMaven4cbe00a0"
[windows-jdk8] [INFO] Tests run: 2, Failures: 0, Errors: 0, Skipped: 0, Time elapsed: 8.103
s - in org.apache.maven.plugins.javadoc.AggregatorJavadocReportTest
[windows-jdk8] [INFO] Running org.apache.maven.plugins.javadoc.FixJavadocMojoTest
[windows-jdk9] [INFO] Copying 3 resources
[windows-jdk9] [INFO] 
[windows-jdk9] [INFO] --- maven-compiler-plugin:3.7.0:testCompile (default-testCompile) @
maven-javadoc-plugin ---
[windows-jdk9] [INFO] Changes detected - recompiling the module!
[windows-jdk9] [INFO] Compiling 50 source files to f:\jenkins\jenkins-slave\workspace\javadoc-plugin_MJAVADOC-515-B55ESPLZJXU5ECAWKWIVPDGGDPEBAS2CZXJ3KWVUGGBWF6MWWHIQ\m\target\test-classes
[Pipeline] [windows-jdk7] }
[windows-jdk7] [withMaven] Skip 'Generated Artifacts Publisher' disabled by configuration
[windows-jdk7] [withMaven] Skip 'Findbugs Publisher' disabled by configuration
[windows-jdk7] [withMaven] Skip 'Open Task Scanner Publisher' disabled by configuration
[Pipeline] [windows-jdk7] // withMaven
[Pipeline] [windows-jdk7] echo
[windows-jdk7] [FAIL FAST] This is the first failure and likely root cause
[Pipeline] [windows-jdk7] }
[Pipeline] [windows-jdk7] // stage
[Pipeline] [windows-jdk7] }
[Pipeline] [windows-jdk7] // node
[Pipeline] [windows-jdk7] }
[windows-jdk8] Sending interrupt signal to process
[windows-jdk9] [INFO] /F:/jenkins/jenkins-slave/workspace/javadoc-plugin_MJAVADOC-515-B55ESPLZJXU5ECAWKWIVPDGGDPEBAS2CZXJ3KWVUGGBWF6MWWHIQ/m/src/test/java/org/apache/maven/plugins/javadoc/AbstractJavadocMojoTest.java:
Some input files use or override a deprecated API.
[windows-jdk9] [INFO] /F:/jenkins/jenkins-slave/workspace/javadoc-plugin_MJAVADOC-515-B55ESPLZJXU5ECAWKWIVPDGGDPEBAS2CZXJ3KWVUGGBWF6MWWHIQ/m/src/test/java/org/apache/maven/plugins/javadoc/AbstractJavadocMojoTest.java:
Recompile with -Xlint:deprecation for details.
[windows-jdk9] [INFO] 
[windows-jdk9] [INFO] --- plexus-component-metadata:1.7.1:generate-test-metadata (default)
@ maven-javadoc-plugin ---
[windows-jdk9] [INFO] 
[windows-jdk9] [INFO] --- maven-surefire-plugin:2.20.1:test (default-test) @ maven-javadoc-plugin
---
[windows-jdk7] Failed in branch windows-jdk7
[windows-jdk9] [INFO] 
[windows-jdk9] [INFO] -------------------------------------------------------
[windows-jdk9] [INFO]  T E S T S
[windows-jdk9] [INFO] -------------------------------------------------------
[windows-jdk9] Sending interrupt signal to process
[Pipeline] [linux-jdk7] // node
[Pipeline] [linux-jdk8] // node
[Pipeline] [linux-jdk9] // node
[Pipeline] [linux-jdk7] }
[linux-jdk7] Failed in branch linux-jdk7
[Pipeline] [linux-jdk8] }
[linux-jdk8] Failed in branch linux-jdk8
[Pipeline] [linux-jdk9] }
[linux-jdk9] Failed in branch linux-jdk9
[Pipeline] [windows-jdk8] }
[windows-jdk9] [INFO] Running org.apache.maven.plugins.javadoc.AbstractFixJavadocMojoTest
[windows-jdk9] [INFO] Tests run: 10, Failures: 0, Errors: 0, Skipped: 0, Time elapsed: 0.118
s - in org.apache.maven.plugins.javadoc.AbstractFixJavadocMojoTest
[windows-jdk9] [INFO] Running org.apache.maven.plugins.javadoc.AbstractJavadocMojoTest
[Pipeline] [windows-jdk8] // dir
[Pipeline] [windows-jdk8] }
[windows-jdk8] [withMaven] One or multiple Maven executions have been ignored by the Jenkins
Pipeline Maven Plugin because they have been interrupted before completion (1). See Pipeline
Maven Plugin FAQ for more details.
[Pipeline] [windows-jdk8] // withMaven
[Pipeline] [windows-jdk8] }
[Pipeline] [windows-jdk8] // stage
[Pipeline] [windows-jdk8] }
[Pipeline] [windows-jdk8] // node
[Pipeline] [windows-jdk8] }
[Pipeline] [windows-jdk9] }
[Pipeline] [windows-jdk9] // dir
[Pipeline] [windows-jdk9] }
[windows-jdk9] [withMaven] One or multiple Maven executions have been ignored by the Jenkins
Pipeline Maven Plugin because they have been interrupted before completion (1). See Pipeline
Maven Plugin FAQ for more details.
[Pipeline] [windows-jdk9] // withMaven
[Pipeline] [windows-jdk9] echo
[windows-jdk9] [FAIL FAST] windows-jdk7 had first failure, ignoring script returned exit code
-1
[Pipeline] [windows-jdk9] }
[Pipeline] [windows-jdk9] // stage
[Pipeline] [windows-jdk9] }
[Pipeline] [windows-jdk9] // node
[Pipeline] [windows-jdk9] }
[Pipeline] // parallel
[Pipeline] echo
***** FAST FAILURE *****

Fast failure triggered by windows-jdk7

***** FAST FAILURE *****
[Pipeline] stage
[Pipeline] { (Notifications)
[Pipeline] echo
Build result: FAILURE
[Pipeline] jiraIssueSelector
[Pipeline] jiraComment
Mime
  • Unnamed multipart/mixed (inline, None, 0 bytes)
View raw message