maven-notifications mailing list archives

Site index · List index
Message view « Date » · « Thread »
Top « Date » · « Thread »
From Apache Jenkins Server <jenk...@builds.apache.org>
Subject Build unstable in Jenkins: Maven TLP » maven-remote-resources-plugin » MRRESOURCES-103 #2
Date Sat, 17 Mar 2018 12:25:29 GMT
See https://builds.apache.org/job/maven-box/job/maven-remote-resources-plugin/job/MRRESOURCES-103/2/

Changes:

* Fixed minimum compile level.
* Fixed minimum compile level.

3 tests failed.
FAILED:  org.apache.maven.plugin.resources.remote.it.IT_RunOnlyAtExecutionRoot.test

Error Message:
Exit code was non-zero: 1; command line and log = 
F:\jenkins\tools\maven\apache-maven-3.5.0\bin\mvn -e --batch-mode -Dmaven.repo.local=f:\jenkins\jenkins-slave\workspace\rces-plugin_MRRESOURCES-103-OWZ3HFZ43MS4CUVJZUVLTQDPH6VF24RFDOZDFCITEPHO3WVUHWJQ\m\target/it-repo org.apache.maven.plugins:maven-clean-plugin:clean generate-resources
[INFO] [jenkins-event-spy] Jenkins Maven Event Spy is disabled
[INFO] Error stacktraces are turned on.
[INFO] Scanning for projects...
[INFO] Downloading: http://repository.apache.org/snapshots/org/apache/maven/plugin/rresource/it/it-parent/1.6-SNAPSHOT/maven-metadata.xml
[INFO] Downloading: http://repository.apache.org/snapshots/org/apache/maven/plugin/rresource/it/it-parent/1.6-SNAPSHOT/it-parent-1.6-SNAPSHOT.pom
[ERROR] [ERROR] Some problems were encountered while processing the POMs:
[FATAL] Non-resolvable parent POM for org.apache.maven.plugin.rresource.it.mrr41:parent:[unknown-version]: Could not find artifact org.apache.maven.plugin.rresource.it:it-parent:pom:1.6-SNAPSHOT in apache-snapshots (http://repository.apache.org/snapshots/) and 'parent.relativePath' points at wrong local POM @ org.apache.maven.plugin.rresource.it.mrr41:parent:[unknown-version], F:\jenkins\jenkins-slave\workspace\rces-plugin_MRRESOURCES-103-OWZ3HFZ43MS4CUVJZUVLTQDPH6VF24RFDOZDFCITEPHO3WVUHWJQ\m\target\test-classes\run-only-at-execution-root\pom.xml, line 24, column 11
[FATAL] Non-resolvable parent POM for org.apache.maven.plugin.rresource.it.mrr41:parent:[unknown-version]: Failure to find org.apache.maven.plugin.rresource.it:it-parent:pom:1.6-SNAPSHOT in http://repository.apache.org/snapshots/ was cached in the local repository, resolution will not be reattempted until the update interval of apache-snapshots has elapsed or updates are forced and 'parent.relativePath' points at wrong local POM @ org.apache.maven.plugin.rresource.it.mrr41:parent:[unknown-version], F:\jenkins\jenkins-slave\workspace\rces-plugin_MRRESOURCES-103-OWZ3HFZ43MS4CUVJZUVLTQDPH6VF24RFDOZDFCITEPHO3WVUHWJQ\m\target\test-classes\run-only-at-execution-root\pom.xml, line 24, column 11
 @ 
[ERROR] The build could not read 2 projects -> [Help 1]
org.apache.maven.project.ProjectBuildingException: Some problems were encountered while processing the POMs:
[FATAL] Non-resolvable parent POM for org.apache.maven.plugin.rresource.it.mrr41:parent:[unknown-version]: Could not find artifact org.apache.maven.plugin.rresource.it:it-parent:pom:1.6-SNAPSHOT in apache-snapshots (http://repository.apache.org/snapshots/) and 'parent.relativePath' points at wrong local POM @ org.apache.maven.plugin.rresource.it.mrr41:parent:[unknown-version], F:\jenkins\jenkins-slave\workspace\rces-plugin_MRRESOURCES-103-OWZ3HFZ43MS4CUVJZUVLTQDPH6VF24RFDOZDFCITEPHO3WVUHWJQ\m\target\test-classes\run-only-at-execution-root\pom.xml, line 24, column 11
[FATAL] Non-resolvable parent POM for org.apache.maven.plugin.rresource.it.mrr41:parent:[unknown-version]: Failure to find org.apache.maven.plugin.rresource.it:it-parent:pom:1.6-SNAPSHOT in http://repository.apache.org/snapshots/ was cached in the local repository, resolution will not be reattempted until the update interval of apache-snapshots has elapsed or updates are forced and 'parent.relativePath' points at wrong local POM @ org.apache.maven.plugin.rresource.it.mrr41:parent:[unknown-version], F:\jenkins\jenkins-slave\workspace\rces-plugin_MRRESOURCES-103-OWZ3HFZ43MS4CUVJZUVLTQDPH6VF24RFDOZDFCITEPHO3WVUHWJQ\m\target\test-classes\run-only-at-execution-root\pom.xml, line 24, column 11

 at org.apache.maven.project.DefaultProjectBuilder.build(DefaultProjectBuilder.java:382)
 at org.apache.maven.graph.DefaultGraphBuilder.collectProjects(DefaultGraphBuilder.java:400)
 at org.apache.maven.graph.DefaultGraphBuilder.getProjectsForMavenReactor(DefaultGraphBuilder.java:391)
 at org.apache.maven.graph.DefaultGraphBuilder.build(DefaultGraphBuilder.java:78)
 at org.apache.maven.DefaultMaven.buildGraph(DefaultMaven.java:511)
 at org.apache.maven.DefaultMaven.doExecute(DefaultMaven.java:221)
 at org.apache.maven.DefaultMaven.doExecute(DefaultMaven.java:194)
 at org.apache.maven.DefaultMaven.execute(DefaultMaven.java:107)
 at org.apache.maven.cli.MavenCli.execute(MavenCli.java:993)
 at org.apache.maven.cli.MavenCli.doMain(MavenCli.java:345)
 at org.apache.maven.cli.MavenCli.main(MavenCli.java:191)
 at sun.reflect.NativeMethodAccessorImpl.invoke0(Native Method)
 at sun.reflect.NativeMethodAccessorImpl.invoke(NativeMethodAccessorImpl.java:57)
 at sun.reflect.DelegatingMethodAccessorImpl.invoke(DelegatingMethodAccessorImpl.java:43)
 at java.lang.reflect.Method.invoke(Method.java:606)
 at org.codehaus.plexus.classworlds.launcher.Launcher.launchEnhanced(Launcher.java:289)
 at org.codehaus.plexus.classworlds.launcher.Launcher.launch(Launcher.java:229)
 at org.codehaus.plexus.classworlds.launcher.Launcher.mainWithExitCode(Launcher.java:415)
 at org.codehaus.plexus.classworlds.launcher.Launcher.main(Launcher.java:356)
[ERROR]   
[ERROR]   The project org.apache.maven.plugin.rresource.it.mrr41:child-1:[unknown-version] (F:\jenkins\jenkins-slave\workspace\rces-plugin_MRRESOURCES-103-OWZ3HFZ43MS4CUVJZUVLTQDPH6VF24RFDOZDFCITEPHO3WVUHWJQ\m\target\test-classes\run-only-at-execution-root\child1\pom.xml) has 1 error
[ERROR]     Non-resolvable parent POM for org.apache.maven.plugin.rresource.it.mrr41:parent:[unknown-version]: Could not find artifact org.apache.maven.plugin.rresource.it:it-parent:pom:1.6-SNAPSHOT in apache-snapshots (http://repository.apache.org/snapshots/) and 'parent.relativePath' points at wrong local POM @ org.apache.maven.plugin.rresource.it.mrr41:parent:[unknown-version], F:\jenkins\jenkins-slave\workspace\rces-plugin_MRRESOURCES-103-OWZ3HFZ43MS4CUVJZUVLTQDPH6VF24RFDOZDFCITEPHO3WVUHWJQ\m\target\test-classes\run-only-at-execution-root\pom.xml, line 24, column 11 -> [Help 2]
org.apache.maven.model.resolution.UnresolvableModelException: Could not find artifact org.apache.maven.plugin.rresource.it:it-parent:pom:1.6-SNAPSHOT in apache-snapshots (http://repository.apache.org/snapshots/)
 at org.apache.maven.project.ProjectModelResolver.resolveModel(ProjectModelResolver.java:197)
 at org.apache.maven.project.ProjectModelResolver.resolveModel(ProjectModelResolver.java:243)
 at org.apache.maven.model.building.DefaultModelBuilder.readParentExternally(DefaultModelBuilder.java:1051)
 at org.apache.maven.model.building.DefaultModelBuilder.readParent(DefaultModelBuilder.java:851)
 at org.apache.maven.model.building.DefaultModelBuilder.build(DefaultModelBuilder.java:331)
 at org.apache.maven.project.DefaultProjectBuilder.build(DefaultProjectBuilder.java:429)
 at org.apache.maven.project.DefaultProjectBuilder.build(DefaultProjectBuilder.java:398)
 at org.apache.maven.project.DefaultProjectBuilder.build(DefaultProjectBuilder.java:515)
 at org.apache.maven.project.DefaultProjectBuilder.build(DefaultProjectBuilder.java:398)
 at org.apache.maven.project.DefaultProjectBuilder.build(DefaultProjectBuilder.java:361)
 at org.apache.maven.graph.DefaultGraphBuilder.collectProjects(DefaultGraphBuilder.java:400)
 at org.apache.maven.graph.DefaultGraphBuilder.getProjectsForMavenReactor(DefaultGraphBuilder.java:391)
 at org.apache.maven.graph.DefaultGraphBuilder.build(DefaultGraphBuilder.java:78)
 at org.apache.maven.DefaultMaven.buildGraph(DefaultMaven.java:511)
 at org.apache.maven.DefaultMaven.doExecute(DefaultMaven.java:221)
 at org.apache.maven.DefaultMaven.doExecute(DefaultMaven.java:194)
 at org.apache.maven.DefaultMaven.execute(DefaultMaven.java:107)
 at org.apache.maven.cli.MavenCli.execute(MavenCli.java:993)
 at org.apache.maven.cli.MavenCli.doMain(MavenCli.java:345)
 at org.apache.maven.cli.MavenCli.main(MavenCli.java:191)
 at sun.reflect.NativeMethodAccessorImpl.invoke0(Native Method)
 at sun.reflect.NativeMethodAccessorImpl.invoke(NativeMethodAccessorImpl.java:57)
 at sun.reflect.DelegatingMethodAccessorImpl.invoke(DelegatingMethodAccessorImpl.java:43)
 at java.lang.reflect.Method.invoke(Method.java:606)
 at org.codehaus.plexus.classworlds.launcher.Launcher.launchEnhanced(Launcher.java:289)
 at org.codehaus.plexus.classworlds.launcher.Launcher.launch(Launcher.java:229)
 at org.codehaus.plexus.classworlds.launcher.Launcher.mainWithExitCode(Launcher.java:415)
 at org.codehaus.plexus.classworlds.launcher.Launcher.main(Launcher.java:356)
Caused by: org.eclipse.aether.resolution.ArtifactResolutionException: Could not find artifact org.apache.maven.plugin.rresource.it:it-parent:pom:1.6-SNAPSHOT in apache-snapshots (http://repository.apache.org/snapshots/)
 at org.eclipse.aether.internal.impl.DefaultArtifactResolver.resolve(DefaultArtifactResolver.java:453)
 at org.eclipse.aether.internal.impl.DefaultArtifactResolver.resolveArtifacts(DefaultArtifactResolver.java:255)
 at org.eclipse.aether.internal.impl.DefaultArtifactResolver.resolveArtifact(DefaultArtifactResolver.java:232)
 at org.eclipse.aether.internal.impl.DefaultRepositorySystem.resolveArtifact(DefaultRepositorySystem.java:303)
 at org.apache.maven.project.ProjectModelResolver.resolveModel(ProjectModelResolver.java:193)
 ... 27 more
Caused by: org.eclipse.aether.transfer.ArtifactNotFoundException: Could not find artifact org.apache.maven.plugin.rresource.it:it-parent:pom:1.6-SNAPSHOT in apache-snapshots (http://repository.apache.org/snapshots/)
 at org.eclipse.aether.connector.basic.ArtifactTransportListener.transferFailed(ArtifactTransportListener.java:48)
 at org.eclipse.aether.connector.basic.BasicRepositoryConnector$TaskRunner.run(BasicRepositoryConnector.java:364)
 at org.eclipse.aether.util.concurrency.RunnableErrorForwarder$1.run(RunnableErrorForwarder.java:76)
 at org.eclipse.aether.connector.basic.BasicRepositoryConnector$DirectExecutor.execute(BasicRepositoryConnector.java:590)
 at org.eclipse.aether.connector.basic.BasicRepositoryConnector.get(BasicRepositoryConnector.java:258)
 at org.eclipse.aether.internal.impl.DefaultArtifactResolver.performDownloads(DefaultArtifactResolver.java:529)
 at org.eclipse.aether.internal.impl.DefaultArtifactResolver.resolve(DefaultArtifactResolver.java:430)
 ... 31 more
[ERROR]   
[ERROR]   The project org.apache.maven.plugin.rresource.it.mrr41:child-2:[unknown-version] (F:\jenkins\jenkins-slave\workspace\rces-plugin_MRRESOURCES-103-OWZ3HFZ43MS4CUVJZUVLTQDPH6VF24RFDOZDFCITEPHO3WVUHWJQ\m\target\test-classes\run-only-at-execution-root\child2\pom.xml) has 1 error
[ERROR]     Non-resolvable parent POM for org.apache.maven.plugin.rresource.it.mrr41:parent:[unknown-version]: Failure to find org.apache.maven.plugin.rresource.it:it-parent:pom:1.6-SNAPSHOT in http://repository.apache.org/snapshots/ was cached in the local repository, resolution will not be reattempted until the update interval of apache-snapshots has elapsed or updates are forced and 'parent.relativePath' points at wrong local POM @ org.apache.maven.plugin.rresource.it.mrr41:parent:[unknown-version], F:\jenkins\jenkins-slave\workspace\rces-plugin_MRRESOURCES-103-OWZ3HFZ43MS4CUVJZUVLTQDPH6VF24RFDOZDFCITEPHO3WVUHWJQ\m\target\test-classes\run-only-at-execution-root\pom.xml, line 24, column 11 -> [Help 2]
org.apache.maven.model.resolution.UnresolvableModelException: Failure to find org.apache.maven.plugin.rresource.it:it-parent:pom:1.6-SNAPSHOT in http://repository.apache.org/snapshots/ was cached in the local repository, resolution will not be reattempted until the update interval of apache-snapshots has elapsed or updates are forced
 at org.apache.maven.project.ProjectModelResolver.resolveModel(ProjectModelResolver.java:197)
 at org.apache.maven.project.ProjectModelResolver.resolveModel(ProjectModelResolver.java:243)
 at org.apache.maven.model.building.DefaultModelBuilder.readParentExternally(DefaultModelBuilder.java:1051)
 at org.apache.maven.model.building.DefaultModelBuilder.readParent(DefaultModelBuilder.java:851)
 at org.apache.maven.model.building.DefaultModelBuilder.build(DefaultModelBuilder.java:331)
 at org.apache.maven.project.DefaultProjectBuilder.build(DefaultProjectBuilder.java:429)
 at org.apache.maven.project.DefaultProjectBuilder.build(DefaultProjectBuilder.java:398)
 at org.apache.maven.project.DefaultProjectBuilder.build(DefaultProjectBuilder.java:515)
 at org.apache.maven.project.DefaultProjectBuilder.build(DefaultProjectBuilder.java:398)
 at org.apache.maven.project.DefaultProjectBuilder.build(DefaultProjectBuilder.java:361)
 at org.apache.maven.graph.DefaultGraphBuilder.collectProjects(DefaultGraphBuilder.java:400)
 at org.apache.maven.graph.DefaultGraphBuilder.getProjectsForMavenReactor(DefaultGraphBuilder.java:391)
 at org.apache.maven.graph.DefaultGraphBuilder.build(DefaultGraphBuilder.java:78)
 at org.apache.maven.DefaultMaven.buildGraph(DefaultMaven.java:511)
 at org.apache.maven.DefaultMaven.doExecute(DefaultMaven.java:221)
 at org.apache.maven.DefaultMaven.doExecute(DefaultMaven.java:194)
 at org.apache.maven.DefaultMaven.execute(DefaultMaven.java:107)
 at org.apache.maven.cli.MavenCli.execute(MavenCli.java:993)
 at org.apache.maven.cli.MavenCli.doMain(MavenCli.java:345)
 at org.apache.maven.cli.MavenCli.main(MavenCli.java:191)
 at sun.reflect.NativeMethodAccessorImpl.invoke0(Native Method)
 at sun.reflect.NativeMethodAccessorImpl.invoke(NativeMethodAccessorImpl.java:57)
 at sun.reflect.DelegatingMethodAccessorImpl.invoke(DelegatingMethodAccessorImpl.java:43)
 at java.lang.reflect.Method.invoke(Method.java:606)
 at org.codehaus.plexus.classworlds.launcher.Launcher.launchEnhanced(Launcher.java:289)
 at org.codehaus.plexus.classworlds.launcher.Launcher.launch(Launcher.java:229)
 at org.codehaus.plexus.classworlds.launcher.Launcher.mainWithExitCode(Launcher.java:415)
 at org.codehaus.plexus.classworlds.launcher.Launcher.main(Launcher.java:356)
Caused by: org.eclipse.aether.resolution.ArtifactResolutionException: Failure to find org.apache.maven.plugin.rresource.it:it-parent:pom:1.6-SNAPSHOT in http://repository.apache.org/snapshots/ was cached in the local repository, resolution will not be reattempted until the update interval of apache-snapshots has elapsed or updates are forced
 at org.eclipse.aether.internal.impl.DefaultArtifactResolver.resolve(DefaultArtifactResolver.java:453)
 at org.eclipse.aether.internal.impl.DefaultArtifactResolver.resolveArtifacts(DefaultArtifactResolver.java:255)
 at org.eclipse.aether.internal.impl.DefaultArtifactResolver.resolveArtifact(DefaultArtifactResolver.java:232)
 at org.eclipse.aether.internal.impl.DefaultRepositorySystem.resolveArtifact(DefaultRepositorySystem.java:303)
 at org.apache.maven.project.ProjectModelResolver.resolveModel(ProjectModelResolver.java:193)
 ... 27 more
Caused by: org.eclipse.aether.transfer.ArtifactNotFoundException: Failure to find org.apache.maven.plugin.rresource.it:it-parent:pom:1.6-SNAPSHOT in http://repository.apache.org/snapshots/ was cached in the local repository, resolution will not be reattempted until the update interval of apache-snapshots has elapsed or updates are forced
 at org.eclipse.aether.internal.impl.DefaultUpdateCheckManager.newException(DefaultUpdateCheckManager.java:240)
 at org.eclipse.aether.internal.impl.DefaultUpdateCheckManager.checkArtifact(DefaultUpdateCheckManager.java:192)
 at org.eclipse.aether.internal.impl.DefaultArtifactResolver.gatherDownloads(DefaultArtifactResolver.java:594)
 at org.eclipse.aether.internal.impl.DefaultArtifactResolver.performDownloads(DefaultArtifactResolver.java:512)
 at org.eclipse.aether.internal.impl.DefaultArtifactResolver.resolve(DefaultArtifactResolver.java:430)
 ... 31 more
[ERROR] 
[ERROR] Re-run Maven using the -X switch to enable full debug logging.
[ERROR] 
[ERROR] For more information about the errors and possible solutions, please read the following articles:
[ERROR] [Help 1] http://cwiki.apache.org/confluence/display/MAVEN/ProjectBuildingException
[ERROR] [Help 2] http://cwiki.apache.org/confluence/display/MAVEN/UnresolvableModelException
Picked up JAVA_TOOL_OPTIONS: -Dmaven.ext.class.path="f:\jenkins\jenkins-slave\workspace\rces-plugin_MRRESOURCES-103-OWZ3HFZ43MS4CUVJZUVLTQDPH6VF24RFDOZDFCITEPHO3WVUHWJQ@tmp\withMavenbedb5b10\pipeline-maven-spy.jar" -Dorg.jenkinsci.plugins.pipeline.maven.reportsFolder="f:\jenkins\jenkins-slave\workspace\rces-plugin_MRRESOURCES-103-OWZ3HFZ43MS4CUVJZUVLTQDPH6VF24RFDOZDFCITEPHO3WVUHWJQ@tmp\withMavenbedb5b10" 


Stack Trace:
org.apache.maven.it.VerificationException: 
Exit code was non-zero: 1; command line and log = 
F:\jenkins\tools\maven\apache-maven-3.5.0\bin\mvn -e --batch-mode -Dmaven.repo.local=f:\jenkins\jenkins-slave\workspace\rces-plugin_MRRESOURCES-103-OWZ3HFZ43MS4CUVJZUVLTQDPH6VF24RFDOZDFCITEPHO3WVUHWJQ\m\target/it-repo org.apache.maven.plugins:maven-clean-plugin:clean generate-resources
[INFO] [jenkins-event-spy] Jenkins Maven Event Spy is disabled
[INFO] Error stacktraces are turned on.
[INFO] Scanning for projects...
[INFO] Downloading: http://repository.apache.org/snapshots/org/apache/maven/plugin/rresource/it/it-parent/1.6-SNAPSHOT/maven-metadata.xml
[INFO] Downloading: http://repository.apache.org/snapshots/org/apache/maven/plugin/rresource/it/it-parent/1.6-SNAPSHOT/it-parent-1.6-SNAPSHOT.pom
[ERROR] [ERROR] Some problems were encountered while processing the POMs:
[FATAL] Non-resolvable parent POM for org.apache.maven.plugin.rresource.it.mrr41:parent:[unknown-version]: Could not find artifact org.apache.maven.plugin.rresource.it:it-parent:pom:1.6-SNAPSHOT in apache-snapshots (http://repository.apache.org/snapshots/) and 'parent.relativePath' points at wrong local POM @ org.apache.maven.plugin.rresource.it.mrr41:parent:[unknown-version], F:\jenkins\jenkins-slave\workspace\rces-plugin_MRRESOURCES-103-OWZ3HFZ43MS4CUVJZUVLTQDPH6VF24RFDOZDFCITEPHO3WVUHWJQ\m\target\test-classes\run-only-at-execution-root\pom.xml, line 24, column 11
[FATAL] Non-resolvable parent POM for org.apache.maven.plugin.rresource.it.mrr41:parent:[unknown-version]: Failure to find org.apache.maven.plugin.rresource.it:it-parent:pom:1.6-SNAPSHOT in http://repository.apache.org/snapshots/ was cached in the local repository, resolution will not be reattempted until the update interval of apache-snapshots has elapsed or updates are forced and 'parent.relativePath' points at wrong local POM @ org.apache.maven.plugin.rresource.it.mrr41:parent:[unknown-version], F:\jenkins\jenkins-slave\workspace\rces-plugin_MRRESOURCES-103-OWZ3HFZ43MS4CUVJZUVLTQDPH6VF24RFDOZDFCITEPHO3WVUHWJQ\m\target\test-classes\run-only-at-execution-root\pom.xml, line 24, column 11
 @ 
[ERROR] The build could not read 2 projects -> [Help 1]
org.apache.maven.project.ProjectBuildingException: Some problems were encountered while processing the POMs:
[FATAL] Non-resolvable parent POM for org.apache.maven.plugin.rresource.it.mrr41:parent:[unknown-version]: Could not find artifact org.apache.maven.plugin.rresource.it:it-parent:pom:1.6-SNAPSHOT in apache-snapshots (http://repository.apache.org/snapshots/) and 'parent.relativePath' points at wrong local POM @ org.apache.maven.plugin.rresource.it.mrr41:parent:[unknown-version], F:\jenkins\jenkins-slave\workspace\rces-plugin_MRRESOURCES-103-OWZ3HFZ43MS4CUVJZUVLTQDPH6VF24RFDOZDFCITEPHO3WVUHWJQ\m\target\test-classes\run-only-at-execution-root\pom.xml, line 24, column 11
[FATAL] Non-resolvable parent POM for org.apache.maven.plugin.rresource.it.mrr41:parent:[unknown-version]: Failure to find org.apache.maven.plugin.rresource.it:it-parent:pom:1.6-SNAPSHOT in http://repository.apache.org/snapshots/ was cached in the local repository, resolution will not be reattempted until the update interval of apache-snapshots has elapsed or updates are forced and 'parent.relativePath' points at wrong local POM @ org.apache.maven.plugin.rresource.it.mrr41:parent:[unknown-version], F:\jenkins\jenkins-slave\workspace\rces-plugin_MRRESOURCES-103-OWZ3HFZ43MS4CUVJZUVLTQDPH6VF24RFDOZDFCITEPHO3WVUHWJQ\m\target\test-classes\run-only-at-execution-root\pom.xml, line 24, column 11

	at org.apache.maven.project.DefaultProjectBuilder.build(DefaultProjectBuilder.java:382)
	at org.apache.maven.graph.DefaultGraphBuilder.collectProjects(DefaultGraphBuilder.java:400)
	at org.apache.maven.graph.DefaultGraphBuilder.getProjectsForMavenReactor(DefaultGraphBuilder.java:391)
	at org.apache.maven.graph.DefaultGraphBuilder.build(DefaultGraphBuilder.java:78)
	at org.apache.maven.DefaultMaven.buildGraph(DefaultMaven.java:511)
	at org.apache.maven.DefaultMaven.doExecute(DefaultMaven.java:221)
	at org.apache.maven.DefaultMaven.doExecute(DefaultMaven.java:194)
	at org.apache.maven.DefaultMaven.execute(DefaultMaven.java:107)
	at org.apache.maven.cli.MavenCli.execute(MavenCli.java:993)
	at org.apache.maven.cli.MavenCli.doMain(MavenCli.java:345)
	at org.apache.maven.cli.MavenCli.main(MavenCli.java:191)
	at sun.reflect.NativeMethodAccessorImpl.invoke0(Native Method)
	at sun.reflect.NativeMethodAccessorImpl.invoke(NativeMethodAccessorImpl.java:57)
	at sun.reflect.DelegatingMethodAccessorImpl.invoke(DelegatingMethodAccessorImpl.java:43)
	at java.lang.reflect.Method.invoke(Method.java:606)
	at org.codehaus.plexus.classworlds.launcher.Launcher.launchEnhanced(Launcher.java:289)
	at org.codehaus.plexus.classworlds.launcher.Launcher.launch(Launcher.java:229)
	at org.codehaus.plexus.classworlds.launcher.Launcher.mainWithExitCode(Launcher.java:415)
	at org.codehaus.plexus.classworlds.launcher.Launcher.main(Launcher.java:356)
[ERROR]   
[ERROR]   The project org.apache.maven.plugin.rresource.it.mrr41:child-1:[unknown-version] (F:\jenkins\jenkins-slave\workspace\rces-plugin_MRRESOURCES-103-OWZ3HFZ43MS4CUVJZUVLTQDPH6VF24RFDOZDFCITEPHO3WVUHWJQ\m\target\test-classes\run-only-at-execution-root\child1\pom.xml) has 1 error
[ERROR]     Non-resolvable parent POM for org.apache.maven.plugin.rresource.it.mrr41:parent:[unknown-version]: Could not find artifact org.apache.maven.plugin.rresource.it:it-parent:pom:1.6-SNAPSHOT in apache-snapshots (http://repository.apache.org/snapshots/) and 'parent.relativePath' points at wrong local POM @ org.apache.maven.plugin.rresource.it.mrr41:parent:[unknown-version], F:\jenkins\jenkins-slave\workspace\rces-plugin_MRRESOURCES-103-OWZ3HFZ43MS4CUVJZUVLTQDPH6VF24RFDOZDFCITEPHO3WVUHWJQ\m\target\test-classes\run-only-at-execution-root\pom.xml, line 24, column 11 -> [Help 2]
org.apache.maven.model.resolution.UnresolvableModelException: Could not find artifact org.apache.maven.plugin.rresource.it:it-parent:pom:1.6-SNAPSHOT in apache-snapshots (http://repository.apache.org/snapshots/)
	at org.apache.maven.project.ProjectModelResolver.resolveModel(ProjectModelResolver.java:197)
	at org.apache.maven.project.ProjectModelResolver.resolveModel(ProjectModelResolver.java:243)
	at org.apache.maven.model.building.DefaultModelBuilder.readParentExternally(DefaultModelBuilder.java:1051)
	at org.apache.maven.model.building.DefaultModelBuilder.readParent(DefaultModelBuilder.java:851)
	at org.apache.maven.model.building.DefaultModelBuilder.build(DefaultModelBuilder.java:331)
	at org.apache.maven.project.DefaultProjectBuilder.build(DefaultProjectBuilder.java:429)
	at org.apache.maven.project.DefaultProjectBuilder.build(DefaultProjectBuilder.java:398)
	at org.apache.maven.project.DefaultProjectBuilder.build(DefaultProjectBuilder.java:515)
	at org.apache.maven.project.DefaultProjectBuilder.build(DefaultProjectBuilder.java:398)
	at org.apache.maven.project.DefaultProjectBuilder.build(DefaultProjectBuilder.java:361)
	at org.apache.maven.graph.DefaultGraphBuilder.collectProjects(DefaultGraphBuilder.java:400)
	at org.apache.maven.graph.DefaultGraphBuilder.getProjectsForMavenReactor(DefaultGraphBuilder.java:391)
	at org.apache.maven.graph.DefaultGraphBuilder.build(DefaultGraphBuilder.java:78)
	at org.apache.maven.DefaultMaven.buildGraph(DefaultMaven.java:511)
	at org.apache.maven.DefaultMaven.doExecute(DefaultMaven.java:221)
	at org.apache.maven.DefaultMaven.doExecute(DefaultMaven.java:194)
	at org.apache.maven.DefaultMaven.execute(DefaultMaven.java:107)
	at org.apache.maven.cli.MavenCli.execute(MavenCli.java:993)
	at org.apache.maven.cli.MavenCli.doMain(MavenCli.java:345)
	at org.apache.maven.cli.MavenCli.main(MavenCli.java:191)
	at sun.reflect.NativeMethodAccessorImpl.invoke0(Native Method)
	at sun.reflect.NativeMethodAccessorImpl.invoke(NativeMethodAccessorImpl.java:57)
	at sun.reflect.DelegatingMethodAccessorImpl.invoke(DelegatingMethodAccessorImpl.java:43)
	at java.lang.reflect.Method.invoke(Method.java:606)
	at org.codehaus.plexus.classworlds.launcher.Launcher.launchEnhanced(Launcher.java:289)
	at org.codehaus.plexus.classworlds.launcher.Launcher.launch(Launcher.java:229)
	at org.codehaus.plexus.classworlds.launcher.Launcher.mainWithExitCode(Launcher.java:415)
	at org.codehaus.plexus.classworlds.launcher.Launcher.main(Launcher.java:356)
Caused by: org.eclipse.aether.resolution.ArtifactResolutionException: Could not find artifact org.apache.maven.plugin.rresource.it:it-parent:pom:1.6-SNAPSHOT in apache-snapshots (http://repository.apache.org/snapshots/)
	at org.eclipse.aether.internal.impl.DefaultArtifactResolver.resolve(DefaultArtifactResolver.java:453)
	at org.eclipse.aether.internal.impl.DefaultArtifactResolver.resolveArtifacts(DefaultArtifactResolver.java:255)
	at org.eclipse.aether.internal.impl.DefaultArtifactResolver.resolveArtifact(DefaultArtifactResolver.java:232)
	at org.eclipse.aether.internal.impl.DefaultRepositorySystem.resolveArtifact(DefaultRepositorySystem.java:303)
	at org.apache.maven.project.ProjectModelResolver.resolveModel(ProjectModelResolver.java:193)
	... 27 more
Caused by: org.eclipse.aether.transfer.ArtifactNotFoundException: Could not find artifact org.apache.maven.plugin.rresource.it:it-parent:pom:1.6-SNAPSHOT in apache-snapshots (http://repository.apache.org/snapshots/)
	at org.eclipse.aether.connector.basic.ArtifactTransportListener.transferFailed(ArtifactTransportListener.java:48)
	at org.eclipse.aether.connector.basic.BasicRepositoryConnector$TaskRunner.run(BasicRepositoryConnector.java:364)
	at org.eclipse.aether.util.concurrency.RunnableErrorForwarder$1.run(RunnableErrorForwarder.java:76)
	at org.eclipse.aether.connector.basic.BasicRepositoryConnector$DirectExecutor.execute(BasicRepositoryConnector.java:590)
	at org.eclipse.aether.connector.basic.BasicRepositoryConnector.get(BasicRepositoryConnector.java:258)
	at org.eclipse.aether.internal.impl.DefaultArtifactResolver.performDownloads(DefaultArtifactResolver.java:529)
	at org.eclipse.aether.internal.impl.DefaultArtifactResolver.resolve(DefaultArtifactResolver.java:430)
	... 31 more
[ERROR]   
[ERROR]   The project org.apache.maven.plugin.rresource.it.mrr41:child-2:[unknown-version] (F:\jenkins\jenkins-slave\workspace\rces-plugin_MRRESOURCES-103-OWZ3HFZ43MS4CUVJZUVLTQDPH6VF24RFDOZDFCITEPHO3WVUHWJQ\m\target\test-classes\run-only-at-execution-root\child2\pom.xml) has 1 error
[ERROR]     Non-resolvable parent POM for org.apache.maven.plugin.rresource.it.mrr41:parent:[unknown-version]: Failure to find org.apache.maven.plugin.rresource.it:it-parent:pom:1.6-SNAPSHOT in http://repository.apache.org/snapshots/ was cached in the local repository, resolution will not be reattempted until the update interval of apache-snapshots has elapsed or updates are forced and 'parent.relativePath' points at wrong local POM @ org.apache.maven.plugin.rresource.it.mrr41:parent:[unknown-version], F:\jenkins\jenkins-slave\workspace\rces-plugin_MRRESOURCES-103-OWZ3HFZ43MS4CUVJZUVLTQDPH6VF24RFDOZDFCITEPHO3WVUHWJQ\m\target\test-classes\run-only-at-execution-root\pom.xml, line 24, column 11 -> [Help 2]
org.apache.maven.model.resolution.UnresolvableModelException: Failure to find org.apache.maven.plugin.rresource.it:it-parent:pom:1.6-SNAPSHOT in http://repository.apache.org/snapshots/ was cached in the local repository, resolution will not be reattempted until the update interval of apache-snapshots has elapsed or updates are forced
	at org.apache.maven.project.ProjectModelResolver.resolveModel(ProjectModelResolver.java:197)
	at org.apache.maven.project.ProjectModelResolver.resolveModel(ProjectModelResolver.java:243)
	at org.apache.maven.model.building.DefaultModelBuilder.readParentExternally(DefaultModelBuilder.java:1051)
	at org.apache.maven.model.building.DefaultModelBuilder.readParent(DefaultModelBuilder.java:851)
	at org.apache.maven.model.building.DefaultModelBuilder.build(DefaultModelBuilder.java:331)
	at org.apache.maven.project.DefaultProjectBuilder.build(DefaultProjectBuilder.java:429)
	at org.apache.maven.project.DefaultProjectBuilder.build(DefaultProjectBuilder.java:398)
	at org.apache.maven.project.DefaultProjectBuilder.build(DefaultProjectBuilder.java:515)
	at org.apache.maven.project.DefaultProjectBuilder.build(DefaultProjectBuilder.java:398)
	at org.apache.maven.project.DefaultProjectBuilder.build(DefaultProjectBuilder.java:361)
	at org.apache.maven.graph.DefaultGraphBuilder.collectProjects(DefaultGraphBuilder.java:400)
	at org.apache.maven.graph.DefaultGraphBuilder.getProjectsForMavenReactor(DefaultGraphBuilder.java:391)
	at org.apache.maven.graph.DefaultGraphBuilder.build(DefaultGraphBuilder.java:78)
	at org.apache.maven.DefaultMaven.buildGraph(DefaultMaven.java:511)
	at org.apache.maven.DefaultMaven.doExecute(DefaultMaven.java:221)
	at org.apache.maven.DefaultMaven.doExecute(DefaultMaven.java:194)
	at org.apache.maven.DefaultMaven.execute(DefaultMaven.java:107)
	at org.apache.maven.cli.MavenCli.execute(MavenCli.java:993)
	at org.apache.maven.cli.MavenCli.doMain(MavenCli.java:345)
	at org.apache.maven.cli.MavenCli.main(MavenCli.java:191)
	at sun.reflect.NativeMethodAccessorImpl.invoke0(Native Method)
	at sun.reflect.NativeMethodAccessorImpl.invoke(NativeMethodAccessorImpl.java:57)
	at sun.reflect.DelegatingMethodAccessorImpl.invoke(DelegatingMethodAccessorImpl.java:43)
	at java.lang.reflect.Method.invoke(Method.java:606)
	at org.codehaus.plexus.classworlds.launcher.Launcher.launchEnhanced(Launcher.java:289)
	at org.codehaus.plexus.classworlds.launcher.Launcher.launch(Launcher.java:229)
	at org.codehaus.plexus.classworlds.launcher.Launcher.mainWithExitCode(Launcher.java:415)
	at org.codehaus.plexus.classworlds.launcher.Launcher.main(Launcher.java:356)
Caused by: org.eclipse.aether.resolution.ArtifactResolutionException: Failure to find org.apache.maven.plugin.rresource.it:it-parent:pom:1.6-SNAPSHOT in http://repository.apache.org/snapshots/ was cached in the local repository, resolution will not be reattempted until the update interval of apache-snapshots has elapsed or updates are forced
	at org.eclipse.aether.internal.impl.DefaultArtifactResolver.resolve(DefaultArtifactResolver.java:453)
	at org.eclipse.aether.internal.impl.DefaultArtifactResolver.resolveArtifacts(DefaultArtifactResolver.java:255)
	at org.eclipse.aether.internal.impl.DefaultArtifactResolver.resolveArtifact(DefaultArtifactResolver.java:232)
	at org.eclipse.aether.internal.impl.DefaultRepositorySystem.resolveArtifact(DefaultRepositorySystem.java:303)
	at org.apache.maven.project.ProjectModelResolver.resolveModel(ProjectModelResolver.java:193)
	... 27 more
Caused by: org.eclipse.aether.transfer.ArtifactNotFoundException: Failure to find org.apache.maven.plugin.rresource.it:it-parent:pom:1.6-SNAPSHOT in http://repository.apache.org/snapshots/ was cached in the local repository, resolution will not be reattempted until the update interval of apache-snapshots has elapsed or updates are forced
	at org.eclipse.aether.internal.impl.DefaultUpdateCheckManager.newException(DefaultUpdateCheckManager.java:240)
	at org.eclipse.aether.internal.impl.DefaultUpdateCheckManager.checkArtifact(DefaultUpdateCheckManager.java:192)
	at org.eclipse.aether.internal.impl.DefaultArtifactResolver.gatherDownloads(DefaultArtifactResolver.java:594)
	at org.eclipse.aether.internal.impl.DefaultArtifactResolver.performDownloads(DefaultArtifactResolver.java:512)
	at org.eclipse.aether.internal.impl.DefaultArtifactResolver.resolve(DefaultArtifactResolver.java:430)
	... 31 more
[ERROR] 
[ERROR] Re-run Maven using the -X switch to enable full debug logging.
[ERROR] 
[ERROR] For more information about the errors and possible solutions, please read the following articles:
[ERROR] [Help 1] http://cwiki.apache.org/confluence/display/MAVEN/ProjectBuildingException
[ERROR] [Help 2] http://cwiki.apache.org/confluence/display/MAVEN/UnresolvableModelException
Picked up JAVA_TOOL_OPTIONS: -Dmaven.ext.class.path="f:\jenkins\jenkins-slave\workspace\rces-plugin_MRRESOURCES-103-OWZ3HFZ43MS4CUVJZUVLTQDPH6VF24RFDOZDFCITEPHO3WVUHWJQ@tmp\withMavenbedb5b10\pipeline-maven-spy.jar" -Dorg.jenkinsci.plugins.pipeline.maven.reportsFolder="f:\jenkins\jenkins-slave\workspace\rces-plugin_MRRESOURCES-103-OWZ3HFZ43MS4CUVJZUVLTQDPH6VF24RFDOZDFCITEPHO3WVUHWJQ@tmp\withMavenbedb5b10" 

	at org.apache.maven.plugin.resources.remote.it.IT_RunOnlyAtExecutionRoot.test(IT_RunOnlyAtExecutionRoot.java:60)


FAILED:  org.apache.maven.plugin.resources.remote.it.IT_RunOnlyAtExecutionRoot.test

Error Message:
Exit code was non-zero: 1; command line and log = 
F:\jenkins\tools\maven\apache-maven-3.5.0\bin\mvn -e --batch-mode -Dmaven.repo.local=f:\jenkins\jenkins-slave\workspace\rces-plugin_MRRESOURCES-103-OWZ3HFZ43MS4CUVJZUVLTQDPH6VF24RFDOZDFCITEPHO3WVUHWJQ\m\target/it-repo org.apache.maven.plugins:maven-clean-plugin:clean generate-resources
[INFO] [jenkins-event-spy] Jenkins Maven Event Spy is disabled
[INFO] Error stacktraces are turned on.
[INFO] Scanning for projects...
[INFO] Downloading: http://repository.apache.org/snapshots/org/apache/maven/plugin/rresource/it/it-parent/1.6-SNAPSHOT/maven-metadata.xml
[INFO] Downloading: http://repository.apache.org/snapshots/org/apache/maven/plugin/rresource/it/it-parent/1.6-SNAPSHOT/it-parent-1.6-SNAPSHOT.pom
[ERROR] [ERROR] Some problems were encountered while processing the POMs:
[FATAL] Non-resolvable parent POM for org.apache.maven.plugin.rresource.it.mrr41:parent:[unknown-version]: Could not find artifact org.apache.maven.plugin.rresource.it:it-parent:pom:1.6-SNAPSHOT in apache-snapshots (http://repository.apache.org/snapshots/) and 'parent.relativePath' points at wrong local POM @ org.apache.maven.plugin.rresource.it.mrr41:parent:[unknown-version], F:\jenkins\jenkins-slave\workspace\rces-plugin_MRRESOURCES-103-OWZ3HFZ43MS4CUVJZUVLTQDPH6VF24RFDOZDFCITEPHO3WVUHWJQ\m\target\test-classes\run-only-at-execution-root\pom.xml, line 24, column 11
[FATAL] Non-resolvable parent POM for org.apache.maven.plugin.rresource.it.mrr41:parent:[unknown-version]: Failure to find org.apache.maven.plugin.rresource.it:it-parent:pom:1.6-SNAPSHOT in http://repository.apache.org/snapshots/ was cached in the local repository, resolution will not be reattempted until the update interval of apache-snapshots has elapsed or updates are forced and 'parent.relativePath' points at wrong local POM @ org.apache.maven.plugin.rresource.it.mrr41:parent:[unknown-version], F:\jenkins\jenkins-slave\workspace\rces-plugin_MRRESOURCES-103-OWZ3HFZ43MS4CUVJZUVLTQDPH6VF24RFDOZDFCITEPHO3WVUHWJQ\m\target\test-classes\run-only-at-execution-root\pom.xml, line 24, column 11
 @ 
[ERROR] The build could not read 2 projects -> [Help 1]
org.apache.maven.project.ProjectBuildingException: Some problems were encountered while processing the POMs:
[FATAL] Non-resolvable parent POM for org.apache.maven.plugin.rresource.it.mrr41:parent:[unknown-version]: Could not find artifact org.apache.maven.plugin.rresource.it:it-parent:pom:1.6-SNAPSHOT in apache-snapshots (http://repository.apache.org/snapshots/) and 'parent.relativePath' points at wrong local POM @ org.apache.maven.plugin.rresource.it.mrr41:parent:[unknown-version], F:\jenkins\jenkins-slave\workspace\rces-plugin_MRRESOURCES-103-OWZ3HFZ43MS4CUVJZUVLTQDPH6VF24RFDOZDFCITEPHO3WVUHWJQ\m\target\test-classes\run-only-at-execution-root\pom.xml, line 24, column 11
[FATAL] Non-resolvable parent POM for org.apache.maven.plugin.rresource.it.mrr41:parent:[unknown-version]: Failure to find org.apache.maven.plugin.rresource.it:it-parent:pom:1.6-SNAPSHOT in http://repository.apache.org/snapshots/ was cached in the local repository, resolution will not be reattempted until the update interval of apache-snapshots has elapsed or updates are forced and 'parent.relativePath' points at wrong local POM @ org.apache.maven.plugin.rresource.it.mrr41:parent:[unknown-version], F:\jenkins\jenkins-slave\workspace\rces-plugin_MRRESOURCES-103-OWZ3HFZ43MS4CUVJZUVLTQDPH6VF24RFDOZDFCITEPHO3WVUHWJQ\m\target\test-classes\run-only-at-execution-root\pom.xml, line 24, column 11

 at org.apache.maven.project.DefaultProjectBuilder.build(DefaultProjectBuilder.java:382)
 at org.apache.maven.graph.DefaultGraphBuilder.collectProjects(DefaultGraphBuilder.java:400)
 at org.apache.maven.graph.DefaultGraphBuilder.getProjectsForMavenReactor(DefaultGraphBuilder.java:391)
 at org.apache.maven.graph.DefaultGraphBuilder.build(DefaultGraphBuilder.java:78)
 at org.apache.maven.DefaultMaven.buildGraph(DefaultMaven.java:511)
 at org.apache.maven.DefaultMaven.doExecute(DefaultMaven.java:221)
 at org.apache.maven.DefaultMaven.doExecute(DefaultMaven.java:194)
 at org.apache.maven.DefaultMaven.execute(DefaultMaven.java:107)
 at org.apache.maven.cli.MavenCli.execute(MavenCli.java:993)
 at org.apache.maven.cli.MavenCli.doMain(MavenCli.java:345)
 at org.apache.maven.cli.MavenCli.main(MavenCli.java:191)
 at sun.reflect.NativeMethodAccessorImpl.invoke0(Native Method)
 at sun.reflect.NativeMethodAccessorImpl.invoke(NativeMethodAccessorImpl.java:62)
 at sun.reflect.DelegatingMethodAccessorImpl.invoke(DelegatingMethodAccessorImpl.java:43)
 at java.lang.reflect.Method.invoke(Method.java:498)
 at org.codehaus.plexus.classworlds.launcher.Launcher.launchEnhanced(Launcher.java:289)
 at org.codehaus.plexus.classworlds.launcher.Launcher.launch(Launcher.java:229)
 at org.codehaus.plexus.classworlds.launcher.Launcher.mainWithExitCode(Launcher.java:415)
 at org.codehaus.plexus.classworlds.launcher.Launcher.main(Launcher.java:356)
[ERROR]   
[ERROR]   The project org.apache.maven.plugin.rresource.it.mrr41:child-1:[unknown-version] (F:\jenkins\jenkins-slave\workspace\rces-plugin_MRRESOURCES-103-OWZ3HFZ43MS4CUVJZUVLTQDPH6VF24RFDOZDFCITEPHO3WVUHWJQ\m\target\test-classes\run-only-at-execution-root\child1\pom.xml) has 1 error
[ERROR]     Non-resolvable parent POM for org.apache.maven.plugin.rresource.it.mrr41:parent:[unknown-version]: Could not find artifact org.apache.maven.plugin.rresource.it:it-parent:pom:1.6-SNAPSHOT in apache-snapshots (http://repository.apache.org/snapshots/) and 'parent.relativePath' points at wrong local POM @ org.apache.maven.plugin.rresource.it.mrr41:parent:[unknown-version], F:\jenkins\jenkins-slave\workspace\rces-plugin_MRRESOURCES-103-OWZ3HFZ43MS4CUVJZUVLTQDPH6VF24RFDOZDFCITEPHO3WVUHWJQ\m\target\test-classes\run-only-at-execution-root\pom.xml, line 24, column 11 -> [Help 2]
org.apache.maven.model.resolution.UnresolvableModelException: Could not find artifact org.apache.maven.plugin.rresource.it:it-parent:pom:1.6-SNAPSHOT in apache-snapshots (http://repository.apache.org/snapshots/)
 at org.apache.maven.project.ProjectModelResolver.resolveModel(ProjectModelResolver.java:197)
 at org.apache.maven.project.ProjectModelResolver.resolveModel(ProjectModelResolver.java:243)
 at org.apache.maven.model.building.DefaultModelBuilder.readParentExternally(DefaultModelBuilder.java:1051)
 at org.apache.maven.model.building.DefaultModelBuilder.readParent(DefaultModelBuilder.java:851)
 at org.apache.maven.model.building.DefaultModelBuilder.build(DefaultModelBuilder.java:331)
 at org.apache.maven.project.DefaultProjectBuilder.build(DefaultProjectBuilder.java:429)
 at org.apache.maven.project.DefaultProjectBuilder.build(DefaultProjectBuilder.java:398)
 at org.apache.maven.project.DefaultProjectBuilder.build(DefaultProjectBuilder.java:515)
 at org.apache.maven.project.DefaultProjectBuilder.build(DefaultProjectBuilder.java:398)
 at org.apache.maven.project.DefaultProjectBuilder.build(DefaultProjectBuilder.java:361)
 at org.apache.maven.graph.DefaultGraphBuilder.collectProjects(DefaultGraphBuilder.java:400)
 at org.apache.maven.graph.DefaultGraphBuilder.getProjectsForMavenReactor(DefaultGraphBuilder.java:391)
 at org.apache.maven.graph.DefaultGraphBuilder.build(DefaultGraphBuilder.java:78)
 at org.apache.maven.DefaultMaven.buildGraph(DefaultMaven.java:511)
 at org.apache.maven.DefaultMaven.doExecute(DefaultMaven.java:221)
 at org.apache.maven.DefaultMaven.doExecute(DefaultMaven.java:194)
 at org.apache.maven.DefaultMaven.execute(DefaultMaven.java:107)
 at org.apache.maven.cli.MavenCli.execute(MavenCli.java:993)
 at org.apache.maven.cli.MavenCli.doMain(MavenCli.java:345)
 at org.apache.maven.cli.MavenCli.main(MavenCli.java:191)
 at sun.reflect.NativeMethodAccessorImpl.invoke0(Native Method)
 at sun.reflect.NativeMethodAccessorImpl.invoke(NativeMethodAccessorImpl.java:62)
 at sun.reflect.DelegatingMethodAccessorImpl.invoke(DelegatingMethodAccessorImpl.java:43)
 at java.lang.reflect.Method.invoke(Method.java:498)
 at org.codehaus.plexus.classworlds.launcher.Launcher.launchEnhanced(Launcher.java:289)
 at org.codehaus.plexus.classworlds.launcher.Launcher.launch(Launcher.java:229)
 at org.codehaus.plexus.classworlds.launcher.Launcher.mainWithExitCode(Launcher.java:415)
 at org.codehaus.plexus.classworlds.launcher.Launcher.main(Launcher.java:356)
Caused by: org.eclipse.aether.resolution.ArtifactResolutionException: Could not find artifact org.apache.maven.plugin.rresource.it:it-parent:pom:1.6-SNAPSHOT in apache-snapshots (http://repository.apache.org/snapshots/)
 at org.eclipse.aether.internal.impl.DefaultArtifactResolver.resolve(DefaultArtifactResolver.java:453)
 at org.eclipse.aether.internal.impl.DefaultArtifactResolver.resolveArtifacts(DefaultArtifactResolver.java:255)
 at org.eclipse.aether.internal.impl.DefaultArtifactResolver.resolveArtifact(DefaultArtifactResolver.java:232)
 at org.eclipse.aether.internal.impl.DefaultRepositorySystem.resolveArtifact(DefaultRepositorySystem.java:303)
 at org.apache.maven.project.ProjectModelResolver.resolveModel(ProjectModelResolver.java:193)
 ... 27 more
Caused by: org.eclipse.aether.transfer.ArtifactNotFoundException: Could not find artifact org.apache.maven.plugin.rresource.it:it-parent:pom:1.6-SNAPSHOT in apache-snapshots (http://repository.apache.org/snapshots/)
 at org.eclipse.aether.connector.basic.ArtifactTransportListener.transferFailed(ArtifactTransportListener.java:48)
 at org.eclipse.aether.connector.basic.BasicRepositoryConnector$TaskRunner.run(BasicRepositoryConnector.java:364)
 at org.eclipse.aether.util.concurrency.RunnableErrorForwarder$1.run(RunnableErrorForwarder.java:76)
 at org.eclipse.aether.connector.basic.BasicRepositoryConnector$DirectExecutor.execute(BasicRepositoryConnector.java:590)
 at org.eclipse.aether.connector.basic.BasicRepositoryConnector.get(BasicRepositoryConnector.java:258)
 at org.eclipse.aether.internal.impl.DefaultArtifactResolver.performDownloads(DefaultArtifactResolver.java:529)
 at org.eclipse.aether.internal.impl.DefaultArtifactResolver.resolve(DefaultArtifactResolver.java:430)
 ... 31 more
[ERROR]   
[ERROR]   The project org.apache.maven.plugin.rresource.it.mrr41:child-2:[unknown-version] (F:\jenkins\jenkins-slave\workspace\rces-plugin_MRRESOURCES-103-OWZ3HFZ43MS4CUVJZUVLTQDPH6VF24RFDOZDFCITEPHO3WVUHWJQ\m\target\test-classes\run-only-at-execution-root\child2\pom.xml) has 1 error
[ERROR]     Non-resolvable parent POM for org.apache.maven.plugin.rresource.it.mrr41:parent:[unknown-version]: Failure to find org.apache.maven.plugin.rresource.it:it-parent:pom:1.6-SNAPSHOT in http://repository.apache.org/snapshots/ was cached in the local repository, resolution will not be reattempted until the update interval of apache-snapshots has elapsed or updates are forced and 'parent.relativePath' points at wrong local POM @ org.apache.maven.plugin.rresource.it.mrr41:parent:[unknown-version], F:\jenkins\jenkins-slave\workspace\rces-plugin_MRRESOURCES-103-OWZ3HFZ43MS4CUVJZUVLTQDPH6VF24RFDOZDFCITEPHO3WVUHWJQ\m\target\test-classes\run-only-at-execution-root\pom.xml, line 24, column 11 -> [Help 2]
org.apache.maven.model.resolution.UnresolvableModelException: Failure to find org.apache.maven.plugin.rresource.it:it-parent:pom:1.6-SNAPSHOT in http://repository.apache.org/snapshots/ was cached in the local repository, resolution will not be reattempted until the update interval of apache-snapshots has elapsed or updates are forced
 at org.apache.maven.project.ProjectModelResolver.resolveModel(ProjectModelResolver.java:197)
 at org.apache.maven.project.ProjectModelResolver.resolveModel(ProjectModelResolver.java:243)
 at org.apache.maven.model.building.DefaultModelBuilder.readParentExternally(DefaultModelBuilder.java:1051)
 at org.apache.maven.model.building.DefaultModelBuilder.readParent(DefaultModelBuilder.java:851)
 at org.apache.maven.model.building.DefaultModelBuilder.build(DefaultModelBuilder.java:331)
 at org.apache.maven.project.DefaultProjectBuilder.build(DefaultProjectBuilder.java:429)
 at org.apache.maven.project.DefaultProjectBuilder.build(DefaultProjectBuilder.java:398)
 at org.apache.maven.project.DefaultProjectBuilder.build(DefaultProjectBuilder.java:515)
 at org.apache.maven.project.DefaultProjectBuilder.build(DefaultProjectBuilder.java:398)
 at org.apache.maven.project.DefaultProjectBuilder.build(DefaultProjectBuilder.java:361)
 at org.apache.maven.graph.DefaultGraphBuilder.collectProjects(DefaultGraphBuilder.java:400)
 at org.apache.maven.graph.DefaultGraphBuilder.getProjectsForMavenReactor(DefaultGraphBuilder.java:391)
 at org.apache.maven.graph.DefaultGraphBuilder.build(DefaultGraphBuilder.java:78)
 at org.apache.maven.DefaultMaven.buildGraph(DefaultMaven.java:511)
 at org.apache.maven.DefaultMaven.doExecute(DefaultMaven.java:221)
 at org.apache.maven.DefaultMaven.doExecute(DefaultMaven.java:194)
 at org.apache.maven.DefaultMaven.execute(DefaultMaven.java:107)
 at org.apache.maven.cli.MavenCli.execute(MavenCli.java:993)
 at org.apache.maven.cli.MavenCli.doMain(MavenCli.java:345)
 at org.apache.maven.cli.MavenCli.main(MavenCli.java:191)
 at sun.reflect.NativeMethodAccessorImpl.invoke0(Native Method)
 at sun.reflect.NativeMethodAccessorImpl.invoke(NativeMethodAccessorImpl.java:62)
 at sun.reflect.DelegatingMethodAccessorImpl.invoke(DelegatingMethodAccessorImpl.java:43)
 at java.lang.reflect.Method.invoke(Method.java:498)
 at org.codehaus.plexus.classworlds.launcher.Launcher.launchEnhanced(Launcher.java:289)
 at org.codehaus.plexus.classworlds.launcher.Launcher.launch(Launcher.java:229)
 at org.codehaus.plexus.classworlds.launcher.Launcher.mainWithExitCode(Launcher.java:415)
 at org.codehaus.plexus.classworlds.launcher.Launcher.main(Launcher.java:356)
Caused by: org.eclipse.aether.resolution.ArtifactResolutionException: Failure to find org.apache.maven.plugin.rresource.it:it-parent:pom:1.6-SNAPSHOT in http://repository.apache.org/snapshots/ was cached in the local repository, resolution will not be reattempted until the update interval of apache-snapshots has elapsed or updates are forced
 at org.eclipse.aether.internal.impl.DefaultArtifactResolver.resolve(DefaultArtifactResolver.java:453)
 at org.eclipse.aether.internal.impl.DefaultArtifactResolver.resolveArtifacts(DefaultArtifactResolver.java:255)
 at org.eclipse.aether.internal.impl.DefaultArtifactResolver.resolveArtifact(DefaultArtifactResolver.java:232)
 at org.eclipse.aether.internal.impl.DefaultRepositorySystem.resolveArtifact(DefaultRepositorySystem.java:303)
 at org.apache.maven.project.ProjectModelResolver.resolveModel(ProjectModelResolver.java:193)
 ... 27 more
Caused by: org.eclipse.aether.transfer.ArtifactNotFoundException: Failure to find org.apache.maven.plugin.rresource.it:it-parent:pom:1.6-SNAPSHOT in http://repository.apache.org/snapshots/ was cached in the local repository, resolution will not be reattempted until the update interval of apache-snapshots has elapsed or updates are forced
 at org.eclipse.aether.internal.impl.DefaultUpdateCheckManager.newException(DefaultUpdateCheckManager.java:240)
 at org.eclipse.aether.internal.impl.DefaultUpdateCheckManager.checkArtifact(DefaultUpdateCheckManager.java:192)
 at org.eclipse.aether.internal.impl.DefaultArtifactResolver.gatherDownloads(DefaultArtifactResolver.java:594)
 at org.eclipse.aether.internal.impl.DefaultArtifactResolver.performDownloads(DefaultArtifactResolver.java:512)
 at org.eclipse.aether.internal.impl.DefaultArtifactResolver.resolve(DefaultArtifactResolver.java:430)
 ... 31 more
[ERROR] 
[ERROR] Re-run Maven using the -X switch to enable full debug logging.
[ERROR] 
[ERROR] For more information about the errors and possible solutions, please read the following articles:
[ERROR] [Help 1] http://cwiki.apache.org/confluence/display/MAVEN/ProjectBuildingException
[ERROR] [Help 2] http://cwiki.apache.org/confluence/display/MAVEN/UnresolvableModelException
Picked up JAVA_TOOL_OPTIONS: -Dmaven.ext.class.path="f:\jenkins\jenkins-slave\workspace\rces-plugin_MRRESOURCES-103-OWZ3HFZ43MS4CUVJZUVLTQDPH6VF24RFDOZDFCITEPHO3WVUHWJQ@tmp\withMaven11d3f1d4\pipeline-maven-spy.jar" -Dorg.jenkinsci.plugins.pipeline.maven.reportsFolder="f:\jenkins\jenkins-slave\workspace\rces-plugin_MRRESOURCES-103-OWZ3HFZ43MS4CUVJZUVLTQDPH6VF24RFDOZDFCITEPHO3WVUHWJQ@tmp\withMaven11d3f1d4" 


Stack Trace:
org.apache.maven.it.VerificationException: 
Exit code was non-zero: 1; command line and log = 
F:\jenkins\tools\maven\apache-maven-3.5.0\bin\mvn -e --batch-mode -Dmaven.repo.local=f:\jenkins\jenkins-slave\workspace\rces-plugin_MRRESOURCES-103-OWZ3HFZ43MS4CUVJZUVLTQDPH6VF24RFDOZDFCITEPHO3WVUHWJQ\m\target/it-repo org.apache.maven.plugins:maven-clean-plugin:clean generate-resources
[INFO] [jenkins-event-spy] Jenkins Maven Event Spy is disabled
[INFO] Error stacktraces are turned on.
[INFO] Scanning for projects...
[INFO] Downloading: http://repository.apache.org/snapshots/org/apache/maven/plugin/rresource/it/it-parent/1.6-SNAPSHOT/maven-metadata.xml
[INFO] Downloading: http://repository.apache.org/snapshots/org/apache/maven/plugin/rresource/it/it-parent/1.6-SNAPSHOT/it-parent-1.6-SNAPSHOT.pom
[ERROR] [ERROR] Some problems were encountered while processing the POMs:
[FATAL] Non-resolvable parent POM for org.apache.maven.plugin.rresource.it.mrr41:parent:[unknown-version]: Could not find artifact org.apache.maven.plugin.rresource.it:it-parent:pom:1.6-SNAPSHOT in apache-snapshots (http://repository.apache.org/snapshots/) and 'parent.relativePath' points at wrong local POM @ org.apache.maven.plugin.rresource.it.mrr41:parent:[unknown-version], F:\jenkins\jenkins-slave\workspace\rces-plugin_MRRESOURCES-103-OWZ3HFZ43MS4CUVJZUVLTQDPH6VF24RFDOZDFCITEPHO3WVUHWJQ\m\target\test-classes\run-only-at-execution-root\pom.xml, line 24, column 11
[FATAL] Non-resolvable parent POM for org.apache.maven.plugin.rresource.it.mrr41:parent:[unknown-version]: Failure to find org.apache.maven.plugin.rresource.it:it-parent:pom:1.6-SNAPSHOT in http://repository.apache.org/snapshots/ was cached in the local repository, resolution will not be reattempted until the update interval of apache-snapshots has elapsed or updates are forced and 'parent.relativePath' points at wrong local POM @ org.apache.maven.plugin.rresource.it.mrr41:parent:[unknown-version], F:\jenkins\jenkins-slave\workspace\rces-plugin_MRRESOURCES-103-OWZ3HFZ43MS4CUVJZUVLTQDPH6VF24RFDOZDFCITEPHO3WVUHWJQ\m\target\test-classes\run-only-at-execution-root\pom.xml, line 24, column 11
 @ 
[ERROR] The build could not read 2 projects -> [Help 1]
org.apache.maven.project.ProjectBuildingException: Some problems were encountered while processing the POMs:
[FATAL] Non-resolvable parent POM for org.apache.maven.plugin.rresource.it.mrr41:parent:[unknown-version]: Could not find artifact org.apache.maven.plugin.rresource.it:it-parent:pom:1.6-SNAPSHOT in apache-snapshots (http://repository.apache.org/snapshots/) and 'parent.relativePath' points at wrong local POM @ org.apache.maven.plugin.rresource.it.mrr41:parent:[unknown-version], F:\jenkins\jenkins-slave\workspace\rces-plugin_MRRESOURCES-103-OWZ3HFZ43MS4CUVJZUVLTQDPH6VF24RFDOZDFCITEPHO3WVUHWJQ\m\target\test-classes\run-only-at-execution-root\pom.xml, line 24, column 11
[FATAL] Non-resolvable parent POM for org.apache.maven.plugin.rresource.it.mrr41:parent:[unknown-version]: Failure to find org.apache.maven.plugin.rresource.it:it-parent:pom:1.6-SNAPSHOT in http://repository.apache.org/snapshots/ was cached in the local repository, resolution will not be reattempted until the update interval of apache-snapshots has elapsed or updates are forced and 'parent.relativePath' points at wrong local POM @ org.apache.maven.plugin.rresource.it.mrr41:parent:[unknown-version], F:\jenkins\jenkins-slave\workspace\rces-plugin_MRRESOURCES-103-OWZ3HFZ43MS4CUVJZUVLTQDPH6VF24RFDOZDFCITEPHO3WVUHWJQ\m\target\test-classes\run-only-at-execution-root\pom.xml, line 24, column 11

	at org.apache.maven.project.DefaultProjectBuilder.build(DefaultProjectBuilder.java:382)
	at org.apache.maven.graph.DefaultGraphBuilder.collectProjects(DefaultGraphBuilder.java:400)
	at org.apache.maven.graph.DefaultGraphBuilder.getProjectsForMavenReactor(DefaultGraphBuilder.java:391)
	at org.apache.maven.graph.DefaultGraphBuilder.build(DefaultGraphBuilder.java:78)
	at org.apache.maven.DefaultMaven.buildGraph(DefaultMaven.java:511)
	at org.apache.maven.DefaultMaven.doExecute(DefaultMaven.java:221)
	at org.apache.maven.DefaultMaven.doExecute(DefaultMaven.java:194)
	at org.apache.maven.DefaultMaven.execute(DefaultMaven.java:107)
	at org.apache.maven.cli.MavenCli.execute(MavenCli.java:993)
	at org.apache.maven.cli.MavenCli.doMain(MavenCli.java:345)
	at org.apache.maven.cli.MavenCli.main(MavenCli.java:191)
	at sun.reflect.NativeMethodAccessorImpl.invoke0(Native Method)
	at sun.reflect.NativeMethodAccessorImpl.invoke(NativeMethodAccessorImpl.java:62)
	at sun.reflect.DelegatingMethodAccessorImpl.invoke(DelegatingMethodAccessorImpl.java:43)
	at java.lang.reflect.Method.invoke(Method.java:498)
	at org.codehaus.plexus.classworlds.launcher.Launcher.launchEnhanced(Launcher.java:289)
	at org.codehaus.plexus.classworlds.launcher.Launcher.launch(Launcher.java:229)
	at org.codehaus.plexus.classworlds.launcher.Launcher.mainWithExitCode(Launcher.java:415)
	at org.codehaus.plexus.classworlds.launcher.Launcher.main(Launcher.java:356)
[ERROR]   
[ERROR]   The project org.apache.maven.plugin.rresource.it.mrr41:child-1:[unknown-version] (F:\jenkins\jenkins-slave\workspace\rces-plugin_MRRESOURCES-103-OWZ3HFZ43MS4CUVJZUVLTQDPH6VF24RFDOZDFCITEPHO3WVUHWJQ\m\target\test-classes\run-only-at-execution-root\child1\pom.xml) has 1 error
[ERROR]     Non-resolvable parent POM for org.apache.maven.plugin.rresource.it.mrr41:parent:[unknown-version]: Could not find artifact org.apache.maven.plugin.rresource.it:it-parent:pom:1.6-SNAPSHOT in apache-snapshots (http://repository.apache.org/snapshots/) and 'parent.relativePath' points at wrong local POM @ org.apache.maven.plugin.rresource.it.mrr41:parent:[unknown-version], F:\jenkins\jenkins-slave\workspace\rces-plugin_MRRESOURCES-103-OWZ3HFZ43MS4CUVJZUVLTQDPH6VF24RFDOZDFCITEPHO3WVUHWJQ\m\target\test-classes\run-only-at-execution-root\pom.xml, line 24, column 11 -> [Help 2]
org.apache.maven.model.resolution.UnresolvableModelException: Could not find artifact org.apache.maven.plugin.rresource.it:it-parent:pom:1.6-SNAPSHOT in apache-snapshots (http://repository.apache.org/snapshots/)
	at org.apache.maven.project.ProjectModelResolver.resolveModel(ProjectModelResolver.java:197)
	at org.apache.maven.project.ProjectModelResolver.resolveModel(ProjectModelResolver.java:243)
	at org.apache.maven.model.building.DefaultModelBuilder.readParentExternally(DefaultModelBuilder.java:1051)
	at org.apache.maven.model.building.DefaultModelBuilder.readParent(DefaultModelBuilder.java:851)
	at org.apache.maven.model.building.DefaultModelBuilder.build(DefaultModelBuilder.java:331)
	at org.apache.maven.project.DefaultProjectBuilder.build(DefaultProjectBuilder.java:429)
	at org.apache.maven.project.DefaultProjectBuilder.build(DefaultProjectBuilder.java:398)
	at org.apache.maven.project.DefaultProjectBuilder.build(DefaultProjectBuilder.java:515)
	at org.apache.maven.project.DefaultProjectBuilder.build(DefaultProjectBuilder.java:398)
	at org.apache.maven.project.DefaultProjectBuilder.build(DefaultProjectBuilder.java:361)
	at org.apache.maven.graph.DefaultGraphBuilder.collectProjects(DefaultGraphBuilder.java:400)
	at org.apache.maven.graph.DefaultGraphBuilder.getProjectsForMavenReactor(DefaultGraphBuilder.java:391)
	at org.apache.maven.graph.DefaultGraphBuilder.build(DefaultGraphBuilder.java:78)
	at org.apache.maven.DefaultMaven.buildGraph(DefaultMaven.java:511)
	at org.apache.maven.DefaultMaven.doExecute(DefaultMaven.java:221)
	at org.apache.maven.DefaultMaven.doExecute(DefaultMaven.java:194)
	at org.apache.maven.DefaultMaven.execute(DefaultMaven.java:107)
	at org.apache.maven.cli.MavenCli.execute(MavenCli.java:993)
	at org.apache.maven.cli.MavenCli.doMain(MavenCli.java:345)
	at org.apache.maven.cli.MavenCli.main(MavenCli.java:191)
	at sun.reflect.NativeMethodAccessorImpl.invoke0(Native Method)
	at sun.reflect.NativeMethodAccessorImpl.invoke(NativeMethodAccessorImpl.java:62)
	at sun.reflect.DelegatingMethodAccessorImpl.invoke(DelegatingMethodAccessorImpl.java:43)
	at java.lang.reflect.Method.invoke(Method.java:498)
	at org.codehaus.plexus.classworlds.launcher.Launcher.launchEnhanced(Launcher.java:289)
	at org.codehaus.plexus.classworlds.launcher.Launcher.launch(Launcher.java:229)
	at org.codehaus.plexus.classworlds.launcher.Launcher.mainWithExitCode(Launcher.java:415)
	at org.codehaus.plexus.classworlds.launcher.Launcher.main(Launcher.java:356)
Caused by: org.eclipse.aether.resolution.ArtifactResolutionException: Could not find artifact org.apache.maven.plugin.rresource.it:it-parent:pom:1.6-SNAPSHOT in apache-snapshots (http://repository.apache.org/snapshots/)
	at org.eclipse.aether.internal.impl.DefaultArtifactResolver.resolve(DefaultArtifactResolver.java:453)
	at org.eclipse.aether.internal.impl.DefaultArtifactResolver.resolveArtifacts(DefaultArtifactResolver.java:255)
	at org.eclipse.aether.internal.impl.DefaultArtifactResolver.resolveArtifact(DefaultArtifactResolver.java:232)
	at org.eclipse.aether.internal.impl.DefaultRepositorySystem.resolveArtifact(DefaultRepositorySystem.java:303)
	at org.apache.maven.project.ProjectModelResolver.resolveModel(ProjectModelResolver.java:193)
	... 27 more
Caused by: org.eclipse.aether.transfer.ArtifactNotFoundException: Could not find artifact org.apache.maven.plugin.rresource.it:it-parent:pom:1.6-SNAPSHOT in apache-snapshots (http://repository.apache.org/snapshots/)
	at org.eclipse.aether.connector.basic.ArtifactTransportListener.transferFailed(ArtifactTransportListener.java:48)
	at org.eclipse.aether.connector.basic.BasicRepositoryConnector$TaskRunner.run(BasicRepositoryConnector.java:364)
	at org.eclipse.aether.util.concurrency.RunnableErrorForwarder$1.run(RunnableErrorForwarder.java:76)
	at org.eclipse.aether.connector.basic.BasicRepositoryConnector$DirectExecutor.execute(BasicRepositoryConnector.java:590)
	at org.eclipse.aether.connector.basic.BasicRepositoryConnector.get(BasicRepositoryConnector.java:258)
	at org.eclipse.aether.internal.impl.DefaultArtifactResolver.performDownloads(DefaultArtifactResolver.java:529)
	at org.eclipse.aether.internal.impl.DefaultArtifactResolver.resolve(DefaultArtifactResolver.java:430)
	... 31 more
[ERROR]   
[ERROR]   The project org.apache.maven.plugin.rresource.it.mrr41:child-2:[unknown-version] (F:\jenkins\jenkins-slave\workspace\rces-plugin_MRRESOURCES-103-OWZ3HFZ43MS4CUVJZUVLTQDPH6VF24RFDOZDFCITEPHO3WVUHWJQ\m\target\test-classes\run-only-at-execution-root\child2\pom.xml) has 1 error
[ERROR]     Non-resolvable parent POM for org.apache.maven.plugin.rresource.it.mrr41:parent:[unknown-version]: Failure to find org.apache.maven.plugin.rresource.it:it-parent:pom:1.6-SNAPSHOT in http://repository.apache.org/snapshots/ was cached in the local repository, resolution will not be reattempted until the update interval of apache-snapshots has elapsed or updates are forced and 'parent.relativePath' points at wrong local POM @ org.apache.maven.plugin.rresource.it.mrr41:parent:[unknown-version], F:\jenkins\jenkins-slave\workspace\rces-plugin_MRRESOURCES-103-OWZ3HFZ43MS4CUVJZUVLTQDPH6VF24RFDOZDFCITEPHO3WVUHWJQ\m\target\test-classes\run-only-at-execution-root\pom.xml, line 24, column 11 -> [Help 2]
org.apache.maven.model.resolution.UnresolvableModelException: Failure to find org.apache.maven.plugin.rresource.it:it-parent:pom:1.6-SNAPSHOT in http://repository.apache.org/snapshots/ was cached in the local repository, resolution will not be reattempted until the update interval of apache-snapshots has elapsed or updates are forced
	at org.apache.maven.project.ProjectModelResolver.resolveModel(ProjectModelResolver.java:197)
	at org.apache.maven.project.ProjectModelResolver.resolveModel(ProjectModelResolver.java:243)
	at org.apache.maven.model.building.DefaultModelBuilder.readParentExternally(DefaultModelBuilder.java:1051)
	at org.apache.maven.model.building.DefaultModelBuilder.readParent(DefaultModelBuilder.java:851)
	at org.apache.maven.model.building.DefaultModelBuilder.build(DefaultModelBuilder.java:331)
	at org.apache.maven.project.DefaultProjectBuilder.build(DefaultProjectBuilder.java:429)
	at org.apache.maven.project.DefaultProjectBuilder.build(DefaultProjectBuilder.java:398)
	at org.apache.maven.project.DefaultProjectBuilder.build(DefaultProjectBuilder.java:515)
	at org.apache.maven.project.DefaultProjectBuilder.build(DefaultProjectBuilder.java:398)
	at org.apache.maven.project.DefaultProjectBuilder.build(DefaultProjectBuilder.java:361)
	at org.apache.maven.graph.DefaultGraphBuilder.collectProjects(DefaultGraphBuilder.java:400)
	at org.apache.maven.graph.DefaultGraphBuilder.getProjectsForMavenReactor(DefaultGraphBuilder.java:391)
	at org.apache.maven.graph.DefaultGraphBuilder.build(DefaultGraphBuilder.java:78)
	at org.apache.maven.DefaultMaven.buildGraph(DefaultMaven.java:511)
	at org.apache.maven.DefaultMaven.doExecute(DefaultMaven.java:221)
	at org.apache.maven.DefaultMaven.doExecute(DefaultMaven.java:194)
	at org.apache.maven.DefaultMaven.execute(DefaultMaven.java:107)
	at org.apache.maven.cli.MavenCli.execute(MavenCli.java:993)
	at org.apache.maven.cli.MavenCli.doMain(MavenCli.java:345)
	at org.apache.maven.cli.MavenCli.main(MavenCli.java:191)
	at sun.reflect.NativeMethodAccessorImpl.invoke0(Native Method)
	at sun.reflect.NativeMethodAccessorImpl.invoke(NativeMethodAccessorImpl.java:62)
	at sun.reflect.DelegatingMethodAccessorImpl.invoke(DelegatingMethodAccessorImpl.java:43)
	at java.lang.reflect.Method.invoke(Method.java:498)
	at org.codehaus.plexus.classworlds.launcher.Launcher.launchEnhanced(Launcher.java:289)
	at org.codehaus.plexus.classworlds.launcher.Launcher.launch(Launcher.java:229)
	at org.codehaus.plexus.classworlds.launcher.Launcher.mainWithExitCode(Launcher.java:415)
	at org.codehaus.plexus.classworlds.launcher.Launcher.main(Launcher.java:356)
Caused by: org.eclipse.aether.resolution.ArtifactResolutionException: Failure to find org.apache.maven.plugin.rresource.it:it-parent:pom:1.6-SNAPSHOT in http://repository.apache.org/snapshots/ was cached in the local repository, resolution will not be reattempted until the update interval of apache-snapshots has elapsed or updates are forced
	at org.eclipse.aether.internal.impl.DefaultArtifactResolver.resolve(DefaultArtifactResolver.java:453)
	at org.eclipse.aether.internal.impl.DefaultArtifactResolver.resolveArtifacts(DefaultArtifactResolver.java:255)
	at org.eclipse.aether.internal.impl.DefaultArtifactResolver.resolveArtifact(DefaultArtifactResolver.java:232)
	at org.eclipse.aether.internal.impl.DefaultRepositorySystem.resolveArtifact(DefaultRepositorySystem.java:303)
	at org.apache.maven.project.ProjectModelResolver.resolveModel(ProjectModelResolver.java:193)
	... 27 more
Caused by: org.eclipse.aether.transfer.ArtifactNotFoundException: Failure to find org.apache.maven.plugin.rresource.it:it-parent:pom:1.6-SNAPSHOT in http://repository.apache.org/snapshots/ was cached in the local repository, resolution will not be reattempted until the update interval of apache-snapshots has elapsed or updates are forced
	at org.eclipse.aether.internal.impl.DefaultUpdateCheckManager.newException(DefaultUpdateCheckManager.java:240)
	at org.eclipse.aether.internal.impl.DefaultUpdateCheckManager.checkArtifact(DefaultUpdateCheckManager.java:192)
	at org.eclipse.aether.internal.impl.DefaultArtifactResolver.gatherDownloads(DefaultArtifactResolver.java:594)
	at org.eclipse.aether.internal.impl.DefaultArtifactResolver.performDownloads(DefaultArtifactResolver.java:512)
	at org.eclipse.aether.internal.impl.DefaultArtifactResolver.resolve(DefaultArtifactResolver.java:430)
	... 31 more
[ERROR] 
[ERROR] Re-run Maven using the -X switch to enable full debug logging.
[ERROR] 
[ERROR] For more information about the errors and possible solutions, please read the following articles:
[ERROR] [Help 1] http://cwiki.apache.org/confluence/display/MAVEN/ProjectBuildingException
[ERROR] [Help 2] http://cwiki.apache.org/confluence/display/MAVEN/UnresolvableModelException
Picked up JAVA_TOOL_OPTIONS: -Dmaven.ext.class.path="f:\jenkins\jenkins-slave\workspace\rces-plugin_MRRESOURCES-103-OWZ3HFZ43MS4CUVJZUVLTQDPH6VF24RFDOZDFCITEPHO3WVUHWJQ@tmp\withMaven11d3f1d4\pipeline-maven-spy.jar" -Dorg.jenkinsci.plugins.pipeline.maven.reportsFolder="f:\jenkins\jenkins-slave\workspace\rces-plugin_MRRESOURCES-103-OWZ3HFZ43MS4CUVJZUVLTQDPH6VF24RFDOZDFCITEPHO3WVUHWJQ@tmp\withMaven11d3f1d4" 

	at org.apache.maven.plugin.resources.remote.it.IT_RunOnlyAtExecutionRoot.test(IT_RunOnlyAtExecutionRoot.java:60)


FAILED:  org.apache.maven.plugin.resources.remote.it.IT_RunOnlyAtExecutionRoot.test

Error Message:
Exit code was non-zero: 1; command line and log = 
F:\jenkins\tools\maven\apache-maven-3.5.0\bin\mvn -e --batch-mode -Dmaven.repo.local=f:\jenkins\jenkins-slave\workspace\rces-plugin_MRRESOURCES-103-OWZ3HFZ43MS4CUVJZUVLTQDPH6VF24RFDOZDFCITEPHO3WVUHWJQ\m\target/it-repo org.apache.maven.plugins:maven-clean-plugin:clean generate-resources
Picked up JAVA_TOOL_OPTIONS: -Dmaven.ext.class.path="f:\jenkins\jenkins-slave\workspace\rces-plugin_MRRESOURCES-103-OWZ3HFZ43MS4CUVJZUVLTQDPH6VF24RFDOZDFCITEPHO3WVUHWJQ@tmp\withMaven03cd38ef\pipeline-maven-spy.jar" -Dorg.jenkinsci.plugins.pipeline.maven.reportsFolder="f:\jenkins\jenkins-slave\workspace\rces-plugin_MRRESOURCES-103-OWZ3HFZ43MS4CUVJZUVLTQDPH6VF24RFDOZDFCITEPHO3WVUHWJQ@tmp\withMaven03cd38ef" 
[INFO] [jenkins-event-spy] Jenkins Maven Event Spy is disabled
[INFO] Error stacktraces are turned on.
[INFO] Scanning for projects...
[INFO] Downloading: http://repository.apache.org/snapshots/org/apache/maven/plugin/rresource/it/it-parent/1.6-SNAPSHOT/maven-metadata.xml
[INFO] Downloading: http://repository.apache.org/snapshots/org/apache/maven/plugin/rresource/it/it-parent/1.6-SNAPSHOT/it-parent-1.6-SNAPSHOT.pom
[ERROR] [ERROR] Some problems were encountered while processing the POMs:
[FATAL] Non-resolvable parent POM for org.apache.maven.plugin.rresource.it.mrr41:parent:[unknown-version]: Could not find artifact org.apache.maven.plugin.rresource.it:it-parent:pom:1.6-SNAPSHOT in apache-snapshots (http://repository.apache.org/snapshots/) and 'parent.relativePath' points at wrong local POM @ org.apache.maven.plugin.rresource.it.mrr41:parent:[unknown-version], F:\jenkins\jenkins-slave\workspace\rces-plugin_MRRESOURCES-103-OWZ3HFZ43MS4CUVJZUVLTQDPH6VF24RFDOZDFCITEPHO3WVUHWJQ\m\target\test-classes\run-only-at-execution-root\pom.xml, line 24, column 11
[FATAL] Non-resolvable parent POM for org.apache.maven.plugin.rresource.it.mrr41:parent:[unknown-version]: Failure to find org.apache.maven.plugin.rresource.it:it-parent:pom:1.6-SNAPSHOT in http://repository.apache.org/snapshots/ was cached in the local repository, resolution will not be reattempted until the update interval of apache-snapshots has elapsed or updates are forced and 'parent.relativePath' points at wrong local POM @ org.apache.maven.plugin.rresource.it.mrr41:parent:[unknown-version], F:\jenkins\jenkins-slave\workspace\rces-plugin_MRRESOURCES-103-OWZ3HFZ43MS4CUVJZUVLTQDPH6VF24RFDOZDFCITEPHO3WVUHWJQ\m\target\test-classes\run-only-at-execution-root\pom.xml, line 24, column 11
 @ 
[ERROR] The build could not read 2 projects -> [Help 1]
org.apache.maven.project.ProjectBuildingException: Some problems were encountered while processing the POMs:
[FATAL] Non-resolvable parent POM for org.apache.maven.plugin.rresource.it.mrr41:parent:[unknown-version]: Could not find artifact org.apache.maven.plugin.rresource.it:it-parent:pom:1.6-SNAPSHOT in apache-snapshots (http://repository.apache.org/snapshots/) and 'parent.relativePath' points at wrong local POM @ org.apache.maven.plugin.rresource.it.mrr41:parent:[unknown-version], F:\jenkins\jenkins-slave\workspace\rces-plugin_MRRESOURCES-103-OWZ3HFZ43MS4CUVJZUVLTQDPH6VF24RFDOZDFCITEPHO3WVUHWJQ\m\target\test-classes\run-only-at-execution-root\pom.xml, line 24, column 11
[FATAL] Non-resolvable parent POM for org.apache.maven.plugin.rresource.it.mrr41:parent:[unknown-version]: Failure to find org.apache.maven.plugin.rresource.it:it-parent:pom:1.6-SNAPSHOT in http://repository.apache.org/snapshots/ was cached in the local repository, resolution will not be reattempted until the update interval of apache-snapshots has elapsed or updates are forced and 'parent.relativePath' points at wrong local POM @ org.apache.maven.plugin.rresource.it.mrr41:parent:[unknown-version], F:\jenkins\jenkins-slave\workspace\rces-plugin_MRRESOURCES-103-OWZ3HFZ43MS4CUVJZUVLTQDPH6VF24RFDOZDFCITEPHO3WVUHWJQ\m\target\test-classes\run-only-at-execution-root\pom.xml, line 24, column 11

 at org.apache.maven.project.DefaultProjectBuilder.build(DefaultProjectBuilder.java:382)
 at org.apache.maven.graph.DefaultGraphBuilder.collectProjects(DefaultGraphBuilder.java:400)
 at org.apache.maven.graph.DefaultGraphBuilder.getProjectsForMavenReactor(DefaultGraphBuilder.java:391)
 at org.apache.maven.graph.DefaultGraphBuilder.build(DefaultGraphBuilder.java:78)
 at org.apache.maven.DefaultMaven.buildGraph(DefaultMaven.java:511)
 at org.apache.maven.DefaultMaven.doExecute(DefaultMaven.java:221)
 at org.apache.maven.DefaultMaven.doExecute(DefaultMaven.java:194)
 at org.apache.maven.DefaultMaven.execute(DefaultMaven.java:107)
 at org.apache.maven.cli.MavenCli.execute(MavenCli.java:993)
 at org.apache.maven.cli.MavenCli.doMain(MavenCli.java:345)
 at org.apache.maven.cli.MavenCli.main(MavenCli.java:191)
 at java.base/jdk.internal.reflect.NativeMethodAccessorImpl.invoke0(Native Method)
 at java.base/jdk.internal.reflect.NativeMethodAccessorImpl.invoke(NativeMethodAccessorImpl.java:62)
 at java.base/jdk.internal.reflect.DelegatingMethodAccessorImpl.invoke(DelegatingMethodAccessorImpl.java:43)
 at java.base/java.lang.reflect.Method.invoke(Method.java:564)
 at org.codehaus.plexus.classworlds.launcher.Launcher.launchEnhanced(Launcher.java:289)
 at org.codehaus.plexus.classworlds.launcher.Launcher.launch(Launcher.java:229)
 at org.codehaus.plexus.classworlds.launcher.Launcher.mainWithExitCode(Launcher.java:415)
 at org.codehaus.plexus.classworlds.launcher.Launcher.main(Launcher.java:356)
[ERROR]   
[ERROR]   The project org.apache.maven.plugin.rresource.it.mrr41:child-1:[unknown-version] (F:\jenkins\jenkins-slave\workspace\rces-plugin_MRRESOURCES-103-OWZ3HFZ43MS4CUVJZUVLTQDPH6VF24RFDOZDFCITEPHO3WVUHWJQ\m\target\test-classes\run-only-at-execution-root\child1\pom.xml) has 1 error
[ERROR]     Non-resolvable parent POM for org.apache.maven.plugin.rresource.it.mrr41:parent:[unknown-version]: Could not find artifact org.apache.maven.plugin.rresource.it:it-parent:pom:1.6-SNAPSHOT in apache-snapshots (http://repository.apache.org/snapshots/) and 'parent.relativePath' points at wrong local POM @ org.apache.maven.plugin.rresource.it.mrr41:parent:[unknown-version], F:\jenkins\jenkins-slave\workspace\rces-plugin_MRRESOURCES-103-OWZ3HFZ43MS4CUVJZUVLTQDPH6VF24RFDOZDFCITEPHO3WVUHWJQ\m\target\test-classes\run-only-at-execution-root\pom.xml, line 24, column 11 -> [Help 2]
org.apache.maven.model.resolution.UnresolvableModelException: Could not find artifact org.apache.maven.plugin.rresource.it:it-parent:pom:1.6-SNAPSHOT in apache-snapshots (http://repository.apache.org/snapshots/)
 at org.apache.maven.project.ProjectModelResolver.resolveModel(ProjectModelResolver.java:197)
 at org.apache.maven.project.ProjectModelResolver.resolveModel(ProjectModelResolver.java:243)
 at org.apache.maven.model.building.DefaultModelBuilder.readParentExternally(DefaultModelBuilder.java:1051)
 at org.apache.maven.model.building.DefaultModelBuilder.readParent(DefaultModelBuilder.java:851)
 at org.apache.maven.model.building.DefaultModelBuilder.build(DefaultModelBuilder.java:331)
 at org.apache.maven.project.DefaultProjectBuilder.build(DefaultProjectBuilder.java:429)
 at org.apache.maven.project.DefaultProjectBuilder.build(DefaultProjectBuilder.java:398)
 at org.apache.maven.project.DefaultProjectBuilder.build(DefaultProjectBuilder.java:515)
 at org.apache.maven.project.DefaultProjectBuilder.build(DefaultProjectBuilder.java:398)
 at org.apache.maven.project.DefaultProjectBuilder.build(DefaultProjectBuilder.java:361)
 at org.apache.maven.graph.DefaultGraphBuilder.collectProjects(DefaultGraphBuilder.java:400)
 at org.apache.maven.graph.DefaultGraphBuilder.getProjectsForMavenReactor(DefaultGraphBuilder.java:391)
 at org.apache.maven.graph.DefaultGraphBuilder.build(DefaultGraphBuilder.java:78)
 at org.apache.maven.DefaultMaven.buildGraph(DefaultMaven.java:511)
 at org.apache.maven.DefaultMaven.doExecute(DefaultMaven.java:221)
 at org.apache.maven.DefaultMaven.doExecute(DefaultMaven.java:194)
 at org.apache.maven.DefaultMaven.execute(DefaultMaven.java:107)
 at org.apache.maven.cli.MavenCli.execute(MavenCli.java:993)
 at org.apache.maven.cli.MavenCli.doMain(MavenCli.java:345)
 at org.apache.maven.cli.MavenCli.main(MavenCli.java:191)
 at java.base/jdk.internal.reflect.NativeMethodAccessorImpl.invoke0(Native Method)
 at java.base/jdk.internal.reflect.NativeMethodAccessorImpl.invoke(NativeMethodAccessorImpl.java:62)
 at java.base/jdk.internal.reflect.DelegatingMethodAccessorImpl.invoke(DelegatingMethodAccessorImpl.java:43)
 at java.base/java.lang.reflect.Method.invoke(Method.java:564)
 at org.codehaus.plexus.classworlds.launcher.Launcher.launchEnhanced(Launcher.java:289)
 at org.codehaus.plexus.classworlds.launcher.Launcher.launch(Launcher.java:229)
 at org.codehaus.plexus.classworlds.launcher.Launcher.mainWithExitCode(Launcher.java:415)
 at org.codehaus.plexus.classworlds.launcher.Launcher.main(Launcher.java:356)
Caused by: org.eclipse.aether.resolution.ArtifactResolutionException: Could not find artifact org.apache.maven.plugin.rresource.it:it-parent:pom:1.6-SNAPSHOT in apache-snapshots (http://repository.apache.org/snapshots/)
 at org.eclipse.aether.internal.impl.DefaultArtifactResolver.resolve(DefaultArtifactResolver.java:453)
 at org.eclipse.aether.internal.impl.DefaultArtifactResolver.resolveArtifacts(DefaultArtifactResolver.java:255)
 at org.eclipse.aether.internal.impl.DefaultArtifactResolver.resolveArtifact(DefaultArtifactResolver.java:232)
 at org.eclipse.aether.internal.impl.DefaultRepositorySystem.resolveArtifact(DefaultRepositorySystem.java:303)
 at org.apache.maven.project.ProjectModelResolver.resolveModel(ProjectModelResolver.java:193)
 ... 27 more
Caused by: org.eclipse.aether.transfer.ArtifactNotFoundException: Could not find artifact org.apache.maven.plugin.rresource.it:it-parent:pom:1.6-SNAPSHOT in apache-snapshots (http://repository.apache.org/snapshots/)
 at org.eclipse.aether.connector.basic.ArtifactTransportListener.transferFailed(ArtifactTransportListener.java:48)
 at org.eclipse.aether.connector.basic.BasicRepositoryConnector$TaskRunner.run(BasicRepositoryConnector.java:364)
 at org.eclipse.aether.util.concurrency.RunnableErrorForwarder$1.run(RunnableErrorForwarder.java:76)
 at org.eclipse.aether.connector.basic.BasicRepositoryConnector$DirectExecutor.execute(BasicRepositoryConnector.java:590)
 at org.eclipse.aether.connector.basic.BasicRepositoryConnector.get(BasicRepositoryConnector.java:258)
 at org.eclipse.aether.internal.impl.DefaultArtifactResolver.performDownloads(DefaultArtifactResolver.java:529)
 at org.eclipse.aether.internal.impl.DefaultArtifactResolver.resolve(DefaultArtifactResolver.java:430)
 ... 31 more
[ERROR]   
[ERROR]   The project org.apache.maven.plugin.rresource.it.mrr41:child-2:[unknown-version] (F:\jenkins\jenkins-slave\workspace\rces-plugin_MRRESOURCES-103-OWZ3HFZ43MS4CUVJZUVLTQDPH6VF24RFDOZDFCITEPHO3WVUHWJQ\m\target\test-classes\run-only-at-execution-root\child2\pom.xml) has 1 error
[ERROR]     Non-resolvable parent POM for org.apache.maven.plugin.rresource.it.mrr41:parent:[unknown-version]: Failure to find org.apache.maven.plugin.rresource.it:it-parent:pom:1.6-SNAPSHOT in http://repository.apache.org/snapshots/ was cached in the local repository, resolution will not be reattempted until the update interval of apache-snapshots has elapsed or updates are forced and 'parent.relativePath' points at wrong local POM @ org.apache.maven.plugin.rresource.it.mrr41:parent:[unknown-version], F:\jenkins\jenkins-slave\workspace\rces-plugin_MRRESOURCES-103-OWZ3HFZ43MS4CUVJZUVLTQDPH6VF24RFDOZDFCITEPHO3WVUHWJQ\m\target\test-classes\run-only-at-execution-root\pom.xml, line 24, column 11 -> [Help 2]
org.apache.maven.model.resolution.UnresolvableModelException: Failure to find org.apache.maven.plugin.rresource.it:it-parent:pom:1.6-SNAPSHOT in http://repository.apache.org/snapshots/ was cached in the local repository, resolution will not be reattempted until the update interval of apache-snapshots has elapsed or updates are forced
 at org.apache.maven.project.ProjectModelResolver.resolveModel(ProjectModelResolver.java:197)
 at org.apache.maven.project.ProjectModelResolver.resolveModel(ProjectModelResolver.java:243)
 at org.apache.maven.model.building.DefaultModelBuilder.readParentExternally(DefaultModelBuilder.java:1051)
 at org.apache.maven.model.building.DefaultModelBuilder.readParent(DefaultModelBuilder.java:851)
 at org.apache.maven.model.building.DefaultModelBuilder.build(DefaultModelBuilder.java:331)
 at org.apache.maven.project.DefaultProjectBuilder.build(DefaultProjectBuilder.java:429)
 at org.apache.maven.project.DefaultProjectBuilder.build(DefaultProjectBuilder.java:398)
 at org.apache.maven.project.DefaultProjectBuilder.build(DefaultProjectBuilder.java:515)
 at org.apache.maven.project.DefaultProjectBuilder.build(DefaultProjectBuilder.java:398)
 at org.apache.maven.project.DefaultProjectBuilder.build(DefaultProjectBuilder.java:361)
 at org.apache.maven.graph.DefaultGraphBuilder.collectProjects(DefaultGraphBuilder.java:400)
 at org.apache.maven.graph.DefaultGraphBuilder.getProjectsForMavenReactor(DefaultGraphBuilder.java:391)
 at org.apache.maven.graph.DefaultGraphBuilder.build(DefaultGraphBuilder.java:78)
 at org.apache.maven.DefaultMaven.buildGraph(DefaultMaven.java:511)
 at org.apache.maven.DefaultMaven.doExecute(DefaultMaven.java:221)
 at org.apache.maven.DefaultMaven.doExecute(DefaultMaven.java:194)
 at org.apache.maven.DefaultMaven.execute(DefaultMaven.java:107)
 at org.apache.maven.cli.MavenCli.execute(MavenCli.java:993)
 at org.apache.maven.cli.MavenCli.doMain(MavenCli.java:345)
 at org.apache.maven.cli.MavenCli.main(MavenCli.java:191)
 at java.base/jdk.internal.reflect.NativeMethodAccessorImpl.invoke0(Native Method)
 at java.base/jdk.internal.reflect.NativeMethodAccessorImpl.invoke(NativeMethodAccessorImpl.java:62)
 at java.base/jdk.internal.reflect.DelegatingMethodAccessorImpl.invoke(DelegatingMethodAccessorImpl.java:43)
 at java.base/java.lang.reflect.Method.invoke(Method.java:564)
 at org.codehaus.plexus.classworlds.launcher.Launcher.launchEnhanced(Launcher.java:289)
 at org.codehaus.plexus.classworlds.launcher.Launcher.launch(Launcher.java:229)
 at org.codehaus.plexus.classworlds.launcher.Launcher.mainWithExitCode(Launcher.java:415)
 at org.codehaus.plexus.classworlds.launcher.Launcher.main(Launcher.java:356)
Caused by: org.eclipse.aether.resolution.ArtifactResolutionException: Failure to find org.apache.maven.plugin.rresource.it:it-parent:pom:1.6-SNAPSHOT in http://repository.apache.org/snapshots/ was cached in the local repository, resolution will not be reattempted until the update interval of apache-snapshots has elapsed or updates are forced
 at org.eclipse.aether.internal.impl.DefaultArtifactResolver.resolve(DefaultArtifactResolver.java:453)
 at org.eclipse.aether.internal.impl.DefaultArtifactResolver.resolveArtifacts(DefaultArtifactResolver.java:255)
 at org.eclipse.aether.internal.impl.DefaultArtifactResolver.resolveArtifact(DefaultArtifactResolver.java:232)
 at org.eclipse.aether.internal.impl.DefaultRepositorySystem.resolveArtifact(DefaultRepositorySystem.java:303)
 at org.apache.maven.project.ProjectModelResolver.resolveModel(ProjectModelResolver.java:193)
 ... 27 more
Caused by: org.eclipse.aether.transfer.ArtifactNotFoundException: Failure to find org.apache.maven.plugin.rresource.it:it-parent:pom:1.6-SNAPSHOT in http://repository.apache.org/snapshots/ was cached in the local repository, resolution will not be reattempted until the update interval of apache-snapshots has elapsed or updates are forced
 at org.eclipse.aether.internal.impl.DefaultUpdateCheckManager.newException(DefaultUpdateCheckManager.java:240)
 at org.eclipse.aether.internal.impl.DefaultUpdateCheckManager.checkArtifact(DefaultUpdateCheckManager.java:192)
 at org.eclipse.aether.internal.impl.DefaultArtifactResolver.gatherDownloads(DefaultArtifactResolver.java:594)
 at org.eclipse.aether.internal.impl.DefaultArtifactResolver.performDownloads(DefaultArtifactResolver.java:512)
 at org.eclipse.aether.internal.impl.DefaultArtifactResolver.resolve(DefaultArtifactResolver.java:430)
 ... 31 more
[ERROR] 
[ERROR] Re-run Maven using the -X switch to enable full debug logging.
[ERROR] 
[ERROR] For more information about the errors and possible solutions, please read the following articles:
[ERROR] [Help 1] http://cwiki.apache.org/confluence/display/MAVEN/ProjectBuildingException
[ERROR] [Help 2] http://cwiki.apache.org/confluence/display/MAVEN/UnresolvableModelException


Stack Trace:
org.apache.maven.it.VerificationException: 
Exit code was non-zero: 1; command line and log = 
F:\jenkins\tools\maven\apache-maven-3.5.0\bin\mvn -e --batch-mode -Dmaven.repo.local=f:\jenkins\jenkins-slave\workspace\rces-plugin_MRRESOURCES-103-OWZ3HFZ43MS4CUVJZUVLTQDPH6VF24RFDOZDFCITEPHO3WVUHWJQ\m\target/it-repo org.apache.maven.plugins:maven-clean-plugin:clean generate-resources
Picked up JAVA_TOOL_OPTIONS: -Dmaven.ext.class.path="f:\jenkins\jenkins-slave\workspace\rces-plugin_MRRESOURCES-103-OWZ3HFZ43MS4CUVJZUVLTQDPH6VF24RFDOZDFCITEPHO3WVUHWJQ@tmp\withMaven03cd38ef\pipeline-maven-spy.jar" -Dorg.jenkinsci.plugins.pipeline.maven.reportsFolder="f:\jenkins\jenkins-slave\workspace\rces-plugin_MRRESOURCES-103-OWZ3HFZ43MS4CUVJZUVLTQDPH6VF24RFDOZDFCITEPHO3WVUHWJQ@tmp\withMaven03cd38ef" 
[INFO] [jenkins-event-spy] Jenkins Maven Event Spy is disabled
[INFO] Error stacktraces are turned on.
[INFO] Scanning for projects...
[INFO] Downloading: http://repository.apache.org/snapshots/org/apache/maven/plugin/rresource/it/it-parent/1.6-SNAPSHOT/maven-metadata.xml
[INFO] Downloading: http://repository.apache.org/snapshots/org/apache/maven/plugin/rresource/it/it-parent/1.6-SNAPSHOT/it-parent-1.6-SNAPSHOT.pom
[ERROR] [ERROR] Some problems were encountered while processing the POMs:
[FATAL] Non-resolvable parent POM for org.apache.maven.plugin.rresource.it.mrr41:parent:[unknown-version]: Could not find artifact org.apache.maven.plugin.rresource.it:it-parent:pom:1.6-SNAPSHOT in apache-snapshots (http://repository.apache.org/snapshots/) and 'parent.relativePath' points at wrong local POM @ org.apache.maven.plugin.rresource.it.mrr41:parent:[unknown-version], F:\jenkins\jenkins-slave\workspace\rces-plugin_MRRESOURCES-103-OWZ3HFZ43MS4CUVJZUVLTQDPH6VF24RFDOZDFCITEPHO3WVUHWJQ\m\target\test-classes\run-only-at-execution-root\pom.xml, line 24, column 11
[FATAL] Non-resolvable parent POM for org.apache.maven.plugin.rresource.it.mrr41:parent:[unknown-version]: Failure to find org.apache.maven.plugin.rresource.it:it-parent:pom:1.6-SNAPSHOT in http://repository.apache.org/snapshots/ was cached in the local repository, resolution will not be reattempted until the update interval of apache-snapshots has elapsed or updates are forced and 'parent.relativePath' points at wrong local POM @ org.apache.maven.plugin.rresource.it.mrr41:parent:[unknown-version], F:\jenkins\jenkins-slave\workspace\rces-plugin_MRRESOURCES-103-OWZ3HFZ43MS4CUVJZUVLTQDPH6VF24RFDOZDFCITEPHO3WVUHWJQ\m\target\test-classes\run-only-at-execution-root\pom.xml, line 24, column 11
 @ 
[ERROR] The build could not read 2 projects -> [Help 1]
org.apache.maven.project.ProjectBuildingException: Some problems were encountered while processing the POMs:
[FATAL] Non-resolvable parent POM for org.apache.maven.plugin.rresource.it.mrr41:parent:[unknown-version]: Could not find artifact org.apache.maven.plugin.rresource.it:it-parent:pom:1.6-SNAPSHOT in apache-snapshots (http://repository.apache.org/snapshots/) and 'parent.relativePath' points at wrong local POM @ org.apache.maven.plugin.rresource.it.mrr41:parent:[unknown-version], F:\jenkins\jenkins-slave\workspace\rces-plugin_MRRESOURCES-103-OWZ3HFZ43MS4CUVJZUVLTQDPH6VF24RFDOZDFCITEPHO3WVUHWJQ\m\target\test-classes\run-only-at-execution-root\pom.xml, line 24, column 11
[FATAL] Non-resolvable parent POM for org.apache.maven.plugin.rresource.it.mrr41:parent:[unknown-version]: Failure to find org.apache.maven.plugin.rresource.it:it-parent:pom:1.6-SNAPSHOT in http://repository.apache.org/snapshots/ was cached in the local repository, resolution will not be reattempted until the update interval of apache-snapshots has elapsed or updates are forced and 'parent.relativePath' points at wrong local POM @ org.apache.maven.plugin.rresource.it.mrr41:parent:[unknown-version], F:\jenkins\jenkins-slave\workspace\rces-plugin_MRRESOURCES-103-OWZ3HFZ43MS4CUVJZUVLTQDPH6VF24RFDOZDFCITEPHO3WVUHWJQ\m\target\test-classes\run-only-at-execution-root\pom.xml, line 24, column 11

	at org.apache.maven.project.DefaultProjectBuilder.build(DefaultProjectBuilder.java:382)
	at org.apache.maven.graph.DefaultGraphBuilder.collectProjects(DefaultGraphBuilder.java:400)
	at org.apache.maven.graph.DefaultGraphBuilder.getProjectsForMavenReactor(DefaultGraphBuilder.java:391)
	at org.apache.maven.graph.DefaultGraphBuilder.build(DefaultGraphBuilder.java:78)
	at org.apache.maven.DefaultMaven.buildGraph(DefaultMaven.java:511)
	at org.apache.maven.DefaultMaven.doExecute(DefaultMaven.java:221)
	at org.apache.maven.DefaultMaven.doExecute(DefaultMaven.java:194)
	at org.apache.maven.DefaultMaven.execute(DefaultMaven.java:107)
	at org.apache.maven.cli.MavenCli.execute(MavenCli.java:993)
	at org.apache.maven.cli.MavenCli.doMain(MavenCli.java:345)
	at org.apache.maven.cli.MavenCli.main(MavenCli.java:191)
	at java.base/jdk.internal.reflect.NativeMethodAccessorImpl.invoke0(Native Method)
	at java.base/jdk.internal.reflect.NativeMethodAccessorImpl.invoke(NativeMethodAccessorImpl.java:62)
	at java.base/jdk.internal.reflect.DelegatingMethodAccessorImpl.invoke(DelegatingMethodAccessorImpl.java:43)
	at java.base/java.lang.reflect.Method.invoke(Method.java:564)
	at org.codehaus.plexus.classworlds.launcher.Launcher.launchEnhanced(Launcher.java:289)
	at org.codehaus.plexus.classworlds.launcher.Launcher.launch(Launcher.java:229)
	at org.codehaus.plexus.classworlds.launcher.Launcher.mainWithExitCode(Launcher.java:415)
	at org.codehaus.plexus.classworlds.launcher.Launcher.main(Launcher.java:356)
[ERROR]   
[ERROR]   The project org.apache.maven.plugin.rresource.it.mrr41:child-1:[unknown-version] (F:\jenkins\jenkins-slave\workspace\rces-plugin_MRRESOURCES-103-OWZ3HFZ43MS4CUVJZUVLTQDPH6VF24RFDOZDFCITEPHO3WVUHWJQ\m\target\test-classes\run-only-at-execution-root\child1\pom.xml) has 1 error
[ERROR]     Non-resolvable parent POM for org.apache.maven.plugin.rresource.it.mrr41:parent:[unknown-version]: Could not find artifact org.apache.maven.plugin.rresource.it:it-parent:pom:1.6-SNAPSHOT in apache-snapshots (http://repository.apache.org/snapshots/) and 'parent.relativePath' points at wrong local POM @ org.apache.maven.plugin.rresource.it.mrr41:parent:[unknown-version], F:\jenkins\jenkins-slave\workspace\rces-plugin_MRRESOURCES-103-OWZ3HFZ43MS4CUVJZUVLTQDPH6VF24RFDOZDFCITEPHO3WVUHWJQ\m\target\test-classes\run-only-at-execution-root\pom.xml, line 24, column 11 -> [Help 2]
org.apache.maven.model.resolution.UnresolvableModelException: Could not find artifact org.apache.maven.plugin.rresource.it:it-parent:pom:1.6-SNAPSHOT in apache-snapshots (http://repository.apache.org/snapshots/)
	at org.apache.maven.project.ProjectModelResolver.resolveModel(ProjectModelResolver.java:197)
	at org.apache.maven.project.ProjectModelResolver.resolveModel(ProjectModelResolver.java:243)
	at org.apache.maven.model.building.DefaultModelBuilder.readParentExternally(DefaultModelBuilder.java:1051)
	at org.apache.maven.model.building.DefaultModelBuilder.readParent(DefaultModelBuilder.java:851)
	at org.apache.maven.model.building.DefaultModelBuilder.build(DefaultModelBuilder.java:331)
	at org.apache.maven.project.DefaultProjectBuilder.build(DefaultProjectBuilder.java:429)
	at org.apache.maven.project.DefaultProjectBuilder.build(DefaultProjectBuilder.java:398)
	at org.apache.maven.project.DefaultProjectBuilder.build(DefaultProjectBuilder.java:515)
	at org.apache.maven.project.DefaultProjectBuilder.build(DefaultProjectBuilder.java:398)
	at org.apache.maven.project.DefaultProjectBuilder.build(DefaultProjectBuilder.java:361)
	at org.apache.maven.graph.DefaultGraphBuilder.collectProjects(DefaultGraphBuilder.java:400)
	at org.apache.maven.graph.DefaultGraphBuilder.getProjectsForMavenReactor(DefaultGraphBuilder.java:391)
	at org.apache.maven.graph.DefaultGraphBuilder.build(DefaultGraphBuilder.java:78)
	at org.apache.maven.DefaultMaven.buildGraph(DefaultMaven.java:511)
	at org.apache.maven.DefaultMaven.doExecute(DefaultMaven.java:221)
	at org.apache.maven.DefaultMaven.doExecute(DefaultMaven.java:194)
	at org.apache.maven.DefaultMaven.execute(DefaultMaven.java:107)
	at org.apache.maven.cli.MavenCli.execute(MavenCli.java:993)
	at org.apache.maven.cli.MavenCli.doMain(MavenCli.java:345)
	at org.apache.maven.cli.MavenCli.main(MavenCli.java:191)
	at java.base/jdk.internal.reflect.NativeMethodAccessorImpl.invoke0(Native Method)
	at java.base/jdk.internal.reflect.NativeMethodAccessorImpl.invoke(NativeMethodAccessorImpl.java:62)
	at java.base/jdk.internal.reflect.DelegatingMethodAccessorImpl.invoke(DelegatingMethodAccessorImpl.java:43)
	at java.base/java.lang.reflect.Method.invoke(Method.java:564)
	at org.codehaus.plexus.classworlds.launcher.Launcher.launchEnhanced(Launcher.java:289)
	at org.codehaus.plexus.classworlds.launcher.Launcher.launch(Launcher.java:229)
	at org.codehaus.plexus.classworlds.launcher.Launcher.mainWithExitCode(Launcher.java:415)
	at org.codehaus.plexus.classworlds.launcher.Launcher.main(Launcher.java:356)
Caused by: org.eclipse.aether.resolution.ArtifactResolutionException: Could not find artifact org.apache.maven.plugin.rresource.it:it-parent:pom:1.6-SNAPSHOT in apache-snapshots (http://repository.apache.org/snapshots/)
	at org.eclipse.aether.internal.impl.DefaultArtifactResolver.resolve(DefaultArtifactResolver.java:453)
	at org.eclipse.aether.internal.impl.DefaultArtifactResolver.resolveArtifacts(DefaultArtifactResolver.java:255)
	at org.eclipse.aether.internal.impl.DefaultArtifactResolver.resolveArtifact(DefaultArtifactResolver.java:232)
	at org.eclipse.aether.internal.impl.DefaultRepositorySystem.resolveArtifact(DefaultRepositorySystem.java:303)
	at org.apache.maven.project.ProjectModelResolver.resolveModel(ProjectModelResolver.java:193)
	... 27 more
Caused by: org.eclipse.aether.transfer.ArtifactNotFoundException: Could not find artifact org.apache.maven.plugin.rresource.it:it-parent:pom:1.6-SNAPSHOT in apache-snapshots (http://repository.apache.org/snapshots/)
	at org.eclipse.aether.connector.basic.ArtifactTransportListener.transferFailed(ArtifactTransportListener.java:48)
	at org.eclipse.aether.connector.basic.BasicRepositoryConnector$TaskRunner.run(BasicRepositoryConnector.java:364)
	at org.eclipse.aether.util.concurrency.RunnableErrorForwarder$1.run(RunnableErrorForwarder.java:76)
	at org.eclipse.aether.connector.basic.BasicRepositoryConnector$DirectExecutor.execute(BasicRepositoryConnector.java:590)
	at org.eclipse.aether.connector.basic.BasicRepositoryConnector.get(BasicRepositoryConnector.java:258)
	at org.eclipse.aether.internal.impl.DefaultArtifactResolver.performDownloads(DefaultArtifactResolver.java:529)
	at org.eclipse.aether.internal.impl.DefaultArtifactResolver.resolve(DefaultArtifactResolver.java:430)
	... 31 more
[ERROR]   
[ERROR]   The project org.apache.maven.plugin.rresource.it.mrr41:child-2:[unknown-version] (F:\jenkins\jenkins-slave\workspace\rces-plugin_MRRESOURCES-103-OWZ3HFZ43MS4CUVJZUVLTQDPH6VF24RFDOZDFCITEPHO3WVUHWJQ\m\target\test-classes\run-only-at-execution-root\child2\pom.xml) has 1 error
[ERROR]     Non-resolvable parent POM for org.apache.maven.plugin.rresource.it.mrr41:parent:[unknown-version]: Failure to find org.apache.maven.plugin.rresource.it:it-parent:pom:1.6-SNAPSHOT in http://repository.apache.org/snapshots/ was cached in the local repository, resolution will not be reattempted until the update interval of apache-snapshots has elapsed or updates are forced and 'parent.relativePath' points at wrong local POM @ org.apache.maven.plugin.rresource.it.mrr41:parent:[unknown-version], F:\jenkins\jenkins-slave\workspace\rces-plugin_MRRESOURCES-103-OWZ3HFZ43MS4CUVJZUVLTQDPH6VF24RFDOZDFCITEPHO3WVUHWJQ\m\target\test-classes\run-only-at-execution-root\pom.xml, line 24, column 11 -> [Help 2]
org.apache.maven.model.resolution.UnresolvableModelException: Failure to find org.apache.maven.plugin.rresource.it:it-parent:pom:1.6-SNAPSHOT in http://repository.apache.org/snapshots/ was cached in the local repository, resolution will not be reattempted until the update interval of apache-snapshots has elapsed or updates are forced
	at org.apache.maven.project.ProjectModelResolver.resolveModel(ProjectModelResolver.java:197)
	at org.apache.maven.project.ProjectModelResolver.resolveModel(ProjectModelResolver.java:243)
	at org.apache.maven.model.building.DefaultModelBuilder.readParentExternally(DefaultModelBuilder.java:1051)
	at org.apache.maven.model.building.DefaultModelBuilder.readParent(DefaultModelBuilder.java:851)
	at org.apache.maven.model.building.DefaultModelBuilder.build(DefaultModelBuilder.java:331)
	at org.apache.maven.project.DefaultProjectBuilder.build(DefaultProjectBuilder.java:429)
	at org.apache.maven.project.DefaultProjectBuilder.build(DefaultProjectBuilder.java:398)
	at org.apache.maven.project.DefaultProjectBuilder.build(DefaultProjectBuilder.java:515)
	at org.apache.maven.project.DefaultProjectBuilder.build(DefaultProjectBuilder.java:398)
	at org.apache.maven.project.DefaultProjectBuilder.build(DefaultProjectBuilder.java:361)
	at org.apache.maven.graph.DefaultGraphBuilder.collectProjects(DefaultGraphBuilder.java:400)
	at org.apache.maven.graph.DefaultGraphBuilder.getProjectsForMavenReactor(DefaultGraphBuilder.java:391)
	at org.apache.maven.graph.DefaultGraphBuilder.build(DefaultGraphBuilder.java:78)
	at org.apache.maven.DefaultMaven.buildGraph(DefaultMaven.java:511)
	at org.apache.maven.DefaultMaven.doExecute(DefaultMaven.java:221)
	at org.apache.maven.DefaultMaven.doExecute(DefaultMaven.java:194)
	at org.apache.maven.DefaultMaven.execute(DefaultMaven.java:107)
	at org.apache.maven.cli.MavenCli.execute(MavenCli.java:993)
	at org.apache.maven.cli.MavenCli.doMain(MavenCli.java:345)
	at org.apache.maven.cli.MavenCli.main(MavenCli.java:191)
	at java.base/jdk.internal.reflect.NativeMethodAccessorImpl.invoke0(Native Method)
	at java.base/jdk.internal.reflect.NativeMethodAccessorImpl.invoke(NativeMethodAccessorImpl.java:62)
	at java.base/jdk.internal.reflect.DelegatingMethodAccessorImpl.invoke(DelegatingMethodAccessorImpl.java:43)
	at java.base/java.lang.reflect.Method.invoke(Method.java:564)
	at org.codehaus.plexus.classworlds.launcher.Launcher.launchEnhanced(Launcher.java:289)
	at org.codehaus.plexus.classworlds.launcher.Launcher.launch(Launcher.java:229)
	at org.codehaus.plexus.classworlds.launcher.Launcher.mainWithExitCode(Launcher.java:415)
	at org.codehaus.plexus.classworlds.launcher.Launcher.main(Launcher.java:356)
Caused by: org.eclipse.aether.resolution.ArtifactResolutionException: Failure to find org.apache.maven.plugin.rresource.it:it-parent:pom:1.6-SNAPSHOT in http://repository.apache.org/snapshots/ was cached in the local repository, resolution will not be reattempted until the update interval of apache-snapshots has elapsed or updates are forced
	at org.eclipse.aether.internal.impl.DefaultArtifactResolver.resolve(DefaultArtifactResolver.java:453)
	at org.eclipse.aether.internal.impl.DefaultArtifactResolver.resolveArtifacts(DefaultArtifactResolver.java:255)
	at org.eclipse.aether.internal.impl.DefaultArtifactResolver.resolveArtifact(DefaultArtifactResolver.java:232)
	at org.eclipse.aether.internal.impl.DefaultRepositorySystem.resolveArtifact(DefaultRepositorySystem.java:303)
	at org.apache.maven.project.ProjectModelResolver.resolveModel(ProjectModelResolver.java:193)
	... 27 more
Caused by: org.eclipse.aether.transfer.ArtifactNotFoundException: Failure to find org.apache.maven.plugin.rresource.it:it-parent:pom:1.6-SNAPSHOT in http://repository.apache.org/snapshots/ was cached in the local repository, resolution will not be reattempted until the update interval of apache-snapshots has elapsed or updates are forced
	at org.eclipse.aether.internal.impl.DefaultUpdateCheckManager.newException(DefaultUpdateCheckManager.java:240)
	at org.eclipse.aether.internal.impl.DefaultUpdateCheckManager.checkArtifact(DefaultUpdateCheckManager.java:192)
	at org.eclipse.aether.internal.impl.DefaultArtifactResolver.gatherDownloads(DefaultArtifactResolver.java:594)
	at org.eclipse.aether.internal.impl.DefaultArtifactResolver.performDownloads(DefaultArtifactResolver.java:512)
	at org.eclipse.aether.internal.impl.DefaultArtifactResolver.resolve(DefaultArtifactResolver.java:430)
	... 31 more
[ERROR] 
[ERROR] Re-run Maven using the -X switch to enable full debug logging.
[ERROR] 
[ERROR] For more information about the errors and possible solutions, please read the following articles:
[ERROR] [Help 1] http://cwiki.apache.org/confluence/display/MAVEN/ProjectBuildingException
[ERROR] [Help 2] http://cwiki.apache.org/confluence/display/MAVEN/UnresolvableModelException

	at org.apache.maven.plugin.resources.remote.it.IT_RunOnlyAtExecutionRoot.test(IT_RunOnlyAtExecutionRoot.java:60)




Build log:
[...truncated 1.40 MB...]
[windows-jdk9] [INFO] 
[windows-jdk9] [INFO] Results:
[windows-jdk9] [INFO] 
[windows-jdk9] [INFO] Tests run: 10, Failures: 0, Errors: 0, Skipped: 0
[windows-jdk9] [INFO] 
[windows-jdk9] [INFO] 
[windows-jdk9] [INFO] --- maven-jar-plugin:3.0.2:jar (default-jar) @ maven-remote-resources-plugin ---
[windows-jdk9] [INFO] Building jar: f:\jenkins\jenkins-slave\workspace\rces-plugin_MRRESOURCES-103-OWZ3HFZ43MS4CUVJZUVLTQDPH6VF24RFDOZDFCITEPHO3WVUHWJQ\m\target\maven-remote-resources-plugin-1.6-SNAPSHOT.jar
[windows-jdk9] [INFO] 
[windows-jdk9] [INFO] --- maven-plugin-plugin:3.5.1:addPluginArtifactMetadata (default-addPluginArtifactMetadata) @ maven-remote-resources-plugin ---
[windows-jdk9] [INFO] 
[windows-jdk9] [INFO] --- maven-site-plugin:3.7:attach-descriptor (attach-descriptor) @ maven-remote-resources-plugin ---
[windows-jdk9] [INFO] Skipping because packaging 'maven-plugin' is not pom.
[windows-jdk9] [INFO] 
[windows-jdk9] [INFO] --- maven-invoker-plugin:3.0.1:install (integration-test) @ maven-remote-resources-plugin ---
[windows-jdk9] [INFO] Installing f:\jenkins\jenkins-slave\workspace\rces-plugin_MRRESOURCES-103-OWZ3HFZ43MS4CUVJZUVLTQDPH6VF24RFDOZDFCITEPHO3WVUHWJQ\m\pom.xml to f:\jenkins\jenkins-slave\workspace\rces-plugin_MRRESOURCES-103-OWZ3HFZ43MS4CUVJZUVLTQDPH6VF24RFDOZDFCITEPHO3WVUHWJQ\m\target\local-repo\org\apache\maven\plugins\maven-remote-resources-plugin\1.6-SNAPSHOT\maven-remote-resources-plugin-1.6-SNAPSHOT.pom
[windows-jdk9] [INFO] Installing f:\jenkins\jenkins-slave\workspace\rces-plugin_MRRESOURCES-103-OWZ3HFZ43MS4CUVJZUVLTQDPH6VF24RFDOZDFCITEPHO3WVUHWJQ\m\target\maven-remote-resources-plugin-1.6-SNAPSHOT.jar to f:\jenkins\jenkins-slave\workspace\rces-plugin_MRRESOURCES-103-OWZ3HFZ43MS4CUVJZUVLTQDPH6VF24RFDOZDFCITEPHO3WVUHWJQ\m\target\local-repo\org\apache\maven\plugins\maven-remote-resources-plugin\1.6-SNAPSHOT\maven-remote-resources-plugin-1.6-SNAPSHOT.jar
[windows-jdk9] [INFO] 
[windows-jdk9] [INFO] --- maven-invoker-plugin:3.0.1:install (install-descriptor) @ maven-remote-resources-plugin ---
[windows-jdk9] [INFO] Installing f:\jenkins\jenkins-slave\workspace\rces-plugin_MRRESOURCES-103-OWZ3HFZ43MS4CUVJZUVLTQDPH6VF24RFDOZDFCITEPHO3WVUHWJQ\m\pom.xml to f:\jenkins\jenkins-slave\workspace\rces-plugin_MRRESOURCES-103-OWZ3HFZ43MS4CUVJZUVLTQDPH6VF24RFDOZDFCITEPHO3WVUHWJQ\m\target\it-repo\org\apache\maven\plugins\maven-remote-resources-plugin\1.6-SNAPSHOT\maven-remote-resources-plugin-1.6-SNAPSHOT.pom
[windows-jdk9] [INFO] Installing f:\jenkins\jenkins-slave\workspace\rces-plugin_MRRESOURCES-103-OWZ3HFZ43MS4CUVJZUVLTQDPH6VF24RFDOZDFCITEPHO3WVUHWJQ\m\target\maven-remote-resources-plugin-1.6-SNAPSHOT.jar to f:\jenkins\jenkins-slave\workspace\rces-plugin_MRRESOURCES-103-OWZ3HFZ43MS4CUVJZUVLTQDPH6VF24RFDOZDFCITEPHO3WVUHWJQ\m\target\it-repo\org\apache\maven\plugins\maven-remote-resources-plugin\1.6-SNAPSHOT\maven-remote-resources-plugin-1.6-SNAPSHOT.jar
[windows-jdk9] [INFO] 
[windows-jdk9] [INFO] --- maven-failsafe-plugin:2.20.1:integration-test (integration-tests) @ maven-remote-resources-plugin ---
[windows-jdk9] [INFO] 
[windows-jdk9] [INFO] -------------------------------------------------------
[windows-jdk9] [INFO]  T E S T S
[windows-jdk9] [INFO] -------------------------------------------------------
[windows-jdk9] [INFO] Running org.apache.maven.plugin.resources.remote.it.IT_BadDependencyPoms
[windows-jdk9] [INFO] Tests run: 1, Failures: 0, Errors: 0, Skipped: 0, Time elapsed: 14.97 s - in org.apache.maven.plugin.resources.remote.it.IT_BadDependencyPoms
[windows-jdk9] [INFO] Running org.apache.maven.plugin.resources.remote.it.IT_CustomFilterDelimiter
[windows-jdk9] [INFO] Tests run: 1, Failures: 0, Errors: 0, Skipped: 0, Time elapsed: 2.326 s - in org.apache.maven.plugin.resources.remote.it.IT_CustomFilterDelimiter
[windows-jdk9] [INFO] Running org.apache.maven.plugin.resources.remote.it.IT_FilterLocalOverride
[windows-jdk9] [INFO] Tests run: 1, Failures: 0, Errors: 0, Skipped: 0, Time elapsed: 2.298 s - in org.apache.maven.plugin.resources.remote.it.IT_FilterLocalOverride
[windows-jdk9] [INFO] Running org.apache.maven.plugin.resources.remote.it.IT_GenerateFromBundle
[windows-jdk9] [INFO] Tests run: 1, Failures: 0, Errors: 0, Skipped: 0, Time elapsed: 2.328 s - in org.apache.maven.plugin.resources.remote.it.IT_GenerateFromBundle
[windows-jdk9] [INFO] Running org.apache.maven.plugin.resources.remote.it.IT_GenerateFromBundleWithTypeAndClassifier
[windows-jdk9] [INFO] Tests run: 1, Failures: 0, Errors: 0, Skipped: 0, Time elapsed: 2.304 s - in org.apache.maven.plugin.resources.remote.it.IT_GenerateFromBundleWithTypeAndClassifier
[windows-jdk9] [INFO] Running org.apache.maven.plugin.resources.remote.it.IT_GenerateFromOverride
[windows-jdk9] [INFO] Tests run: 1, Failures: 0, Errors: 0, Skipped: 0, Time elapsed: 2.308 s - in org.apache.maven.plugin.resources.remote.it.IT_GenerateFromOverride
[windows-jdk9] [INFO] Running org.apache.maven.plugin.resources.remote.it.IT_GetDependencyProjects
[windows-jdk9] [INFO] Tests run: 1, Failures: 0, Errors: 0, Skipped: 0, Time elapsed: 5.878 s - in org.apache.maven.plugin.resources.remote.it.IT_GetDependencyProjects
[windows-jdk9] [INFO] Running org.apache.maven.plugin.resources.remote.it.IT_RunOnlyAtExecutionRoot
[windows-jdk9] [ERROR] Tests run: 1, Failures: 0, Errors: 1, Skipped: 0, Time elapsed: 5.759 s <<< FAILURE! - in org.apache.maven.plugin.resources.remote.it.IT_RunOnlyAtExecutionRoot
[windows-jdk9] [ERROR] test(org.apache.maven.plugin.resources.remote.it.IT_RunOnlyAtExecutionRoot)  Time elapsed: 5.758 s  <<< ERROR!
[windows-jdk9] org.apache.maven.it.VerificationException: 
[windows-jdk9] Exit code was non-zero: 1; command line and log = 
[windows-jdk9] F:\jenkins\tools\maven\apache-maven-3.5.0\bin\mvn -e --batch-mode -Dmaven.repo.local=f:\jenkins\jenkins-slave\workspace\rces-plugin_MRRESOURCES-103-OWZ3HFZ43MS4CUVJZUVLTQDPH6VF24RFDOZDFCITEPHO3WVUHWJQ\m\target/it-repo org.apache.maven.plugins:maven-clean-plugin:clean generate-resources
[windows-jdk9] Picked up JAVA_TOOL_OPTIONS: -Dmaven.ext.class.path="f:\jenkins\jenkins-slave\workspace\rces-plugin_MRRESOURCES-103-OWZ3HFZ43MS4CUVJZUVLTQDPH6VF24RFDOZDFCITEPHO3WVUHWJQ@tmp\withMaven03cd38ef\pipeline-maven-spy.jar" -Dorg.jenkinsci.plugins.pipeline.maven.reportsFolder="f:\jenkins\jenkins-slave\workspace\rces-plugin_MRRESOURCES-103-OWZ3HFZ43MS4CUVJZUVLTQDPH6VF24RFDOZDFCITEPHO3WVUHWJQ@tmp\withMaven03cd38ef" 
[windows-jdk9] [INFO] [jenkins-event-spy] Jenkins Maven Event Spy is disabled
[windows-jdk9] [INFO] Error stacktraces are turned on.
[windows-jdk9] [INFO] Scanning for projects...
[windows-jdk9] [INFO] Downloading: http://repository.apache.org/snapshots/org/apache/maven/plugin/rresource/it/it-parent/1.6-SNAPSHOT/maven-metadata.xml
[windows-jdk9] [INFO] Downloading: http://repository.apache.org/snapshots/org/apache/maven/plugin/rresource/it/it-parent/1.6-SNAPSHOT/it-parent-1.6-SNAPSHOT.pom
[windows-jdk9] [ERROR] [ERROR] Some problems were encountered while processing the POMs:
[windows-jdk9] [FATAL] Non-resolvable parent POM for org.apache.maven.plugin.rresource.it.mrr41:parent:[unknown-version]: Could not find artifact org.apache.maven.plugin.rresource.it:it-parent:pom:1.6-SNAPSHOT in apache-snapshots (http://repository.apache.org/snapshots/) and 'parent.relativePath' points at wrong local POM @ org.apache.maven.plugin.rresource.it.mrr41:parent:[unknown-version], F:\jenkins\jenkins-slave\workspace\rces-plugin_MRRESOURCES-103-OWZ3HFZ43MS4CUVJZUVLTQDPH6VF24RFDOZDFCITEPHO3WVUHWJQ\m\target\test-classes\run-only-at-execution-root\pom.xml, line 24, column 11
[windows-jdk9] [FATAL] Non-resolvable parent POM for org.apache.maven.plugin.rresource.it.mrr41:parent:[unknown-version]: Failure to find org.apache.maven.plugin.rresource.it:it-parent:pom:1.6-SNAPSHOT in http://repository.apache.org/snapshots/ was cached in the local repository, resolution will not be reattempted until the update interval of apache-snapshots has elapsed or updates are forced and 'parent.relativePath' points at wrong local POM @ org.apache.maven.plugin.rresource.it.mrr41:parent:[unknown-version], F:\jenkins\jenkins-slave\workspace\rces-plugin_MRRESOURCES-103-OWZ3HFZ43MS4CUVJZUVLTQDPH6VF24RFDOZDFCITEPHO3WVUHWJQ\m\target\test-classes\run-only-at-execution-root\pom.xml, line 24, column 11
[windows-jdk9]  @ 
[windows-jdk9] [ERROR] The build could not read 2 projects -> [Help 1]
[windows-jdk9] org.apache.maven.project.ProjectBuildingException: Some problems were encountered while processing the POMs:
[windows-jdk9] [FATAL] Non-resolvable parent POM for org.apache.maven.plugin.rresource.it.mrr41:parent:[unknown-version]: Could not find artifact org.apache.maven.plugin.rresource.it:it-parent:pom:1.6-SNAPSHOT in apache-snapshots (http://repository.apache.org/snapshots/) and 'parent.relativePath' points at wrong local POM @ org.apache.maven.plugin.rresource.it.mrr41:parent:[unknown-version], F:\jenkins\jenkins-slave\workspace\rces-plugin_MRRESOURCES-103-OWZ3HFZ43MS4CUVJZUVLTQDPH6VF24RFDOZDFCITEPHO3WVUHWJQ\m\target\test-classes\run-only-at-execution-root\pom.xml, line 24, column 11
[windows-jdk9] [FATAL] Non-resolvable parent POM for org.apache.maven.plugin.rresource.it.mrr41:parent:[unknown-version]: Failure to find org.apache.maven.plugin.rresource.it:it-parent:pom:1.6-SNAPSHOT in http://repository.apache.org/snapshots/ was cached in the local repository, resolution will not be reattempted until the update interval of apache-snapshots has elapsed or updates are forced and 'parent.relativePath' points at wrong local POM @ org.apache.maven.plugin.rresource.it.mrr41:parent:[unknown-version], F:\jenkins\jenkins-slave\workspace\rces-plugin_MRRESOURCES-103-OWZ3HFZ43MS4CUVJZUVLTQDPH6VF24RFDOZDFCITEPHO3WVUHWJQ\m\target\test-classes\run-only-at-execution-root\pom.xml, line 24, column 11
[windows-jdk9] 
[windows-jdk9] 	at org.apache.maven.project.DefaultProjectBuilder.build(DefaultProjectBuilder.java:382)
[windows-jdk9] 	at org.apache.maven.graph.DefaultGraphBuilder.collectProjects(DefaultGraphBuilder.java:400)
[windows-jdk9] 	at org.apache.maven.graph.DefaultGraphBuilder.getProjectsForMavenReactor(DefaultGraphBuilder.java:391)
[windows-jdk9] 	at org.apache.maven.graph.DefaultGraphBuilder.build(DefaultGraphBuilder.java:78)
[windows-jdk9] 	at org.apache.maven.DefaultMaven.buildGraph(DefaultMaven.java:511)
[windows-jdk9] 	at org.apache.maven.DefaultMaven.doExecute(DefaultMaven.java:221)
[windows-jdk9] 	at org.apache.maven.DefaultMaven.doExecute(DefaultMaven.java:194)
[windows-jdk9] 	at org.apache.maven.DefaultMaven.execute(DefaultMaven.java:107)
[windows-jdk9] 	at org.apache.maven.cli.MavenCli.execute(MavenCli.java:993)
[windows-jdk9] 	at org.apache.maven.cli.MavenCli.doMain(MavenCli.java:345)
[windows-jdk9] 	at org.apache.maven.cli.MavenCli.main(MavenCli.java:191)
[windows-jdk9] 	at java.base/jdk.internal.reflect.NativeMethodAccessorImpl.invoke0(Native Method)
[windows-jdk9] 	at java.base/jdk.internal.reflect.NativeMethodAccessorImpl.invoke(NativeMethodAccessorImpl.java:62)
[windows-jdk9] 	at java.base/jdk.internal.reflect.DelegatingMethodAccessorImpl.invoke(DelegatingMethodAccessorImpl.java:43)
[windows-jdk9] 	at java.base/java.lang.reflect.Method.invoke(Method.java:564)
[windows-jdk9] 	at org.codehaus.plexus.classworlds.launcher.Launcher.launchEnhanced(Launcher.java:289)
[windows-jdk9] 	at org.codehaus.plexus.classworlds.launcher.Launcher.launch(Launcher.java:229)
[windows-jdk9] 	at org.codehaus.plexus.classworlds.launcher.Launcher.mainWithExitCode(Launcher.java:415)
[windows-jdk9] 	at org.codehaus.plexus.classworlds.launcher.Launcher.main(Launcher.java:356)
[windows-jdk9] [ERROR]   
[windows-jdk9] [ERROR]   The project org.apache.maven.plugin.rresource.it.mrr41:child-1:[unknown-version] (F:\jenkins\jenkins-slave\workspace\rces-plugin_MRRESOURCES-103-OWZ3HFZ43MS4CUVJZUVLTQDPH6VF24RFDOZDFCITEPHO3WVUHWJQ\m\target\test-classes\run-only-at-execution-root\child1\pom.xml) has 1 error
[windows-jdk9] [ERROR]     Non-resolvable parent POM for org.apache.maven.plugin.rresource.it.mrr41:parent:[unknown-version]: Could not find artifact org.apache.maven.plugin.rresource.it:it-parent:pom:1.6-SNAPSHOT in apache-snapshots (http://repository.apache.org/snapshots/) and 'parent.relativePath' points at wrong local POM @ org.apache.maven.plugin.rresource.it.mrr41:parent:[unknown-version], F:\jenkins\jenkins-slave\workspace\rces-plugin_MRRESOURCES-103-OWZ3HFZ43MS4CUVJZUVLTQDPH6VF24RFDOZDFCITEPHO3WVUHWJQ\m\target\test-classes\run-only-at-execution-root\pom.xml, line 24, column 11 -> [Help 2]
[windows-jdk9] org.apache.maven.model.resolution.UnresolvableModelException: Could not find artifact org.apache.maven.plugin.rresource.it:it-parent:pom:1.6-SNAPSHOT in apache-snapshots (http://repository.apache.org/snapshots/)
[windows-jdk9] 	at org.apache.maven.project.ProjectModelResolver.resolveModel(ProjectModelResolver.java:197)
[windows-jdk9] 	at org.apache.maven.project.ProjectModelResolver.resolveModel(ProjectModelResolver.java:243)
[windows-jdk9] 	at org.apache.maven.model.building.DefaultModelBuilder.readParentExternally(DefaultModelBuilder.java:1051)
[windows-jdk9] 	at org.apache.maven.model.building.DefaultModelBuilder.readParent(DefaultModelBuilder.java:851)
[windows-jdk9] 	at org.apache.maven.model.building.DefaultModelBuilder.build(DefaultModelBuilder.java:331)
[windows-jdk9] 	at org.apache.maven.project.DefaultProjectBuilder.build(DefaultProjectBuilder.java:429)
[windows-jdk9] 	at org.apache.maven.project.DefaultProjectBuilder.build(DefaultProjectBuilder.java:398)
[windows-jdk9] 	at org.apache.maven.project.DefaultProjectBuilder.build(DefaultProjectBuilder.java:515)
[windows-jdk9] 	at org.apache.maven.project.DefaultProjectBuilder.build(DefaultProjectBuilder.java:398)
[windows-jdk9] 	at org.apache.maven.project.DefaultProjectBuilder.build(DefaultProjectBuilder.java:361)
[windows-jdk9] 	at org.apache.maven.graph.DefaultGraphBuilder.collectProjects(DefaultGraphBuilder.java:400)
[windows-jdk9] 	at org.apache.maven.graph.DefaultGraphBuilder.getProjectsForMavenReactor(DefaultGraphBuilder.java:391)
[windows-jdk9] 	at org.apache.maven.graph.DefaultGraphBuilder.build(DefaultGraphBuilder.java:78)
[windows-jdk9] 	at org.apache.maven.DefaultMaven.buildGraph(DefaultMaven.java:511)
[windows-jdk9] 	at org.apache.maven.DefaultMaven.doExecute(DefaultMaven.java:221)
[windows-jdk9] 	at org.apache.maven.DefaultMaven.doExecute(DefaultMaven.java:194)
[windows-jdk9] 	at org.apache.maven.DefaultMaven.execute(DefaultMaven.java:107)
[windows-jdk9] 	at org.apache.maven.cli.MavenCli.execute(MavenCli.java:993)
[windows-jdk9] 	at org.apache.maven.cli.MavenCli.doMain(MavenCli.java:345)
[windows-jdk9] 	at org.apache.maven.cli.MavenCli.main(MavenCli.java:191)
[windows-jdk9] 	at java.base/jdk.internal.reflect.NativeMethodAccessorImpl.invoke0(Native Method)
[windows-jdk9] 	at java.base/jdk.internal.reflect.NativeMethodAccessorImpl.invoke(NativeMethodAccessorImpl.java:62)
[windows-jdk9] 	at java.base/jdk.internal.reflect.DelegatingMethodAccessorImpl.invoke(DelegatingMethodAccessorImpl.java:43)
[windows-jdk9] 	at java.base/java.lang.reflect.Method.invoke(Method.java:564)
[windows-jdk9] 	at org.codehaus.plexus.classworlds.launcher.Launcher.launchEnhanced(Launcher.java:289)
[windows-jdk9] 	at org.codehaus.plexus.classworlds.launcher.Launcher.launch(Launcher.java:229)
[windows-jdk9] 	at org.codehaus.plexus.classworlds.launcher.Launcher.mainWithExitCode(Launcher.java:415)
[windows-jdk9] 	at org.codehaus.plexus.classworlds.launcher.Launcher.main(Launcher.java:356)
[windows-jdk9] Caused by: org.eclipse.aether.resolution.ArtifactResolutionException: Could not find artifact org.apache.maven.plugin.rresource.it:it-parent:pom:1.6-SNAPSHOT in apache-snapshots (http://repository.apache.org/snapshots/)
[windows-jdk9] 	at org.eclipse.aether.internal.impl.DefaultArtifactResolver.resolve(DefaultArtifactResolver.java:453)
[windows-jdk9] 	at org.eclipse.aether.internal.impl.DefaultArtifactResolver.resolveArtifacts(DefaultArtifactResolver.java:255)
[windows-jdk9] 	at org.eclipse.aether.internal.impl.DefaultArtifactResolver.resolveArtifact(DefaultArtifactResolver.java:232)
[windows-jdk9] 	at org.eclipse.aether.internal.impl.DefaultRepositorySystem.resolveArtifact(DefaultRepositorySystem.java:303)
[windows-jdk9] 	at org.apache.maven.project.ProjectModelResolver.resolveModel(ProjectModelResolver.java:193)
[windows-jdk9] 	... 27 more
[windows-jdk9] Caused by: org.eclipse.aether.transfer.ArtifactNotFoundException: Could not find artifact org.apache.maven.plugin.rresource.it:it-parent:pom:1.6-SNAPSHOT in apache-snapshots (http://repository.apache.org/snapshots/)
[windows-jdk9] 	at org.eclipse.aether.connector.basic.ArtifactTransportListener.transferFailed(ArtifactTransportListener.java:48)
[windows-jdk9] 	at org.eclipse.aether.connector.basic.BasicRepositoryConnector$TaskRunner.run(BasicRepositoryConnector.java:364)
[windows-jdk9] 	at org.eclipse.aether.util.concurrency.RunnableErrorForwarder$1.run(RunnableErrorForwarder.java:76)
[windows-jdk9] 	at org.eclipse.aether.connector.basic.BasicRepositoryConnector$DirectExecutor.execute(BasicRepositoryConnector.java:590)
[windows-jdk9] 	at org.eclipse.aether.connector.basic.BasicRepositoryConnector.get(BasicRepositoryConnector.java:258)
[windows-jdk9] 	at org.eclipse.aether.internal.impl.DefaultArtifactResolver.performDownloads(DefaultArtifactResolver.java:529)
[windows-jdk9] 	at org.eclipse.aether.internal.impl.DefaultArtifactResolver.resolve(DefaultArtifactResolver.java:430)
[windows-jdk9] 	... 31 more
[windows-jdk9] [ERROR]   
[windows-jdk9] [ERROR]   The project org.apache.maven.plugin.rresource.it.mrr41:child-2:[unknown-version] (F:\jenkins\jenkins-slave\workspace\rces-plugin_MRRESOURCES-103-OWZ3HFZ43MS4CUVJZUVLTQDPH6VF24RFDOZDFCITEPHO3WVUHWJQ\m\target\test-classes\run-only-at-execution-root\child2\pom.xml) has 1 error
[windows-jdk9] [ERROR]     Non-resolvable parent POM for org.apache.maven.plugin.rresource.it.mrr41:parent:[unknown-version]: Failure to find org.apache.maven.plugin.rresource.it:it-parent:pom:1.6-SNAPSHOT in http://repository.apache.org/snapshots/ was cached in the local repository, resolution will not be reattempted until the update interval of apache-snapshots has elapsed or updates are forced and 'parent.relativePath' points at wrong local POM @ org.apache.maven.plugin.rresource.it.mrr41:parent:[unknown-version], F:\jenkins\jenkins-slave\workspace\rces-plugin_MRRESOURCES-103-OWZ3HFZ43MS4CUVJZUVLTQDPH6VF24RFDOZDFCITEPHO3WVUHWJQ\m\target\test-classes\run-only-at-execution-root\pom.xml, line 24, column 11 -> [Help 2]
[windows-jdk9] org.apache.maven.model.resolution.UnresolvableModelException: Failure to find org.apache.maven.plugin.rresource.it:it-parent:pom:1.6-SNAPSHOT in http://repository.apache.org/snapshots/ was cached in the local repository, resolution will not be reattempted until the update interval of apache-snapshots has elapsed or updates are forced
[windows-jdk9] 	at org.apache.maven.project.ProjectModelResolver.resolveModel(ProjectModelResolver.java:197)
[windows-jdk9] 	at org.apache.maven.project.ProjectModelResolver.resolveModel(ProjectModelResolver.java:243)
[windows-jdk9] 	at org.apache.maven.model.building.DefaultModelBuilder.readParentExternally(DefaultModelBuilder.java:1051)
[windows-jdk9] 	at org.apache.maven.model.building.DefaultModelBuilder.readParent(DefaultModelBuilder.java:851)
[windows-jdk9] 	at org.apache.maven.model.building.DefaultModelBuilder.build(DefaultModelBuilder.java:331)
[windows-jdk9] 	at org.apache.maven.project.DefaultProjectBuilder.build(DefaultProjectBuilder.java:429)
[windows-jdk9] 	at org.apache.maven.project.DefaultProjectBuilder.build(DefaultProjectBuilder.java:398)
[windows-jdk9] 	at org.apache.maven.project.DefaultProjectBuilder.build(DefaultProjectBuilder.java:515)
[windows-jdk9] 	at org.apache.maven.project.DefaultProjectBuilder.build(DefaultProjectBuilder.java:398)
[windows-jdk9] 	at org.apache.maven.project.DefaultProjectBuilder.build(DefaultProjectBuilder.java:361)
[windows-jdk9] 	at org.apache.maven.graph.DefaultGraphBuilder.collectProjects(DefaultGraphBuilder.java:400)
[windows-jdk9] 	at org.apache.maven.graph.DefaultGraphBuilder.getProjectsForMavenReactor(DefaultGraphBuilder.java:391)
[windows-jdk9] 	at org.apache.maven.graph.DefaultGraphBuilder.build(DefaultGraphBuilder.java:78)
[windows-jdk9] 	at org.apache.maven.DefaultMaven.buildGraph(DefaultMaven.java:511)
[windows-jdk9] 	at org.apache.maven.DefaultMaven.doExecute(DefaultMaven.java:221)
[windows-jdk9] 	at org.apache.maven.DefaultMaven.doExecute(DefaultMaven.java:194)
[windows-jdk9] 	at org.apache.maven.DefaultMaven.execute(DefaultMaven.java:107)
[windows-jdk9] 	at org.apache.maven.cli.MavenCli.execute(MavenCli.java:993)
[windows-jdk9] 	at org.apache.maven.cli.MavenCli.doMain(MavenCli.java:345)
[windows-jdk9] 	at org.apache.maven.cli.MavenCli.main(MavenCli.java:191)
[windows-jdk9] 	at java.base/jdk.internal.reflect.NativeMethodAccessorImpl.invoke0(Native Method)
[windows-jdk9] 	at java.base/jdk.internal.reflect.NativeMethodAccessorImpl.invoke(NativeMethodAccessorImpl.java:62)
[windows-jdk9] 	at java.base/jdk.internal.reflect.DelegatingMethodAccessorImpl.invoke(DelegatingMethodAccessorImpl.java:43)
[windows-jdk9] 	at java.base/java.lang.reflect.Method.invoke(Method.java:564)
[windows-jdk9] 	at org.codehaus.plexus.classworlds.launcher.Launcher.launchEnhanced(Launcher.java:289)
[windows-jdk9] 	at org.codehaus.plexus.classworlds.launcher.Launcher.launch(Launcher.java:229)
[windows-jdk9] 	at org.codehaus.plexus.classworlds.launcher.Launcher.mainWithExitCode(Launcher.java:415)
[windows-jdk9] 	at org.codehaus.plexus.classworlds.launcher.Launcher.main(Launcher.java:356)
[windows-jdk9] Caused by: org.eclipse.aether.resolution.ArtifactResolutionException: Failure to find org.apache.maven.plugin.rresource.it:it-parent:pom:1.6-SNAPSHOT in http://repository.apache.org/snapshots/ was cached in the local repository, resolution will not be reattempted until the update interval of apache-snapshots has elapsed or updates are forced
[windows-jdk9] 	at org.eclipse.aether.internal.impl.DefaultArtifactResolver.resolve(DefaultArtifactResolver.java:453)
[windows-jdk9] 	at org.eclipse.aether.internal.impl.DefaultArtifactResolver.resolveArtifacts(DefaultArtifactResolver.java:255)
[windows-jdk9] 	at org.eclipse.aether.internal.impl.DefaultArtifactResolver.resolveArtifact(DefaultArtifactResolver.java:232)
[windows-jdk9] 	at org.eclipse.aether.internal.impl.DefaultRepositorySystem.resolveArtifact(DefaultRepositorySystem.java:303)
[windows-jdk9] 	at org.apache.maven.project.ProjectModelResolver.resolveModel(ProjectModelResolver.java:193)
[windows-jdk9] 	... 27 more
[windows-jdk9] Caused by: org.eclipse.aether.transfer.ArtifactNotFoundException: Failure to find org.apache.maven.plugin.rresource.it:it-parent:pom:1.6-SNAPSHOT in http://repository.apache.org/snapshots/ was cached in the local repository, resolution will not be reattempted until the update interval of apache-snapshots has elapsed or updates are forced
[windows-jdk9] 	at org.eclipse.aether.internal.impl.DefaultUpdateCheckManager.newException(DefaultUpdateCheckManager.java:240)
[windows-jdk9] 	at org.eclipse.aether.internal.impl.DefaultUpdateCheckManager.checkArtifact(DefaultUpdateCheckManager.java:192)
[windows-jdk9] 	at org.eclipse.aether.internal.impl.DefaultArtifactResolver.gatherDownloads(DefaultArtifactResolver.java:594)
[windows-jdk9] 	at org.eclipse.aether.internal.impl.DefaultArtifactResolver.performDownloads(DefaultArtifactResolver.java:512)
[windows-jdk9] 	at org.eclipse.aether.internal.impl.DefaultArtifactResolver.resolve(DefaultArtifactResolver.java:430)
[windows-jdk9] 	... 31 more
[windows-jdk9] [ERROR] 
[windows-jdk9] [ERROR] Re-run Maven using the -X switch to enable full debug logging.
[windows-jdk9] [ERROR] 
[windows-jdk9] [ERROR] For more information about the errors and possible solutions, please read the following articles:
[windows-jdk9] [ERROR] [Help 1] http://cwiki.apache.org/confluence/display/MAVEN/ProjectBuildingException
[windows-jdk9] [ERROR] [Help 2] http://cwiki.apache.org/confluence/display/MAVEN/UnresolvableModelException
[windows-jdk9] 
[windows-jdk9] 	at org.apache.maven.plugin.resources.remote.it.IT_RunOnlyAtExecutionRoot.test(IT_RunOnlyAtExecutionRoot.java:60)
[windows-jdk9] 
[windows-jdk9] [INFO] Running org.apache.maven.plugin.resources.remote.it.IT_SupplementalArtifact
[windows-jdk9] [INFO] Tests run: 1, Failures: 0, Errors: 0, Skipped: 0, Time elapsed: 7.622 s - in org.apache.maven.plugin.resources.remote.it.IT_SupplementalArtifact
[windows-jdk9] [INFO] 
[windows-jdk9] [INFO] Results:
[windows-jdk9] [INFO] 
[windows-jdk9] [ERROR] Errors: 
[windows-jdk9] [ERROR]   IT_RunOnlyAtExecutionRoot.test:60 � Verification Exit code was non-zero: 1; co...
[windows-jdk9] [INFO] 
[windows-jdk9] [ERROR] Tests run: 9, Failures: 0, Errors: 1, Skipped: 0
[windows-jdk9] [INFO] 
[windows-jdk9] [INFO] 
[windows-jdk9] [INFO] --- maven-invoker-plugin:3.0.1:integration-test (integration-test) @ maven-remote-resources-plugin ---
[windows-jdk9] [INFO] Running Setup Jobs
[windows-jdk9] [INFO] Building: maven-remote-resources-test\pom.xml
[windows-jdk9] [INFO]           maven-remote-resources-test\pom.xml .............. SUCCESS (10.4 s)
[windows-jdk9] [INFO] 
[windows-jdk9] [INFO] --- maven-checkstyle-plugin:3.0.0:check (checkstyle-check) @ maven-remote-resources-plugin ---
[windows-jdk9] [INFO] Downloading: https://repo.maven.apache.org/maven2/javax/xml/bind/jaxb-api/2.3.0/jaxb-api-2.3.0.pom
[windows-jdk9] [INFO] Downloaded: https://repo.maven.apache.org/maven2/javax/xml/bind/jaxb-api/2.3.0/jaxb-api-2.3.0.pom (23 kB at 920 kB/s)
[windows-jdk9] [INFO] Downloading: https://repo.maven.apache.org/maven2/javax/xml/bind/jaxb-api-parent/2.3.0/jaxb-api-parent-2.3.0.pom
[windows-jdk9] [INFO] Downloaded: https://repo.maven.apache.org/maven2/javax/xml/bind/jaxb-api-parent/2.3.0/jaxb-api-parent-2.3.0.pom (5.6 kB at 313 kB/s)
[windows-jdk9] [INFO] Downloading: https://repo.maven.apache.org/maven2/net/java/jvnet-parent/5/jvnet-parent-5.pom
[windows-jdk9] [INFO] Downloaded: https://repo.maven.apache.org/maven2/net/java/jvnet-parent/5/jvnet-parent-5.pom (8.9 kB at 591 kB/s)
[windows-jdk9] [INFO] Downloading: https://repo.maven.apache.org/maven2/javax/xml/bind/jaxb-api/2.3.0/jaxb-api-2.3.0.jar
[windows-jdk9] [INFO] Downloaded: https://repo.maven.apache.org/maven2/javax/xml/bind/jaxb-api/2.3.0/jaxb-api-2.3.0.jar (126 kB at 4.5 MB/s)
[windows-jdk9] [INFO] 
[windows-jdk9] [INFO] --- maven-failsafe-plugin:2.20.1:verify (integration-tests) @ maven-remote-resources-plugin ---
[windows-jdk9] [ERROR] There are test failures.
[windows-jdk9] 
[windows-jdk9] Please refer to f:\jenkins\jenkins-slave\workspace\rces-plugin_MRRESOURCES-103-OWZ3HFZ43MS4CUVJZUVLTQDPH6VF24RFDOZDFCITEPHO3WVUHWJQ\m\target\failsafe-reports for the individual test results.
[windows-jdk9] Please refer to dump files (if any exist) [date]-jvmRun[N].dump, [date].dumpstream and [date]-jvmRun[N].dumpstream.
[windows-jdk9] [INFO] 
[windows-jdk9] [INFO] --- maven-invoker-plugin:3.0.1:verify (integration-test) @ maven-remote-resources-plugin ---
[windows-jdk9] [INFO] -------------------------------------------------
[windows-jdk9] [INFO] Build Summary:
[windows-jdk9] [INFO]   Passed: 1, Failed: 0, Errors: 0, Skipped: 0
[windows-jdk9] [INFO] -------------------------------------------------
[windows-jdk9] [INFO] ------------------------------------------------------------------------
[windows-jdk9] [INFO] BUILD SUCCESS
[windows-jdk9] [INFO] ------------------------------------------------------------------------
[windows-jdk9] [INFO] Total time: 01:16 min
[windows-jdk9] [INFO] Finished at: 2018-03-17T12:25:25Z
[windows-jdk9] [INFO] Final Memory: 43M/144M
[windows-jdk9] [INFO] ------------------------------------------------------------------------
[windows-jdk9] [INFO] [jenkins-event-spy] Generated F:\jenkins\jenkins-slave\workspace\rces-plugin_MRRESOURCES-103-OWZ3HFZ43MS4CUVJZUVLTQDPH6VF24RFDOZDFCITEPHO3WVUHWJQ@tmp\withMaven03cd38ef\maven-spy-20180317-122408-831141661390385096621.log
[Pipeline] [windows-jdk9] }
[Pipeline] [windows-jdk9] // dir
[Pipeline] [windows-jdk9] }
[windows-jdk9] [withMaven] junitPublisher - Archive test results for Maven artifact org.apache.maven.plugins:maven-remote-resources-plugin:1.6-SNAPSHOT generated by maven-surefire-plugin:test (default-test): m\target\surefire-reports\*.xml
[windows-jdk9] [withMaven] junitPublisher - Jenkins JUnit Attachments Plugin not found, can't publish test attachments.Recording test results
[windows-jdk9] [withMaven] junitPublisher - Archive test results for Maven artifact org.apache.maven.plugins:maven-remote-resources-plugin:1.6-SNAPSHOT generated by maven-failsafe-plugin:integration-test (integration-tests): m\target\failsafe-reports\*.xml
[windows-jdk9] [withMaven] junitPublisher - Jenkins JUnit Attachments Plugin not found, can't publish test attachments.Recording test results
[Pipeline] [windows-jdk9] // withMaven
[Pipeline] [windows-jdk9] }
[Pipeline] [windows-jdk9] // stage
[Pipeline] [windows-jdk9] }
[Pipeline] [windows-jdk9] // node
[Pipeline] [windows-jdk9] }
[Pipeline] // parallel
[Pipeline] stage
[Pipeline] { (Notifications)
[Pipeline] echo
Build result: UNSTABLE
[Pipeline] jiraIssueSelector
[Pipeline] emailext
Mime
  • Unnamed multipart/mixed (inline, None, 0 bytes)
View raw message