maven-notifications mailing list archives

Site index · List index
Message view « Date » · « Thread »
Top « Date » · « Thread »
From Apache Jenkins Server <jenk...@builds.apache.org>
Subject Build unstable in Jenkins: Maven TLP (wip) » maven-scm » master #16
Date Sat, 03 Mar 2018 10:11:04 GMT
See https://builds.apache.org/job/maven-wip/job/maven-scm/job/master/16/

Changes:

* [SCM-862] fix apache-rat complaining about Eclipse .checkstyle files
* [SCM-862] fix apache-rat complaining about Eclipse .checkstyle files
* [SCM-862] fix apache-rat complaining about Eclipse .checkstyle files

60 tests failed.
FAILED:  org.apache.maven.scm.provider.git.gitexe.command.checkout.GitExeCheckOutCommandNoBranchTest.testCheckoutNoBranch

Error Message:
The check out result success flag was false.

Stack Trace:
junit.framework.AssertionFailedError: The check out result success flag was false.
	at org.apache.maven.scm.provider.git.gitexe.command.checkout.GitExeCheckOutCommandNoBranchTest.checkoutRepo(GitExeCheckOutCommandNoBranchTest.java:89)
	at org.apache.maven.scm.provider.git.gitexe.command.checkout.GitExeCheckOutCommandNoBranchTest.testCheckoutNoBranch(GitExeCheckOutCommandNoBranchTest.java:65)


FAILED:  org.apache.maven.scm.provider.git.gitexe.command.checkout.GitExeCheckOutCommandNoBranchTest.testDoubleCheckoutNoBranch

Error Message:
The check out result success flag was false.

Stack Trace:
junit.framework.AssertionFailedError: The check out result success flag was false.
	at org.apache.maven.scm.provider.git.gitexe.command.checkout.GitExeCheckOutCommandNoBranchTest.checkoutRepo(GitExeCheckOutCommandNoBranchTest.java:89)
	at org.apache.maven.scm.provider.git.gitexe.command.checkout.GitExeCheckOutCommandNoBranchTest.testDoubleCheckoutNoBranch(GitExeCheckOutCommandNoBranchTest.java:77)


FAILED:  org.apache.maven.scm.provider.git.gitexe.command.checkout.GitExeCheckOutCommandNoBranchTest.testCheckoutNoBranch

Error Message:
The check out result success flag was false.

Stack Trace:
junit.framework.AssertionFailedError: The check out result success flag was false.
	at org.apache.maven.scm.provider.git.gitexe.command.checkout.GitExeCheckOutCommandNoBranchTest.checkoutRepo(GitExeCheckOutCommandNoBranchTest.java:89)
	at org.apache.maven.scm.provider.git.gitexe.command.checkout.GitExeCheckOutCommandNoBranchTest.testCheckoutNoBranch(GitExeCheckOutCommandNoBranchTest.java:65)


FAILED:  org.apache.maven.scm.provider.git.gitexe.command.checkout.GitExeCheckOutCommandNoBranchTest.testDoubleCheckoutNoBranch

Error Message:
The check out result success flag was false.

Stack Trace:
junit.framework.AssertionFailedError: The check out result success flag was false.
	at org.apache.maven.scm.provider.git.gitexe.command.checkout.GitExeCheckOutCommandNoBranchTest.checkoutRepo(GitExeCheckOutCommandNoBranchTest.java:89)
	at org.apache.maven.scm.provider.git.gitexe.command.checkout.GitExeCheckOutCommandNoBranchTest.testDoubleCheckoutNoBranch(GitExeCheckOutCommandNoBranchTest.java:77)


FAILED:  org.apache.maven.scm.provider.git.jgit.command.branch.JGitBranchCommandTckTest.testBranchCommandTest

Error Message:
Exception while executing SCM command.

Stack Trace:
org.apache.maven.scm.ScmException: Exception while executing SCM command.
Caused by: org.apache.maven.scm.ScmException: JGit checkout failure!
Caused by: org.eclipse.jgit.api.errors.JGitInternalException: Exception caught during execution of fetch command
Caused by: org.eclipse.jgit.errors.NotSupportedException: URI not supported: file://2/m/maven-scm-providers/maven-scm-providers-git/maven-scm-provider-jgit/target/scm-test/repository


FAILED:  org.apache.maven.scm.provider.git.jgit.command.branch.JGitBranchCommandTckTest.testBranchCommandTest

Error Message:
Exception while executing SCM command.

Stack Trace:
org.apache.maven.scm.ScmException: Exception while executing SCM command.
Caused by: org.apache.maven.scm.ScmException: JGit checkout failure!
Caused by: org.eclipse.jgit.api.errors.JGitInternalException: Exception caught during execution of fetch command
Caused by: org.eclipse.jgit.errors.NotSupportedException: URI not supported: file://2/m/maven-scm-providers/maven-scm-providers-git/maven-scm-provider-jgit/target/scm-test/repository


FAILED:  org.apache.maven.scm.provider.git.jgit.command.changelog.JGitChangeLogCommandTckTest.testChangeLogCommand

Error Message:
Exception while executing SCM command.

Stack Trace:
org.apache.maven.scm.ScmException: Exception while executing SCM command.
Caused by: org.apache.maven.scm.ScmException: JGit checkout failure!
Caused by: org.eclipse.jgit.api.errors.JGitInternalException: Exception caught during execution of fetch command
Caused by: org.eclipse.jgit.errors.NotSupportedException: URI not supported: file://2/m/maven-scm-providers/maven-scm-providers-git/maven-scm-provider-jgit/target/scm-test/repository


FAILED:  org.apache.maven.scm.provider.git.jgit.command.changelog.JGitChangeLogCommandTckTest.testChangeLogCommand

Error Message:
Exception while executing SCM command.

Stack Trace:
org.apache.maven.scm.ScmException: Exception while executing SCM command.
Caused by: org.apache.maven.scm.ScmException: JGit checkout failure!
Caused by: org.eclipse.jgit.api.errors.JGitInternalException: Exception caught during execution of fetch command
Caused by: org.eclipse.jgit.errors.NotSupportedException: URI not supported: file://2/m/maven-scm-providers/maven-scm-providers-git/maven-scm-provider-jgit/target/scm-test/repository


FAILED:  org.apache.maven.scm.provider.git.jgit.command.checkin.JGitCheckInCommandCommitterAuthorTckTest.testCheckInCommandTest

Error Message:
Exception while executing SCM command.

Stack Trace:
org.apache.maven.scm.ScmException: Exception while executing SCM command.
	at org.apache.maven.scm.provider.git.jgit.command.checkin.JGitCheckInCommandCommitterAuthorTckTest.setUp(JGitCheckInCommandCommitterAuthorTckTest.java:60)
Caused by: org.apache.maven.scm.ScmException: JGit checkout failure!
	at org.apache.maven.scm.provider.git.jgit.command.checkin.JGitCheckInCommandCommitterAuthorTckTest.setUp(JGitCheckInCommandCommitterAuthorTckTest.java:60)
Caused by: org.eclipse.jgit.api.errors.JGitInternalException: Exception caught during execution of fetch command
	at org.apache.maven.scm.provider.git.jgit.command.checkin.JGitCheckInCommandCommitterAuthorTckTest.setUp(JGitCheckInCommandCommitterAuthorTckTest.java:60)
Caused by: org.eclipse.jgit.errors.NotSupportedException: URI not supported: file://2/m/maven-scm-providers/maven-scm-providers-git/maven-scm-provider-jgit/target/scm-test/repository
	at org.apache.maven.scm.provider.git.jgit.command.checkin.JGitCheckInCommandCommitterAuthorTckTest.setUp(JGitCheckInCommandCommitterAuthorTckTest.java:60)


FAILED:  org.apache.maven.scm.provider.git.jgit.command.checkin.JGitCheckInCommandCommitterAuthorTckTest.testCheckInCommandPartialFileset

Error Message:
Exception while executing SCM command.

Stack Trace:
org.apache.maven.scm.ScmException: Exception while executing SCM command.
	at org.apache.maven.scm.provider.git.jgit.command.checkin.JGitCheckInCommandCommitterAuthorTckTest.setUp(JGitCheckInCommandCommitterAuthorTckTest.java:60)
Caused by: org.apache.maven.scm.ScmException: JGit checkout failure!
	at org.apache.maven.scm.provider.git.jgit.command.checkin.JGitCheckInCommandCommitterAuthorTckTest.setUp(JGitCheckInCommandCommitterAuthorTckTest.java:60)
Caused by: org.eclipse.jgit.api.errors.JGitInternalException: Exception caught during execution of fetch command
	at org.apache.maven.scm.provider.git.jgit.command.checkin.JGitCheckInCommandCommitterAuthorTckTest.setUp(JGitCheckInCommandCommitterAuthorTckTest.java:60)
Caused by: org.eclipse.jgit.errors.NotSupportedException: URI not supported: file://2/m/maven-scm-providers/maven-scm-providers-git/maven-scm-provider-jgit/target/scm-test/repository
	at org.apache.maven.scm.provider.git.jgit.command.checkin.JGitCheckInCommandCommitterAuthorTckTest.setUp(JGitCheckInCommandCommitterAuthorTckTest.java:60)


FAILED:  org.apache.maven.scm.provider.git.jgit.command.checkin.JGitCheckInCommandCommitterAuthorTckTest.testCheckInCommandTest

Error Message:
Exception while executing SCM command.

Stack Trace:
org.apache.maven.scm.ScmException: Exception while executing SCM command.
	at org.apache.maven.scm.provider.git.jgit.command.checkin.JGitCheckInCommandCommitterAuthorTckTest.setUp(JGitCheckInCommandCommitterAuthorTckTest.java:60)
Caused by: org.apache.maven.scm.ScmException: JGit checkout failure!
	at org.apache.maven.scm.provider.git.jgit.command.checkin.JGitCheckInCommandCommitterAuthorTckTest.setUp(JGitCheckInCommandCommitterAuthorTckTest.java:60)
Caused by: org.eclipse.jgit.api.errors.JGitInternalException: Exception caught during execution of fetch command
	at org.apache.maven.scm.provider.git.jgit.command.checkin.JGitCheckInCommandCommitterAuthorTckTest.setUp(JGitCheckInCommandCommitterAuthorTckTest.java:60)
Caused by: org.eclipse.jgit.errors.NotSupportedException: URI not supported: file://2/m/maven-scm-providers/maven-scm-providers-git/maven-scm-provider-jgit/target/scm-test/repository
	at org.apache.maven.scm.provider.git.jgit.command.checkin.JGitCheckInCommandCommitterAuthorTckTest.setUp(JGitCheckInCommandCommitterAuthorTckTest.java:60)


FAILED:  org.apache.maven.scm.provider.git.jgit.command.checkin.JGitCheckInCommandCommitterAuthorTckTest.testCheckInCommandPartialFileset

Error Message:
Exception while executing SCM command.

Stack Trace:
org.apache.maven.scm.ScmException: Exception while executing SCM command.
	at org.apache.maven.scm.provider.git.jgit.command.checkin.JGitCheckInCommandCommitterAuthorTckTest.setUp(JGitCheckInCommandCommitterAuthorTckTest.java:60)
Caused by: org.apache.maven.scm.ScmException: JGit checkout failure!
	at org.apache.maven.scm.provider.git.jgit.command.checkin.JGitCheckInCommandCommitterAuthorTckTest.setUp(JGitCheckInCommandCommitterAuthorTckTest.java:60)
Caused by: org.eclipse.jgit.api.errors.JGitInternalException: Exception caught during execution of fetch command
	at org.apache.maven.scm.provider.git.jgit.command.checkin.JGitCheckInCommandCommitterAuthorTckTest.setUp(JGitCheckInCommandCommitterAuthorTckTest.java:60)
Caused by: org.eclipse.jgit.errors.NotSupportedException: URI not supported: file://2/m/maven-scm-providers/maven-scm-providers-git/maven-scm-provider-jgit/target/scm-test/repository
	at org.apache.maven.scm.provider.git.jgit.command.checkin.JGitCheckInCommandCommitterAuthorTckTest.setUp(JGitCheckInCommandCommitterAuthorTckTest.java:60)


FAILED:  org.apache.maven.scm.provider.git.jgit.command.checkin.JGitCheckInCommandTckTest.testCheckInCommandTest

Error Message:
Exception while executing SCM command.

Stack Trace:
org.apache.maven.scm.ScmException: Exception while executing SCM command.
Caused by: org.apache.maven.scm.ScmException: JGit checkout failure!
Caused by: org.eclipse.jgit.api.errors.JGitInternalException: Exception caught during execution of fetch command
Caused by: org.eclipse.jgit.errors.NotSupportedException: URI not supported: file://2/m/maven-scm-providers/maven-scm-providers-git/maven-scm-provider-jgit/target/scm-test/repository


FAILED:  org.apache.maven.scm.provider.git.jgit.command.checkin.JGitCheckInCommandTckTest.testCheckInCommandPartialFileset

Error Message:
Exception while executing SCM command.

Stack Trace:
org.apache.maven.scm.ScmException: Exception while executing SCM command.
Caused by: org.apache.maven.scm.ScmException: JGit checkout failure!
Caused by: org.eclipse.jgit.api.errors.JGitInternalException: Exception caught during execution of fetch command
Caused by: org.eclipse.jgit.errors.NotSupportedException: URI not supported: file://2/m/maven-scm-providers/maven-scm-providers-git/maven-scm-provider-jgit/target/scm-test/repository


FAILED:  org.apache.maven.scm.provider.git.jgit.command.checkin.JGitCheckInCommandTckTest.testCheckInCommandTest

Error Message:
Exception while executing SCM command.

Stack Trace:
org.apache.maven.scm.ScmException: Exception while executing SCM command.
Caused by: org.apache.maven.scm.ScmException: JGit checkout failure!
Caused by: org.eclipse.jgit.api.errors.JGitInternalException: Exception caught during execution of fetch command
Caused by: org.eclipse.jgit.errors.NotSupportedException: URI not supported: file://2/m/maven-scm-providers/maven-scm-providers-git/maven-scm-provider-jgit/target/scm-test/repository


FAILED:  org.apache.maven.scm.provider.git.jgit.command.checkin.JGitCheckInCommandTckTest.testCheckInCommandPartialFileset

Error Message:
Exception while executing SCM command.

Stack Trace:
org.apache.maven.scm.ScmException: Exception while executing SCM command.
Caused by: org.apache.maven.scm.ScmException: JGit checkout failure!
Caused by: org.eclipse.jgit.api.errors.JGitInternalException: Exception caught during execution of fetch command
Caused by: org.eclipse.jgit.errors.NotSupportedException: URI not supported: file://2/m/maven-scm-providers/maven-scm-providers-git/maven-scm-provider-jgit/target/scm-test/repository


FAILED:  org.apache.maven.scm.provider.git.jgit.command.checkout.JGitCheckOutCommandTckTest.testCheckOutCommandTest

Error Message:
Exception while executing SCM command.

Stack Trace:
org.apache.maven.scm.ScmException: Exception while executing SCM command.
Caused by: org.apache.maven.scm.ScmException: JGit checkout failure!
Caused by: org.eclipse.jgit.api.errors.JGitInternalException: Exception caught during execution of fetch command
Caused by: org.eclipse.jgit.errors.NotSupportedException: URI not supported: file://2/m/maven-scm-providers/maven-scm-providers-git/maven-scm-provider-jgit/target/scm-test/repository


FAILED:  org.apache.maven.scm.provider.git.jgit.command.checkout.JGitCheckOutCommandTckTest.testCheckOutCommandTest

Error Message:
Exception while executing SCM command.

Stack Trace:
org.apache.maven.scm.ScmException: Exception while executing SCM command.
Caused by: org.apache.maven.scm.ScmException: JGit checkout failure!
Caused by: org.eclipse.jgit.api.errors.JGitInternalException: Exception caught during execution of fetch command
Caused by: org.eclipse.jgit.errors.NotSupportedException: URI not supported: file://2/m/maven-scm-providers/maven-scm-providers-git/maven-scm-provider-jgit/target/scm-test/repository


FAILED:  org.apache.maven.scm.provider.git.jgit.command.diff.JGitDiffCommandTckTest.testDiffCommand

Error Message:
Exception while executing SCM command.

Stack Trace:
org.apache.maven.scm.ScmException: Exception while executing SCM command.
Caused by: org.apache.maven.scm.ScmException: JGit checkout failure!
Caused by: org.eclipse.jgit.api.errors.JGitInternalException: Exception caught during execution of fetch command
Caused by: org.eclipse.jgit.errors.NotSupportedException: URI not supported: file://2/m/maven-scm-providers/maven-scm-providers-git/maven-scm-provider-jgit/target/scm-test/repository


FAILED:  org.apache.maven.scm.provider.git.jgit.command.diff.JGitDiffCommandTckTest.testDiffCommand

Error Message:
Exception while executing SCM command.

Stack Trace:
org.apache.maven.scm.ScmException: Exception while executing SCM command.
Caused by: org.apache.maven.scm.ScmException: JGit checkout failure!
Caused by: org.eclipse.jgit.api.errors.JGitInternalException: Exception caught during execution of fetch command
Caused by: org.eclipse.jgit.errors.NotSupportedException: URI not supported: file://2/m/maven-scm-providers/maven-scm-providers-git/maven-scm-provider-jgit/target/scm-test/repository


FAILED:  org.apache.maven.scm.provider.git.jgit.command.remoteinfo.JGitRemoteInfoCommandTckTest.testRemoteInfoCommand

Error Message:
Exception while executing SCM command.

Stack Trace:
org.apache.maven.scm.ScmException: Exception while executing SCM command.
Caused by: org.apache.maven.scm.ScmException: JGit checkout failure!
Caused by: org.eclipse.jgit.api.errors.JGitInternalException: Exception caught during execution of fetch command
Caused by: org.eclipse.jgit.errors.NotSupportedException: URI not supported: file://2/m/maven-scm-providers/maven-scm-providers-git/maven-scm-provider-jgit/target/scm-test/repository


FAILED:  org.apache.maven.scm.provider.git.jgit.command.remoteinfo.JGitRemoteInfoCommandTckTest.testRemoteInfoCommand

Error Message:
Exception while executing SCM command.

Stack Trace:
org.apache.maven.scm.ScmException: Exception while executing SCM command.
Caused by: org.apache.maven.scm.ScmException: JGit checkout failure!
Caused by: org.eclipse.jgit.api.errors.JGitInternalException: Exception caught during execution of fetch command
Caused by: org.eclipse.jgit.errors.NotSupportedException: URI not supported: file://2/m/maven-scm-providers/maven-scm-providers-git/maven-scm-provider-jgit/target/scm-test/repository


FAILED:  org.apache.maven.scm.provider.git.jgit.command.status.JGitStatusCommandTckTest.testStatusCommand

Error Message:
Exception while executing SCM command.

Stack Trace:
org.apache.maven.scm.ScmException: Exception while executing SCM command.
Caused by: org.apache.maven.scm.ScmException: JGit checkout failure!
Caused by: org.eclipse.jgit.api.errors.JGitInternalException: Exception caught during execution of fetch command
Caused by: org.eclipse.jgit.errors.NotSupportedException: URI not supported: file://2/m/maven-scm-providers/maven-scm-providers-git/maven-scm-provider-jgit/target/scm-test/repository


FAILED:  org.apache.maven.scm.provider.git.jgit.command.status.JGitStatusCommandTckTest.testStatusCommand

Error Message:
Exception while executing SCM command.

Stack Trace:
org.apache.maven.scm.ScmException: Exception while executing SCM command.
Caused by: org.apache.maven.scm.ScmException: JGit checkout failure!
Caused by: org.eclipse.jgit.api.errors.JGitInternalException: Exception caught during execution of fetch command
Caused by: org.eclipse.jgit.errors.NotSupportedException: URI not supported: file://2/m/maven-scm-providers/maven-scm-providers-git/maven-scm-provider-jgit/target/scm-test/repository


FAILED:  org.apache.maven.scm.provider.git.jgit.command.tag.JGitTagCommandTckTest.testTagCommandTest

Error Message:
Exception while executing SCM command.

Stack Trace:
org.apache.maven.scm.ScmException: Exception while executing SCM command.
Caused by: org.apache.maven.scm.ScmException: JGit checkout failure!
Caused by: org.eclipse.jgit.api.errors.JGitInternalException: Exception caught during execution of fetch command
Caused by: org.eclipse.jgit.errors.NotSupportedException: URI not supported: file://2/m/maven-scm-providers/maven-scm-providers-git/maven-scm-provider-jgit/target/scm-test/repository


FAILED:  org.apache.maven.scm.provider.git.jgit.command.tag.JGitTagCommandTckTest.testTagCommandTest

Error Message:
Exception while executing SCM command.

Stack Trace:
org.apache.maven.scm.ScmException: Exception while executing SCM command.
Caused by: org.apache.maven.scm.ScmException: JGit checkout failure!
Caused by: org.eclipse.jgit.api.errors.JGitInternalException: Exception caught during execution of fetch command
Caused by: org.eclipse.jgit.errors.NotSupportedException: URI not supported: file://2/m/maven-scm-providers/maven-scm-providers-git/maven-scm-provider-jgit/target/scm-test/repository


FAILED:  org.apache.maven.scm.plugin.BranchMojoTest.testBranch

Error Message:
Command failed.The svn command failed.

Stack Trace:
org.apache.maven.plugin.MojoExecutionException: Command failed.The svn command failed.
	at org.apache.maven.scm.plugin.BranchMojoTest.setUp(BranchMojoTest.java:74)


FAILED:  org.apache.maven.scm.plugin.BranchMojoTest.testBranch

Error Message:
Command failed.The svn command failed.

Stack Trace:
org.apache.maven.plugin.MojoExecutionException: Command failed.The svn command failed.
	at org.apache.maven.scm.plugin.BranchMojoTest.setUp(BranchMojoTest.java:74)


FAILED:  org.apache.maven.scm.plugin.ChangeLogMojoTest.testChangeLogWithParameters

Error Message:
Command failed.The svn command failed.

Stack Trace:
org.apache.maven.plugin.MojoExecutionException: Command failed.The svn command failed.
	at org.apache.maven.scm.plugin.ChangeLogMojoTest.testChangeLogWithParameters(ChangeLogMojoTest.java:102)


FAILED:  org.apache.maven.scm.plugin.ChangeLogMojoTest.testChangeLog

Error Message:
Command failed.The svn command failed.

Stack Trace:
org.apache.maven.plugin.MojoExecutionException: Command failed.The svn command failed.
	at org.apache.maven.scm.plugin.ChangeLogMojoTest.testChangeLog(ChangeLogMojoTest.java:79)


FAILED:  org.apache.maven.scm.plugin.ChangeLogMojoTest.testChangeLogWithParameters

Error Message:
Command failed.The svn command failed.

Stack Trace:
org.apache.maven.plugin.MojoExecutionException: Command failed.The svn command failed.
	at org.apache.maven.scm.plugin.ChangeLogMojoTest.testChangeLogWithParameters(ChangeLogMojoTest.java:102)


FAILED:  org.apache.maven.scm.plugin.ChangeLogMojoTest.testChangeLog

Error Message:
Command failed.The svn command failed.

Stack Trace:
org.apache.maven.plugin.MojoExecutionException: Command failed.The svn command failed.
	at org.apache.maven.scm.plugin.ChangeLogMojoTest.testChangeLog(ChangeLogMojoTest.java:79)


FAILED:  org.apache.maven.scm.plugin.CheckoutMojoTest.testExcludeInclude

Error Message:
Command failed.The svn command failed.

Stack Trace:
org.apache.maven.plugin.MojoExecutionException: Command failed.The svn command failed.
	at org.apache.maven.scm.plugin.CheckoutMojoTest.testExcludeInclude(CheckoutMojoTest.java:153)


FAILED:  org.apache.maven.scm.plugin.CheckoutMojoTest.testUseExport

Error Message:
Command failed.The svn command failed.

Stack Trace:
org.apache.maven.plugin.MojoExecutionException: Command failed.The svn command failed.
	at org.apache.maven.scm.plugin.CheckoutMojoTest.testUseExport(CheckoutMojoTest.java:132)


FAILED:  org.apache.maven.scm.plugin.CheckoutMojoTest.testSkipCheckoutWithConnectionUrl

Error Message:
Command failed.The svn command failed.

Stack Trace:
org.apache.maven.plugin.MojoExecutionException: Command failed.The svn command failed.
	at org.apache.maven.scm.plugin.CheckoutMojoTest.testSkipCheckoutWithConnectionUrl(CheckoutMojoTest.java:96)


FAILED:  org.apache.maven.scm.plugin.CheckoutMojoTest.testExcludeInclude

Error Message:
Command failed.The svn command failed.

Stack Trace:
org.apache.maven.plugin.MojoExecutionException: Command failed.The svn command failed.
	at org.apache.maven.scm.plugin.CheckoutMojoTest.testExcludeInclude(CheckoutMojoTest.java:153)


FAILED:  org.apache.maven.scm.plugin.CheckoutMojoTest.testUseExport

Error Message:
Command failed.The svn command failed.

Stack Trace:
org.apache.maven.plugin.MojoExecutionException: Command failed.The svn command failed.
	at org.apache.maven.scm.plugin.CheckoutMojoTest.testUseExport(CheckoutMojoTest.java:132)


FAILED:  org.apache.maven.scm.plugin.CheckoutMojoTest.testSkipCheckoutWithConnectionUrl

Error Message:
Command failed.The svn command failed.

Stack Trace:
org.apache.maven.plugin.MojoExecutionException: Command failed.The svn command failed.
	at org.apache.maven.scm.plugin.CheckoutMojoTest.testSkipCheckoutWithConnectionUrl(CheckoutMojoTest.java:96)


FAILED:  org.apache.maven.scm.plugin.ExportMojoTest.testExcludeInclude

Error Message:
Command failed.The svn command failed.

Stack Trace:
org.apache.maven.plugin.MojoExecutionException: Command failed.The svn command failed.
	at org.apache.maven.scm.plugin.ExportMojoTest.testExcludeInclude(ExportMojoTest.java:90)


FAILED:  org.apache.maven.scm.plugin.ExportMojoTest.testExport

Error Message:
Command failed.The svn command failed.

Stack Trace:
org.apache.maven.plugin.MojoExecutionException: Command failed.The svn command failed.
	at org.apache.maven.scm.plugin.ExportMojoTest.testExport(ExportMojoTest.java:55)


FAILED:  org.apache.maven.scm.plugin.ExportMojoTest.testExcludeInclude

Error Message:
Command failed.The svn command failed.

Stack Trace:
org.apache.maven.plugin.MojoExecutionException: Command failed.The svn command failed.
	at org.apache.maven.scm.plugin.ExportMojoTest.testExcludeInclude(ExportMojoTest.java:90)


FAILED:  org.apache.maven.scm.plugin.ExportMojoTest.testExport

Error Message:
Command failed.The svn command failed.

Stack Trace:
org.apache.maven.plugin.MojoExecutionException: Command failed.The svn command failed.
	at org.apache.maven.scm.plugin.ExportMojoTest.testExport(ExportMojoTest.java:55)


FAILED:  org.apache.maven.scm.plugin.TagMojoTest.testTag

Error Message:
Command failed.The svn command failed.

Stack Trace:
org.apache.maven.plugin.MojoExecutionException: Command failed.The svn command failed.
	at org.apache.maven.scm.plugin.TagMojoTest.setUp(TagMojoTest.java:74)


FAILED:  org.apache.maven.scm.plugin.TagMojoTest.testTagWithTimestamp

Error Message:
Command failed.The svn command failed.

Stack Trace:
org.apache.maven.plugin.MojoExecutionException: Command failed.The svn command failed.
	at org.apache.maven.scm.plugin.TagMojoTest.setUp(TagMojoTest.java:74)


FAILED:  org.apache.maven.scm.plugin.TagMojoTest.testTag

Error Message:
Command failed.The svn command failed.

Stack Trace:
org.apache.maven.plugin.MojoExecutionException: Command failed.The svn command failed.
	at org.apache.maven.scm.plugin.TagMojoTest.setUp(TagMojoTest.java:74)


FAILED:  org.apache.maven.scm.plugin.TagMojoTest.testTagWithTimestamp

Error Message:
Command failed.The svn command failed.

Stack Trace:
org.apache.maven.plugin.MojoExecutionException: Command failed.The svn command failed.
	at org.apache.maven.scm.plugin.TagMojoTest.setUp(TagMojoTest.java:74)


FAILED:  org.apache.maven.scm.plugin.UpdateMojoTest.testSkipCheckoutWithConnectionUrl

Error Message:
Command failed.The svn command failed.

Stack Trace:
org.apache.maven.plugin.MojoExecutionException: Command failed.The svn command failed.
	at org.apache.maven.scm.plugin.UpdateMojoTest.testSkipCheckoutWithConnectionUrl(UpdateMojoTest.java:73)


FAILED:  org.apache.maven.scm.plugin.UpdateMojoTest.testSkipCheckoutWithConnectionUrl

Error Message:
Command failed.The svn command failed.

Stack Trace:
org.apache.maven.plugin.MojoExecutionException: Command failed.The svn command failed.
	at org.apache.maven.scm.plugin.UpdateMojoTest.testSkipCheckoutWithConnectionUrl(UpdateMojoTest.java:73)


FAILED:  org.apache.maven.scm.provider.git.gitexe.command.checkin.GitCheckInCommandNoBranchTest.testCheckinNoBranch

Error Message:
The check out result success flag was false.

Stack Trace:
junit.framework.AssertionFailedError: The check out result success flag was false.
	at org.apache.maven.scm.provider.git.gitexe.command.checkin.GitCheckInCommandNoBranchTest.testCheckinNoBranch(GitCheckInCommandNoBranchTest.java:75)


FAILED:  org.apache.maven.scm.provider.git.gitexe.command.checkin.GitCheckInCommandNoBranchTest.testCheckinNoBranch

Error Message:
The check out result success flag was false.

Stack Trace:
junit.framework.AssertionFailedError: The check out result success flag was false.
	at org.apache.maven.scm.provider.git.gitexe.command.checkin.GitCheckInCommandNoBranchTest.checkoutRepo(GitCheckInCommandNoBranchTest.java:93)
	at org.apache.maven.scm.provider.git.gitexe.command.checkin.GitCheckInCommandNoBranchTest.testCheckinNoBranch(GitCheckInCommandNoBranchTest.java:64)


FAILED:  org.apache.maven.scm.provider.git.gitexe.command.checkin.GitCheckInCommandNoBranchTest.testCheckinNoBranch

Error Message:
The check out result success flag was false.

Stack Trace:
junit.framework.AssertionFailedError: The check out result success flag was false.
	at org.apache.maven.scm.provider.git.gitexe.command.checkin.GitCheckInCommandNoBranchTest.testCheckinNoBranch(GitCheckInCommandNoBranchTest.java:75)


FAILED:  org.apache.maven.scm.provider.git.gitexe.command.checkin.GitCheckInCommandNoBranchTest.testCheckinNoBranch

Error Message:
The check out result success flag was false.

Stack Trace:
junit.framework.AssertionFailedError: The check out result success flag was false.
	at org.apache.maven.scm.provider.git.gitexe.command.checkin.GitCheckInCommandNoBranchTest.checkoutRepo(GitCheckInCommandNoBranchTest.java:93)
	at org.apache.maven.scm.provider.git.gitexe.command.checkin.GitCheckInCommandNoBranchTest.testCheckinNoBranch(GitCheckInCommandNoBranchTest.java:79)


FAILED:  org.apache.maven.scm.provider.git.gitexe.command.checkin.GitCheckInCommandNoBranchTest.testCheckinNoBranch

Error Message:
The check out result success flag was false.

Stack Trace:
junit.framework.AssertionFailedError: The check out result success flag was false.
	at org.apache.maven.scm.provider.git.gitexe.command.checkin.GitCheckInCommandNoBranchTest.checkoutRepo(GitCheckInCommandNoBranchTest.java:93)
	at org.apache.maven.scm.provider.git.gitexe.command.checkin.GitCheckInCommandNoBranchTest.testCheckinNoBranch(GitCheckInCommandNoBranchTest.java:79)


FAILED:  org.apache.maven.scm.provider.git.gitexe.command.checkin.GitCheckInCommandNoBranchTest.testCheckinNoBranch

Error Message:
The check out result success flag was false.

Stack Trace:
junit.framework.AssertionFailedError: The check out result success flag was false.
	at org.apache.maven.scm.provider.git.gitexe.command.checkin.GitCheckInCommandNoBranchTest.checkoutRepo(GitCheckInCommandNoBranchTest.java:93)
	at org.apache.maven.scm.provider.git.gitexe.command.checkin.GitCheckInCommandNoBranchTest.testCheckinNoBranch(GitCheckInCommandNoBranchTest.java:64)


FAILED:  org.apache.maven.scm.provider.git.gitexe.command.checkin.GitCheckInCommandTest.testCheckinAfterRename

Error Message:
The check out result success flag was false.

Stack Trace:
junit.framework.AssertionFailedError: The check out result success flag was false.
	at org.apache.maven.scm.provider.git.gitexe.command.checkin.GitCheckInCommandTest.testCheckinAfterRename(GitCheckInCommandTest.java:113)


FAILED:  org.apache.maven.scm.provider.git.gitexe.command.checkin.GitCheckInCommandTest.testCheckinAfterRename

Error Message:
The check out result success flag was false.

Stack Trace:
junit.framework.AssertionFailedError: The check out result success flag was false.
	at org.apache.maven.scm.provider.git.gitexe.command.checkin.GitCheckInCommandTest.checkoutRepoInto(GitCheckInCommandTest.java:143)
	at org.apache.maven.scm.provider.git.gitexe.command.checkin.GitCheckInCommandTest.testCheckinAfterRename(GitCheckInCommandTest.java:99)


FAILED:  org.apache.maven.scm.provider.git.gitexe.command.checkin.GitCheckInCommandTest.testCheckinAfterRename

Error Message:
The check out result success flag was false.

Stack Trace:
junit.framework.AssertionFailedError: The check out result success flag was false.
	at org.apache.maven.scm.provider.git.gitexe.command.checkin.GitCheckInCommandTest.testCheckinAfterRename(GitCheckInCommandTest.java:113)


FAILED:  org.apache.maven.scm.provider.git.gitexe.command.checkin.GitCheckInCommandTest.testCheckinAfterRename

Error Message:
The check out result success flag was false.

Stack Trace:
junit.framework.AssertionFailedError: The check out result success flag was false.
	at org.apache.maven.scm.provider.git.gitexe.command.checkin.GitCheckInCommandTest.checkoutRepoInto(GitCheckInCommandTest.java:143)
	at org.apache.maven.scm.provider.git.gitexe.command.checkin.GitCheckInCommandTest.testCheckinAfterRename(GitCheckInCommandTest.java:99)


FAILED:  org.apache.maven.scm.provider.git.gitexe.command.checkin.GitCheckInCommandTest.testCheckinAfterRename

Error Message:
The check out result success flag was false.

Stack Trace:
junit.framework.AssertionFailedError: The check out result success flag was false.
	at org.apache.maven.scm.provider.git.gitexe.command.checkin.GitCheckInCommandTest.checkoutRepoInto(GitCheckInCommandTest.java:143)
	at org.apache.maven.scm.provider.git.gitexe.command.checkin.GitCheckInCommandTest.testCheckinAfterRename(GitCheckInCommandTest.java:99)


FAILED:  org.apache.maven.scm.provider.git.gitexe.command.checkin.GitCheckInCommandTest.testCheckinAfterRename

Error Message:
The check out result success flag was false.

Stack Trace:
junit.framework.AssertionFailedError: The check out result success flag was false.
	at org.apache.maven.scm.provider.git.gitexe.command.checkin.GitCheckInCommandTest.checkoutRepoInto(GitCheckInCommandTest.java:143)
	at org.apache.maven.scm.provider.git.gitexe.command.checkin.GitCheckInCommandTest.testCheckinAfterRename(GitCheckInCommandTest.java:99)




Build log:
[...truncated 5.16 MB...]
[windows-jdk9] [INFO] Downloading: https://repo.maven.apache.org/maven2/org/apache/maven/doxia/doxia-modules/1.1.4/doxia-modules-1.1.4.pom
[windows-jdk9] [INFO] Downloaded: https://repo.maven.apache.org/maven2/org/apache/maven/doxia/doxia-modules/1.1.4/doxia-modules-1.1.4.pom (2.4 kB at 348 kB/s)
[windows-jdk9] [INFO] Downloading: https://repo.maven.apache.org/maven2/org/apache/maven/doxia/doxia-module-fml/1.1.4/doxia-module-fml-1.1.4.pom
[windows-jdk9] [INFO] Downloaded: https://repo.maven.apache.org/maven2/org/apache/maven/doxia/doxia-module-fml/1.1.4/doxia-module-fml-1.1.4.pom (5.5 kB at 783 kB/s)
[windows-jdk9] [INFO] Downloading: https://repo.maven.apache.org/maven2/org/codehaus/groovy/groovy-all/2.0.1/groovy-all-2.0.1.pom
[windows-jdk9] [INFO] Downloaded: https://repo.maven.apache.org/maven2/org/codehaus/groovy/groovy-all/2.0.1/groovy-all-2.0.1.pom (18 kB at 2.2 MB/s)
[windows-jdk9] [INFO] Downloading: https://repo.maven.apache.org/maven2/org/apache/maven/shared/maven-invoker/2.2/maven-invoker-2.2.jar
[windows-jdk9] [INFO] Downloading: https://repo.maven.apache.org/maven2/org/ow2/asm/asm-tree/4.0/asm-tree-4.0.jar
[windows-jdk9] [INFO] Downloading: https://repo.maven.apache.org/maven2/org/apache/maven/shared/maven-script-interpreter/1.1/maven-script-interpreter-1.1.jar
[windows-jdk9] [INFO] Downloading: https://repo.maven.apache.org/maven2/org/codehaus/groovy/groovy/2.0.1/groovy-2.0.1.jar
[windows-jdk9] [INFO] Downloading: https://repo.maven.apache.org/maven2/org/apache/maven/reporting/maven-reporting-impl/2.2/maven-reporting-impl-2.2.jar
[windows-jdk9] [INFO] Downloaded: https://repo.maven.apache.org/maven2/org/apache/maven/shared/maven-invoker/2.2/maven-invoker-2.2.jar (30 kB at 643 kB/s)
[windows-jdk9] [INFO] Downloading: https://repo.maven.apache.org/maven2/org/ow2/asm/asm-commons/4.0/asm-commons-4.0.jar
[windows-jdk9] [INFO] Downloaded: https://repo.maven.apache.org/maven2/org/apache/maven/reporting/maven-reporting-impl/2.2/maven-reporting-impl-2.2.jar (17 kB at 291 kB/s)
[windows-jdk9] [INFO] Downloading: https://repo.maven.apache.org/maven2/org/ow2/asm/asm/4.0/asm-4.0.jar
[windows-jdk9] [INFO] Downloaded: https://repo.maven.apache.org/maven2/org/ow2/asm/asm/4.0/asm-4.0.jar (46 kB at 639 kB/s)
[windows-jdk9] [INFO] Downloading: https://repo.maven.apache.org/maven2/org/ow2/asm/asm-util/4.0/asm-util-4.0.jar
[windows-jdk9] [INFO] Downloaded: https://repo.maven.apache.org/maven2/org/apache/maven/shared/maven-script-interpreter/1.1/maven-script-interpreter-1.1.jar (21 kB at 274 kB/s)
[windows-jdk9] [INFO] Downloading: https://repo.maven.apache.org/maven2/org/ow2/asm/asm-analysis/4.0/asm-analysis-4.0.jar
[windows-jdk9] [INFO] Downloaded: https://repo.maven.apache.org/maven2/org/ow2/asm/asm-commons/4.0/asm-commons-4.0.jar (38 kB at 444 kB/s)
[windows-jdk9] [INFO] Downloading: https://repo.maven.apache.org/maven2/org/apache/maven/doxia/doxia-site-renderer/1.1.4/doxia-site-renderer-1.1.4.jar
[windows-jdk9] [INFO] Downloaded: https://repo.maven.apache.org/maven2/org/ow2/asm/asm-util/4.0/asm-util-4.0.jar (37 kB at 425 kB/s)
[windows-jdk9] [INFO] Downloading: https://repo.maven.apache.org/maven2/org/apache/maven/doxia/doxia-decoration-model/1.1.4/doxia-decoration-model-1.1.4.jar
[windows-jdk9] [INFO] Downloaded: https://repo.maven.apache.org/maven2/org/apache/maven/doxia/doxia-decoration-model/1.1.4/doxia-decoration-model-1.1.4.jar (52 kB at 534 kB/s)
[windows-jdk9] [INFO] Downloading: https://repo.maven.apache.org/maven2/org/apache/maven/doxia/doxia-module-xhtml/1.1.4/doxia-module-xhtml-1.1.4.jar
[windows-jdk9] [INFO] Downloaded: https://repo.maven.apache.org/maven2/org/apache/maven/doxia/doxia-module-xhtml/1.1.4/doxia-module-xhtml-1.1.4.jar (15 kB at 143 kB/s)
[windows-jdk9] [INFO] Downloading: https://repo.maven.apache.org/maven2/org/apache/maven/doxia/doxia-module-fml/1.1.4/doxia-module-fml-1.1.4.jar
[windows-jdk9] [INFO] Downloaded: https://repo.maven.apache.org/maven2/org/ow2/asm/asm-tree/4.0/asm-tree-4.0.jar (22 kB at 196 kB/s)
[windows-jdk9] [INFO] Downloading: https://repo.maven.apache.org/maven2/commons-collections/commons-collections/3.2/commons-collections-3.2.jar
[windows-jdk9] [INFO] Downloaded: https://repo.maven.apache.org/maven2/org/ow2/asm/asm-analysis/4.0/asm-analysis-4.0.jar (20 kB at 172 kB/s)
[windows-jdk9] [INFO] Downloading: https://repo.maven.apache.org/maven2/org/codehaus/groovy/groovy-all/2.0.1/groovy-all-2.0.1.jar
[windows-jdk9] [INFO] Downloaded: https://repo.maven.apache.org/maven2/org/apache/maven/doxia/doxia-module-fml/1.1.4/doxia-module-fml-1.1.4.jar (37 kB at 328 kB/s)
[windows-jdk9] [INFO] Downloading: https://repo.maven.apache.org/maven2/org/apache/ant/ant/1.8.1/ant-1.8.1.jar
[windows-jdk9] [INFO] Downloaded: https://repo.maven.apache.org/maven2/org/codehaus/groovy/groovy/2.0.1/groovy-2.0.1.jar (3.3 MB at 28 MB/s)
[windows-jdk9] [INFO] Downloaded: https://repo.maven.apache.org/maven2/org/apache/maven/doxia/doxia-site-renderer/1.1.4/doxia-site-renderer-1.1.4.jar (51 kB at 403 kB/s)
[windows-jdk9] [INFO] Downloaded: https://repo.maven.apache.org/maven2/org/apache/ant/ant/1.8.1/ant-1.8.1.jar (1.5 MB at 9.9 MB/s)
[windows-jdk9] [INFO] Downloaded: https://repo.maven.apache.org/maven2/commons-collections/commons-collections/3.2/commons-collections-3.2.jar (571 kB at 3.5 MB/s)
[windows-jdk9] [INFO] Downloaded: https://repo.maven.apache.org/maven2/org/codehaus/groovy/groovy-all/2.0.1/groovy-all-2.0.1.jar (6.2 MB at 23 MB/s)
[windows-jdk9] [INFO] Installing f:\jenkins\jenkins-slave\workspace\maven-wip_maven-scm_master-ADXNUB4JTUUV5E57KMRFZSZVGMFJJBVMKSOJS62JASEIC2763EUQ@2\m\pom.xml to F:\jenkins\jenkins-slave\workspace\maven-wip_maven-scm_master-ADXNUB4JTUUV5E57KMRFZSZVGMFJJBVMKSOJS62JASEIC2763EUQ@2\m\maven-scm-plugin\target\local-repo\org\apache\maven\scm\maven-scm\1.9.6-SNAPSHOT\maven-scm-1.9.6-SNAPSHOT.pom
[windows-jdk9] [INFO] Installing f:\jenkins\jenkins-slave\workspace\maven-wip_maven-scm_master-ADXNUB4JTUUV5E57KMRFZSZVGMFJJBVMKSOJS62JASEIC2763EUQ@2\m\target\maven-scm-1.9.6-SNAPSHOT-site.xml to F:\jenkins\jenkins-slave\workspace\maven-wip_maven-scm_master-ADXNUB4JTUUV5E57KMRFZSZVGMFJJBVMKSOJS62JASEIC2763EUQ@2\m\maven-scm-plugin\target\local-repo\org\apache\maven\scm\maven-scm\1.9.6-SNAPSHOT\maven-scm-1.9.6-SNAPSHOT-site.xml
[windows-jdk9] [INFO] Installing F:\jenkins\jenkins-slave\workspace\maven-wip_maven-scm_master-ADXNUB4JTUUV5E57KMRFZSZVGMFJJBVMKSOJS62JASEIC2763EUQ@2\m\maven-scm-api\pom.xml to F:\jenkins\jenkins-slave\workspace\maven-wip_maven-scm_master-ADXNUB4JTUUV5E57KMRFZSZVGMFJJBVMKSOJS62JASEIC2763EUQ@2\m\maven-scm-plugin\target\local-repo\org\apache\maven\scm\maven-scm-api\1.9.6-SNAPSHOT\maven-scm-api-1.9.6-SNAPSHOT.pom
[windows-jdk9] [INFO] Installing F:\jenkins\jenkins-slave\workspace\maven-wip_maven-scm_master-ADXNUB4JTUUV5E57KMRFZSZVGMFJJBVMKSOJS62JASEIC2763EUQ@2\m\maven-scm-api\target\maven-scm-api-1.9.6-SNAPSHOT.jar to F:\jenkins\jenkins-slave\workspace\maven-wip_maven-scm_master-ADXNUB4JTUUV5E57KMRFZSZVGMFJJBVMKSOJS62JASEIC2763EUQ@2\m\maven-scm-plugin\target\local-repo\org\apache\maven\scm\maven-scm-api\1.9.6-SNAPSHOT\maven-scm-api-1.9.6-SNAPSHOT.jar
[windows-jdk9] [INFO] Installing F:\jenkins\jenkins-slave\workspace\maven-wip_maven-scm_master-ADXNUB4JTUUV5E57KMRFZSZVGMFJJBVMKSOJS62JASEIC2763EUQ@2\m\maven-scm-managers\pom.xml to F:\jenkins\jenkins-slave\workspace\maven-wip_maven-scm_master-ADXNUB4JTUUV5E57KMRFZSZVGMFJJBVMKSOJS62JASEIC2763EUQ@2\m\maven-scm-plugin\target\local-repo\org\apache\maven\scm\maven-scm-managers\1.9.6-SNAPSHOT\maven-scm-managers-1.9.6-SNAPSHOT.pom
[windows-jdk9] [INFO] Installing F:\jenkins\jenkins-slave\workspace\maven-wip_maven-scm_master-ADXNUB4JTUUV5E57KMRFZSZVGMFJJBVMKSOJS62JASEIC2763EUQ@2\m\maven-scm-managers\target\maven-scm-managers-1.9.6-SNAPSHOT-site.xml to F:\jenkins\jenkins-slave\workspace\maven-wip_maven-scm_master-ADXNUB4JTUUV5E57KMRFZSZVGMFJJBVMKSOJS62JASEIC2763EUQ@2\m\maven-scm-plugin\target\local-repo\org\apache\maven\scm\maven-scm-managers\1.9.6-SNAPSHOT\maven-scm-managers-1.9.6-SNAPSHOT-site.xml
[windows-jdk9] [INFO] Installing F:\jenkins\jenkins-slave\workspace\maven-wip_maven-scm_master-ADXNUB4JTUUV5E57KMRFZSZVGMFJJBVMKSOJS62JASEIC2763EUQ@2\m\maven-scm-managers\maven-scm-manager-plexus\pom.xml to F:\jenkins\jenkins-slave\workspace\maven-wip_maven-scm_master-ADXNUB4JTUUV5E57KMRFZSZVGMFJJBVMKSOJS62JASEIC2763EUQ@2\m\maven-scm-plugin\target\local-repo\org\apache\maven\scm\maven-scm-manager-plexus\1.9.6-SNAPSHOT\maven-scm-manager-plexus-1.9.6-SNAPSHOT.pom
[windows-jdk9] [INFO] Installing F:\jenkins\jenkins-slave\workspace\maven-wip_maven-scm_master-ADXNUB4JTUUV5E57KMRFZSZVGMFJJBVMKSOJS62JASEIC2763EUQ@2\m\maven-scm-managers\maven-scm-manager-plexus\target\maven-scm-manager-plexus-1.9.6-SNAPSHOT.jar to F:\jenkins\jenkins-slave\workspace\maven-wip_maven-scm_master-ADXNUB4JTUUV5E57KMRFZSZVGMFJJBVMKSOJS62JASEIC2763EUQ@2\m\maven-scm-plugin\target\local-repo\org\apache\maven\scm\maven-scm-manager-plexus\1.9.6-SNAPSHOT\maven-scm-manager-plexus-1.9.6-SNAPSHOT.jar
[windows-jdk9] [INFO] Installing F:\jenkins\jenkins-slave\workspace\maven-wip_maven-scm_master-ADXNUB4JTUUV5E57KMRFZSZVGMFJJBVMKSOJS62JASEIC2763EUQ@2\m\maven-scm-test\pom.xml to F:\jenkins\jenkins-slave\workspace\maven-wip_maven-scm_master-ADXNUB4JTUUV5E57KMRFZSZVGMFJJBVMKSOJS62JASEIC2763EUQ@2\m\maven-scm-plugin\target\local-repo\org\apache\maven\scm\maven-scm-test\1.9.6-SNAPSHOT\maven-scm-test-1.9.6-SNAPSHOT.pom
[windows-jdk9] [INFO] Installing F:\jenkins\jenkins-slave\workspace\maven-wip_maven-scm_master-ADXNUB4JTUUV5E57KMRFZSZVGMFJJBVMKSOJS62JASEIC2763EUQ@2\m\maven-scm-test\target\maven-scm-test-1.9.6-SNAPSHOT.jar to F:\jenkins\jenkins-slave\workspace\maven-wip_maven-scm_master-ADXNUB4JTUUV5E57KMRFZSZVGMFJJBVMKSOJS62JASEIC2763EUQ@2\m\maven-scm-plugin\target\local-repo\org\apache\maven\scm\maven-scm-test\1.9.6-SNAPSHOT\maven-scm-test-1.9.6-SNAPSHOT.jar
[windows-jdk9] [INFO] Installing F:\jenkins\jenkins-slave\workspace\maven-wip_maven-scm_master-ADXNUB4JTUUV5E57KMRFZSZVGMFJJBVMKSOJS62JASEIC2763EUQ@2\m\maven-scm-providers\pom.xml to F:\jenkins\jenkins-slave\workspace\maven-wip_maven-scm_master-ADXNUB4JTUUV5E57KMRFZSZVGMFJJBVMKSOJS62JASEIC2763EUQ@2\m\maven-scm-plugin\target\local-repo\org\apache\maven\scm\maven-scm-providers\1.9.6-SNAPSHOT\maven-scm-providers-1.9.6-SNAPSHOT.pom
[windows-jdk9] [INFO] Installing F:\jenkins\jenkins-slave\workspace\maven-wip_maven-scm_master-ADXNUB4JTUUV5E57KMRFZSZVGMFJJBVMKSOJS62JASEIC2763EUQ@2\m\maven-scm-providers\target\maven-scm-providers-1.9.6-SNAPSHOT-site.xml to F:\jenkins\jenkins-slave\workspace\maven-wip_maven-scm_master-ADXNUB4JTUUV5E57KMRFZSZVGMFJJBVMKSOJS62JASEIC2763EUQ@2\m\maven-scm-plugin\target\local-repo\org\apache\maven\scm\maven-scm-providers\1.9.6-SNAPSHOT\maven-scm-providers-1.9.6-SNAPSHOT-site.xml
[windows-jdk9] [INFO] Installing F:\jenkins\jenkins-slave\workspace\maven-wip_maven-scm_master-ADXNUB4JTUUV5E57KMRFZSZVGMFJJBVMKSOJS62JASEIC2763EUQ@2\m\maven-scm-providers\maven-scm-provider-accurev\pom.xml to F:\jenkins\jenkins-slave\workspace\maven-wip_maven-scm_master-ADXNUB4JTUUV5E57KMRFZSZVGMFJJBVMKSOJS62JASEIC2763EUQ@2\m\maven-scm-plugin\target\local-repo\org\apache\maven\scm\maven-scm-provider-accurev\1.9.6-SNAPSHOT\maven-scm-provider-accurev-1.9.6-SNAPSHOT.pom
[windows-jdk9] [INFO] Installing F:\jenkins\jenkins-slave\workspace\maven-wip_maven-scm_master-ADXNUB4JTUUV5E57KMRFZSZVGMFJJBVMKSOJS62JASEIC2763EUQ@2\m\maven-scm-providers\maven-scm-provider-accurev\target\maven-scm-provider-accurev-1.9.6-SNAPSHOT.jar to F:\jenkins\jenkins-slave\workspace\maven-wip_maven-scm_master-ADXNUB4JTUUV5E57KMRFZSZVGMFJJBVMKSOJS62JASEIC2763EUQ@2\m\maven-scm-plugin\target\local-repo\org\apache\maven\scm\maven-scm-provider-accurev\1.9.6-SNAPSHOT\maven-scm-provider-accurev-1.9.6-SNAPSHOT.jar
[windows-jdk9] [INFO] Installing F:\jenkins\jenkins-slave\workspace\maven-wip_maven-scm_master-ADXNUB4JTUUV5E57KMRFZSZVGMFJJBVMKSOJS62JASEIC2763EUQ@2\m\maven-scm-providers\maven-scm-provider-bazaar\pom.xml to F:\jenkins\jenkins-slave\workspace\maven-wip_maven-scm_master-ADXNUB4JTUUV5E57KMRFZSZVGMFJJBVMKSOJS62JASEIC2763EUQ@2\m\maven-scm-plugin\target\local-repo\org\apache\maven\scm\maven-scm-provider-bazaar\1.9.6-SNAPSHOT\maven-scm-provider-bazaar-1.9.6-SNAPSHOT.pom
[windows-jdk9] [INFO] Installing F:\jenkins\jenkins-slave\workspace\maven-wip_maven-scm_master-ADXNUB4JTUUV5E57KMRFZSZVGMFJJBVMKSOJS62JASEIC2763EUQ@2\m\maven-scm-providers\maven-scm-provider-bazaar\target\maven-scm-provider-bazaar-1.9.6-SNAPSHOT.jar to F:\jenkins\jenkins-slave\workspace\maven-wip_maven-scm_master-ADXNUB4JTUUV5E57KMRFZSZVGMFJJBVMKSOJS62JASEIC2763EUQ@2\m\maven-scm-plugin\target\local-repo\org\apache\maven\scm\maven-scm-provider-bazaar\1.9.6-SNAPSHOT\maven-scm-provider-bazaar-1.9.6-SNAPSHOT.jar
[windows-jdk9] [INFO] Installing F:\jenkins\jenkins-slave\workspace\maven-wip_maven-scm_master-ADXNUB4JTUUV5E57KMRFZSZVGMFJJBVMKSOJS62JASEIC2763EUQ@2\m\maven-scm-providers\maven-scm-provider-clearcase\pom.xml to F:\jenkins\jenkins-slave\workspace\maven-wip_maven-scm_master-ADXNUB4JTUUV5E57KMRFZSZVGMFJJBVMKSOJS62JASEIC2763EUQ@2\m\maven-scm-plugin\target\local-repo\org\apache\maven\scm\maven-scm-provider-clearcase\1.9.6-SNAPSHOT\maven-scm-provider-clearcase-1.9.6-SNAPSHOT.pom
[windows-jdk9] [INFO] Installing F:\jenkins\jenkins-slave\workspace\maven-wip_maven-scm_master-ADXNUB4JTUUV5E57KMRFZSZVGMFJJBVMKSOJS62JASEIC2763EUQ@2\m\maven-scm-providers\maven-scm-provider-clearcase\target\maven-scm-provider-clearcase-1.9.6-SNAPSHOT.jar to F:\jenkins\jenkins-slave\workspace\maven-wip_maven-scm_master-ADXNUB4JTUUV5E57KMRFZSZVGMFJJBVMKSOJS62JASEIC2763EUQ@2\m\maven-scm-plugin\target\local-repo\org\apache\maven\scm\maven-scm-provider-clearcase\1.9.6-SNAPSHOT\maven-scm-provider-clearcase-1.9.6-SNAPSHOT.jar
[windows-jdk9] [INFO] Installing F:\jenkins\jenkins-slave\workspace\maven-wip_maven-scm_master-ADXNUB4JTUUV5E57KMRFZSZVGMFJJBVMKSOJS62JASEIC2763EUQ@2\m\maven-scm-providers\maven-scm-providers-cvs\pom.xml to F:\jenkins\jenkins-slave\workspace\maven-wip_maven-scm_master-ADXNUB4JTUUV5E57KMRFZSZVGMFJJBVMKSOJS62JASEIC2763EUQ@2\m\maven-scm-plugin\target\local-repo\org\apache\maven\scm\maven-scm-providers-cvs\1.9.6-SNAPSHOT\maven-scm-providers-cvs-1.9.6-SNAPSHOT.pom
[windows-jdk9] [INFO] Installing F:\jenkins\jenkins-slave\workspace\maven-wip_maven-scm_master-ADXNUB4JTUUV5E57KMRFZSZVGMFJJBVMKSOJS62JASEIC2763EUQ@2\m\maven-scm-providers\maven-scm-providers-cvs\target\maven-scm-providers-cvs-1.9.6-SNAPSHOT-site.xml to F:\jenkins\jenkins-slave\workspace\maven-wip_maven-scm_master-ADXNUB4JTUUV5E57KMRFZSZVGMFJJBVMKSOJS62JASEIC2763EUQ@2\m\maven-scm-plugin\target\local-repo\org\apache\maven\scm\maven-scm-providers-cvs\1.9.6-SNAPSHOT\maven-scm-providers-cvs-1.9.6-SNAPSHOT-site.xml
[windows-jdk9] [INFO] Installing F:\jenkins\jenkins-slave\workspace\maven-wip_maven-scm_master-ADXNUB4JTUUV5E57KMRFZSZVGMFJJBVMKSOJS62JASEIC2763EUQ@2\m\maven-scm-providers\maven-scm-providers-cvs\maven-scm-provider-cvstest\pom.xml to F:\jenkins\jenkins-slave\workspace\maven-wip_maven-scm_master-ADXNUB4JTUUV5E57KMRFZSZVGMFJJBVMKSOJS62JASEIC2763EUQ@2\m\maven-scm-plugin\target\local-repo\org\apache\maven\scm\maven-scm-provider-cvstest\1.9.6-SNAPSHOT\maven-scm-provider-cvstest-1.9.6-SNAPSHOT.pom
[windows-jdk9] [INFO] Installing F:\jenkins\jenkins-slave\workspace\maven-wip_maven-scm_master-ADXNUB4JTUUV5E57KMRFZSZVGMFJJBVMKSOJS62JASEIC2763EUQ@2\m\maven-scm-providers\maven-scm-providers-cvs\maven-scm-provider-cvstest\target\maven-scm-provider-cvstest-1.9.6-SNAPSHOT.jar to F:\jenkins\jenkins-slave\workspace\maven-wip_maven-scm_master-ADXNUB4JTUUV5E57KMRFZSZVGMFJJBVMKSOJS62JASEIC2763EUQ@2\m\maven-scm-plugin\target\local-repo\org\apache\maven\scm\maven-scm-provider-cvstest\1.9.6-SNAPSHOT\maven-scm-provider-cvstest-1.9.6-SNAPSHOT.jar
[windows-jdk9] [INFO] Installing F:\jenkins\jenkins-slave\workspace\maven-wip_maven-scm_master-ADXNUB4JTUUV5E57KMRFZSZVGMFJJBVMKSOJS62JASEIC2763EUQ@2\m\maven-scm-providers\maven-scm-providers-cvs\maven-scm-provider-cvs-commons\pom.xml to F:\jenkins\jenkins-slave\workspace\maven-wip_maven-scm_master-ADXNUB4JTUUV5E57KMRFZSZVGMFJJBVMKSOJS62JASEIC2763EUQ@2\m\maven-scm-plugin\target\local-repo\org\apache\maven\scm\maven-scm-provider-cvs-commons\1.9.6-SNAPSHOT\maven-scm-provider-cvs-commons-1.9.6-SNAPSHOT.pom
[windows-jdk9] [INFO] Installing F:\jenkins\jenkins-slave\workspace\maven-wip_maven-scm_master-ADXNUB4JTUUV5E57KMRFZSZVGMFJJBVMKSOJS62JASEIC2763EUQ@2\m\maven-scm-providers\maven-scm-providers-cvs\maven-scm-provider-cvs-commons\target\maven-scm-provider-cvs-commons-1.9.6-SNAPSHOT.jar to F:\jenkins\jenkins-slave\workspace\maven-wip_maven-scm_master-ADXNUB4JTUUV5E57KMRFZSZVGMFJJBVMKSOJS62JASEIC2763EUQ@2\m\maven-scm-plugin\target\local-repo\org\apache\maven\scm\maven-scm-provider-cvs-commons\1.9.6-SNAPSHOT\maven-scm-provider-cvs-commons-1.9.6-SNAPSHOT.jar
[windows-jdk9] [INFO] Installing F:\jenkins\jenkins-slave\workspace\maven-wip_maven-scm_master-ADXNUB4JTUUV5E57KMRFZSZVGMFJJBVMKSOJS62JASEIC2763EUQ@2\m\maven-scm-providers\maven-scm-providers-cvs\maven-scm-provider-cvsexe\pom.xml to F:\jenkins\jenkins-slave\workspace\maven-wip_maven-scm_master-ADXNUB4JTUUV5E57KMRFZSZVGMFJJBVMKSOJS62JASEIC2763EUQ@2\m\maven-scm-plugin\target\local-repo\org\apache\maven\scm\maven-scm-provider-cvsexe\1.9.6-SNAPSHOT\maven-scm-provider-cvsexe-1.9.6-SNAPSHOT.pom
[windows-jdk9] [INFO] Installing F:\jenkins\jenkins-slave\workspace\maven-wip_maven-scm_master-ADXNUB4JTUUV5E57KMRFZSZVGMFJJBVMKSOJS62JASEIC2763EUQ@2\m\maven-scm-providers\maven-scm-providers-cvs\maven-scm-provider-cvsexe\target\maven-scm-provider-cvsexe-1.9.6-SNAPSHOT.jar to F:\jenkins\jenkins-slave\workspace\maven-wip_maven-scm_master-ADXNUB4JTUUV5E57KMRFZSZVGMFJJBVMKSOJS62JASEIC2763EUQ@2\m\maven-scm-plugin\target\local-repo\org\apache\maven\scm\maven-scm-provider-cvsexe\1.9.6-SNAPSHOT\maven-scm-provider-cvsexe-1.9.6-SNAPSHOT.jar
[windows-jdk9] [INFO] Installing F:\jenkins\jenkins-slave\workspace\maven-wip_maven-scm_master-ADXNUB4JTUUV5E57KMRFZSZVGMFJJBVMKSOJS62JASEIC2763EUQ@2\m\maven-scm-providers\maven-scm-providers-cvs\maven-scm-provider-cvsjava\pom.xml to F:\jenkins\jenkins-slave\workspace\maven-wip_maven-scm_master-ADXNUB4JTUUV5E57KMRFZSZVGMFJJBVMKSOJS62JASEIC2763EUQ@2\m\maven-scm-plugin\target\local-repo\org\apache\maven\scm\maven-scm-provider-cvsjava\1.9.6-SNAPSHOT\maven-scm-provider-cvsjava-1.9.6-SNAPSHOT.pom
[windows-jdk9] [INFO] Installing F:\jenkins\jenkins-slave\workspace\maven-wip_maven-scm_master-ADXNUB4JTUUV5E57KMRFZSZVGMFJJBVMKSOJS62JASEIC2763EUQ@2\m\maven-scm-providers\maven-scm-providers-cvs\maven-scm-provider-cvsjava\target\maven-scm-provider-cvsjava-1.9.6-SNAPSHOT.jar to F:\jenkins\jenkins-slave\workspace\maven-wip_maven-scm_master-ADXNUB4JTUUV5E57KMRFZSZVGMFJJBVMKSOJS62JASEIC2763EUQ@2\m\maven-scm-plugin\target\local-repo\org\apache\maven\scm\maven-scm-provider-cvsjava\1.9.6-SNAPSHOT\maven-scm-provider-cvsjava-1.9.6-SNAPSHOT.jar
[windows-jdk9] [INFO] Installing F:\jenkins\jenkins-slave\workspace\maven-wip_maven-scm_master-ADXNUB4JTUUV5E57KMRFZSZVGMFJJBVMKSOJS62JASEIC2763EUQ@2\m\maven-scm-providers\maven-scm-provider-hg\pom.xml to F:\jenkins\jenkins-slave\workspace\maven-wip_maven-scm_master-ADXNUB4JTUUV5E57KMRFZSZVGMFJJBVMKSOJS62JASEIC2763EUQ@2\m\maven-scm-plugin\target\local-repo\org\apache\maven\scm\maven-scm-provider-hg\1.9.6-SNAPSHOT\maven-scm-provider-hg-1.9.6-SNAPSHOT.pom
[windows-jdk9] [INFO] Installing F:\jenkins\jenkins-slave\workspace\maven-wip_maven-scm_master-ADXNUB4JTUUV5E57KMRFZSZVGMFJJBVMKSOJS62JASEIC2763EUQ@2\m\maven-scm-providers\maven-scm-provider-hg\target\maven-scm-provider-hg-1.9.6-SNAPSHOT.jar to F:\jenkins\jenkins-slave\workspace\maven-wip_maven-scm_master-ADXNUB4JTUUV5E57KMRFZSZVGMFJJBVMKSOJS62JASEIC2763EUQ@2\m\maven-scm-plugin\target\local-repo\org\apache\maven\scm\maven-scm-provider-hg\1.9.6-SNAPSHOT\maven-scm-provider-hg-1.9.6-SNAPSHOT.jar
[windows-jdk9] [INFO] Installing F:\jenkins\jenkins-slave\workspace\maven-wip_maven-scm_master-ADXNUB4JTUUV5E57KMRFZSZVGMFJJBVMKSOJS62JASEIC2763EUQ@2\m\maven-scm-providers\maven-scm-providers-git\pom.xml to F:\jenkins\jenkins-slave\workspace\maven-wip_maven-scm_master-ADXNUB4JTUUV5E57KMRFZSZVGMFJJBVMKSOJS62JASEIC2763EUQ@2\m\maven-scm-plugin\target\local-repo\org\apache\maven\scm\maven-scm-providers-git\1.9.6-SNAPSHOT\maven-scm-providers-git-1.9.6-SNAPSHOT.pom
[windows-jdk9] [INFO] Installing F:\jenkins\jenkins-slave\workspace\maven-wip_maven-scm_master-ADXNUB4JTUUV5E57KMRFZSZVGMFJJBVMKSOJS62JASEIC2763EUQ@2\m\maven-scm-providers\maven-scm-providers-git\target\maven-scm-providers-git-1.9.6-SNAPSHOT-site.xml to F:\jenkins\jenkins-slave\workspace\maven-wip_maven-scm_master-ADXNUB4JTUUV5E57KMRFZSZVGMFJJBVMKSOJS62JASEIC2763EUQ@2\m\maven-scm-plugin\target\local-repo\org\apache\maven\scm\maven-scm-providers-git\1.9.6-SNAPSHOT\maven-scm-providers-git-1.9.6-SNAPSHOT-site.xml
[windows-jdk9] [INFO] Installing F:\jenkins\jenkins-slave\workspace\maven-wip_maven-scm_master-ADXNUB4JTUUV5E57KMRFZSZVGMFJJBVMKSOJS62JASEIC2763EUQ@2\m\maven-scm-providers\maven-scm-providers-git\maven-scm-provider-git-commons\pom.xml to F:\jenkins\jenkins-slave\workspace\maven-wip_maven-scm_master-ADXNUB4JTUUV5E57KMRFZSZVGMFJJBVMKSOJS62JASEIC2763EUQ@2\m\maven-scm-plugin\target\local-repo\org\apache\maven\scm\maven-scm-provider-git-commons\1.9.6-SNAPSHOT\maven-scm-provider-git-commons-1.9.6-SNAPSHOT.pom
[windows-jdk9] [INFO] Installing F:\jenkins\jenkins-slave\workspace\maven-wip_maven-scm_master-ADXNUB4JTUUV5E57KMRFZSZVGMFJJBVMKSOJS62JASEIC2763EUQ@2\m\maven-scm-providers\maven-scm-providers-git\maven-scm-provider-git-commons\target\maven-scm-provider-git-commons-1.9.6-SNAPSHOT.jar to F:\jenkins\jenkins-slave\workspace\maven-wip_maven-scm_master-ADXNUB4JTUUV5E57KMRFZSZVGMFJJBVMKSOJS62JASEIC2763EUQ@2\m\maven-scm-plugin\target\local-repo\org\apache\maven\scm\maven-scm-provider-git-commons\1.9.6-SNAPSHOT\maven-scm-provider-git-commons-1.9.6-SNAPSHOT.jar
[windows-jdk9] [INFO] Installing F:\jenkins\jenkins-slave\workspace\maven-wip_maven-scm_master-ADXNUB4JTUUV5E57KMRFZSZVGMFJJBVMKSOJS62JASEIC2763EUQ@2\m\maven-scm-providers\maven-scm-providers-git\maven-scm-provider-gittest\pom.xml to F:\jenkins\jenkins-slave\workspace\maven-wip_maven-scm_master-ADXNUB4JTUUV5E57KMRFZSZVGMFJJBVMKSOJS62JASEIC2763EUQ@2\m\maven-scm-plugin\target\local-repo\org\apache\maven\scm\maven-scm-provider-gittest\1.9.6-SNAPSHOT\maven-scm-provider-gittest-1.9.6-SNAPSHOT.pom
[windows-jdk9] [INFO] Installing F:\jenkins\jenkins-slave\workspace\maven-wip_maven-scm_master-ADXNUB4JTUUV5E57KMRFZSZVGMFJJBVMKSOJS62JASEIC2763EUQ@2\m\maven-scm-providers\maven-scm-providers-git\maven-scm-provider-gittest\target\maven-scm-provider-gittest-1.9.6-SNAPSHOT.jar to F:\jenkins\jenkins-slave\workspace\maven-wip_maven-scm_master-ADXNUB4JTUUV5E57KMRFZSZVGMFJJBVMKSOJS62JASEIC2763EUQ@2\m\maven-scm-plugin\target\local-repo\org\apache\maven\scm\maven-scm-provider-gittest\1.9.6-SNAPSHOT\maven-scm-provider-gittest-1.9.6-SNAPSHOT.jar
[windows-jdk9] [INFO] Installing F:\jenkins\jenkins-slave\workspace\maven-wip_maven-scm_master-ADXNUB4JTUUV5E57KMRFZSZVGMFJJBVMKSOJS62JASEIC2763EUQ@2\m\maven-scm-providers\maven-scm-providers-git\maven-scm-provider-gitexe\pom.xml to F:\jenkins\jenkins-slave\workspace\maven-wip_maven-scm_master-ADXNUB4JTUUV5E57KMRFZSZVGMFJJBVMKSOJS62JASEIC2763EUQ@2\m\maven-scm-plugin\target\local-repo\org\apache\maven\scm\maven-scm-provider-gitexe\1.9.6-SNAPSHOT\maven-scm-provider-gitexe-1.9.6-SNAPSHOT.pom
[windows-jdk9] [INFO] Installing F:\jenkins\jenkins-slave\workspace\maven-wip_maven-scm_master-ADXNUB4JTUUV5E57KMRFZSZVGMFJJBVMKSOJS62JASEIC2763EUQ@2\m\maven-scm-providers\maven-scm-providers-git\maven-scm-provider-gitexe\target\maven-scm-provider-gitexe-1.9.6-SNAPSHOT.jar to F:\jenkins\jenkins-slave\workspace\maven-wip_maven-scm_master-ADXNUB4JTUUV5E57KMRFZSZVGMFJJBVMKSOJS62JASEIC2763EUQ@2\m\maven-scm-plugin\target\local-repo\org\apache\maven\scm\maven-scm-provider-gitexe\1.9.6-SNAPSHOT\maven-scm-provider-gitexe-1.9.6-SNAPSHOT.jar
[windows-jdk9] [INFO] Installing F:\jenkins\jenkins-slave\workspace\maven-wip_maven-scm_master-ADXNUB4JTUUV5E57KMRFZSZVGMFJJBVMKSOJS62JASEIC2763EUQ@2\m\maven-scm-providers\maven-scm-providers-git\maven-scm-provider-jgit\pom.xml to F:\jenkins\jenkins-slave\workspace\maven-wip_maven-scm_master-ADXNUB4JTUUV5E57KMRFZSZVGMFJJBVMKSOJS62JASEIC2763EUQ@2\m\maven-scm-plugin\target\local-repo\org\apache\maven\scm\maven-scm-provider-jgit\1.9.6-SNAPSHOT\maven-scm-provider-jgit-1.9.6-SNAPSHOT.pom
[windows-jdk9] [INFO] Installing F:\jenkins\jenkins-slave\workspace\maven-wip_maven-scm_master-ADXNUB4JTUUV5E57KMRFZSZVGMFJJBVMKSOJS62JASEIC2763EUQ@2\m\maven-scm-providers\maven-scm-providers-git\maven-scm-provider-jgit\target\maven-scm-provider-jgit-1.9.6-SNAPSHOT.jar to F:\jenkins\jenkins-slave\workspace\maven-wip_maven-scm_master-ADXNUB4JTUUV5E57KMRFZSZVGMFJJBVMKSOJS62JASEIC2763EUQ@2\m\maven-scm-plugin\target\local-repo\org\apache\maven\scm\maven-scm-provider-jgit\1.9.6-SNAPSHOT\maven-scm-provider-jgit-1.9.6-SNAPSHOT.jar
[windows-jdk9] [INFO] Installing F:\jenkins\jenkins-slave\workspace\maven-wip_maven-scm_master-ADXNUB4JTUUV5E57KMRFZSZVGMFJJBVMKSOJS62JASEIC2763EUQ@2\m\maven-scm-providers\maven-scm-provider-local\pom.xml to F:\jenkins\jenkins-slave\workspace\maven-wip_maven-scm_master-ADXNUB4JTUUV5E57KMRFZSZVGMFJJBVMKSOJS62JASEIC2763EUQ@2\m\maven-scm-plugin\target\local-repo\org\apache\maven\scm\maven-scm-provider-local\1.9.6-SNAPSHOT\maven-scm-provider-local-1.9.6-SNAPSHOT.pom
[windows-jdk9] [INFO] Installing F:\jenkins\jenkins-slave\workspace\maven-wip_maven-scm_master-ADXNUB4JTUUV5E57KMRFZSZVGMFJJBVMKSOJS62JASEIC2763EUQ@2\m\maven-scm-providers\maven-scm-provider-local\target\maven-scm-provider-local-1.9.6-SNAPSHOT.jar to F:\jenkins\jenkins-slave\workspace\maven-wip_maven-scm_master-ADXNUB4JTUUV5E57KMRFZSZVGMFJJBVMKSOJS62JASEIC2763EUQ@2\m\maven-scm-plugin\target\local-repo\org\apache\maven\scm\maven-scm-provider-local\1.9.6-SNAPSHOT\maven-scm-provider-local-1.9.6-SNAPSHOT.jar
[windows-jdk9] [INFO] Installing F:\jenkins\jenkins-slave\workspace\maven-wip_maven-scm_master-ADXNUB4JTUUV5E57KMRFZSZVGMFJJBVMKSOJS62JASEIC2763EUQ@2\m\maven-scm-providers\maven-scm-provider-perforce\pom.xml to F:\jenkins\jenkins-slave\workspace\maven-wip_maven-scm_master-ADXNUB4JTUUV5E57KMRFZSZVGMFJJBVMKSOJS62JASEIC2763EUQ@2\m\maven-scm-plugin\target\local-repo\org\apache\maven\scm\maven-scm-provider-perforce\1.9.6-SNAPSHOT\maven-scm-provider-perforce-1.9.6-SNAPSHOT.pom
[windows-jdk9] [INFO] Installing F:\jenkins\jenkins-slave\workspace\maven-wip_maven-scm_master-ADXNUB4JTUUV5E57KMRFZSZVGMFJJBVMKSOJS62JASEIC2763EUQ@2\m\maven-scm-providers\maven-scm-provider-perforce\target\maven-scm-provider-perforce-1.9.6-SNAPSHOT.jar to F:\jenkins\jenkins-slave\workspace\maven-wip_maven-scm_master-ADXNUB4JTUUV5E57KMRFZSZVGMFJJBVMKSOJS62JASEIC2763EUQ@2\m\maven-scm-plugin\target\local-repo\org\apache\maven\scm\maven-scm-provider-perforce\1.9.6-SNAPSHOT\maven-scm-provider-perforce-1.9.6-SNAPSHOT.jar
[windows-jdk9] [INFO] Installing F:\jenkins\jenkins-slave\workspace\maven-wip_maven-scm_master-ADXNUB4JTUUV5E57KMRFZSZVGMFJJBVMKSOJS62JASEIC2763EUQ@2\m\maven-scm-providers\maven-scm-provider-starteam\pom.xml to F:\jenkins\jenkins-slave\workspace\maven-wip_maven-scm_master-ADXNUB4JTUUV5E57KMRFZSZVGMFJJBVMKSOJS62JASEIC2763EUQ@2\m\maven-scm-plugin\target\local-repo\org\apache\maven\scm\maven-scm-provider-starteam\1.9.6-SNAPSHOT\maven-scm-provider-starteam-1.9.6-SNAPSHOT.pom
[windows-jdk9] [INFO] Installing F:\jenkins\jenkins-slave\workspace\maven-wip_maven-scm_master-ADXNUB4JTUUV5E57KMRFZSZVGMFJJBVMKSOJS62JASEIC2763EUQ@2\m\maven-scm-providers\maven-scm-provider-starteam\target\maven-scm-provider-starteam-1.9.6-SNAPSHOT.jar to F:\jenkins\jenkins-slave\workspace\maven-wip_maven-scm_master-ADXNUB4JTUUV5E57KMRFZSZVGMFJJBVMKSOJS62JASEIC2763EUQ@2\m\maven-scm-plugin\target\local-repo\org\apache\maven\scm\maven-scm-provider-starteam\1.9.6-SNAPSHOT\maven-scm-provider-starteam-1.9.6-SNAPSHOT.jar
[windows-jdk9] [INFO] Installing F:\jenkins\jenkins-slave\workspace\maven-wip_maven-scm_master-ADXNUB4JTUUV5E57KMRFZSZVGMFJJBVMKSOJS62JASEIC2763EUQ@2\m\maven-scm-providers\maven-scm-providers-svn\pom.xml to F:\jenkins\jenkins-slave\workspace\maven-wip_maven-scm_master-ADXNUB4JTUUV5E57KMRFZSZVGMFJJBVMKSOJS62JASEIC2763EUQ@2\m\maven-scm-plugin\target\local-repo\org\apache\maven\scm\maven-scm-providers-svn\1.9.6-SNAPSHOT\maven-scm-providers-svn-1.9.6-SNAPSHOT.pom
[windows-jdk9] [INFO] Installing F:\jenkins\jenkins-slave\workspace\maven-wip_maven-scm_master-ADXNUB4JTUUV5E57KMRFZSZVGMFJJBVMKSOJS62JASEIC2763EUQ@2\m\maven-scm-providers\maven-scm-providers-svn\target\maven-scm-providers-svn-1.9.6-SNAPSHOT-site.xml to F:\jenkins\jenkins-slave\workspace\maven-wip_maven-scm_master-ADXNUB4JTUUV5E57KMRFZSZVGMFJJBVMKSOJS62JASEIC2763EUQ@2\m\maven-scm-plugin\target\local-repo\org\apache\maven\scm\maven-scm-providers-svn\1.9.6-SNAPSHOT\maven-scm-providers-svn-1.9.6-SNAPSHOT-site.xml
[windows-jdk9] [INFO] Installing F:\jenkins\jenkins-slave\workspace\maven-wip_maven-scm_master-ADXNUB4JTUUV5E57KMRFZSZVGMFJJBVMKSOJS62JASEIC2763EUQ@2\m\maven-scm-providers\maven-scm-providers-svn\maven-scm-provider-svn-commons\pom.xml to F:\jenkins\jenkins-slave\workspace\maven-wip_maven-scm_master-ADXNUB4JTUUV5E57KMRFZSZVGMFJJBVMKSOJS62JASEIC2763EUQ@2\m\maven-scm-plugin\target\local-repo\org\apache\maven\scm\maven-scm-provider-svn-commons\1.9.6-SNAPSHOT\maven-scm-provider-svn-commons-1.9.6-SNAPSHOT.pom
[windows-jdk9] [INFO] Installing F:\jenkins\jenkins-slave\workspace\maven-wip_maven-scm_master-ADXNUB4JTUUV5E57KMRFZSZVGMFJJBVMKSOJS62JASEIC2763EUQ@2\m\maven-scm-providers\maven-scm-providers-svn\maven-scm-provider-svn-commons\target\maven-scm-provider-svn-commons-1.9.6-SNAPSHOT.jar to F:\jenkins\jenkins-slave\workspace\maven-wip_maven-scm_master-ADXNUB4JTUUV5E57KMRFZSZVGMFJJBVMKSOJS62JASEIC2763EUQ@2\m\maven-scm-plugin\target\local-repo\org\apache\maven\scm\maven-scm-provider-svn-commons\1.9.6-SNAPSHOT\maven-scm-provider-svn-commons-1.9.6-SNAPSHOT.jar
[windows-jdk9] [INFO] Installing F:\jenkins\jenkins-slave\workspace\maven-wip_maven-scm_master-ADXNUB4JTUUV5E57KMRFZSZVGMFJJBVMKSOJS62JASEIC2763EUQ@2\m\maven-scm-providers\maven-scm-providers-svn\maven-scm-provider-svntest\pom.xml to F:\jenkins\jenkins-slave\workspace\maven-wip_maven-scm_master-ADXNUB4JTUUV5E57KMRFZSZVGMFJJBVMKSOJS62JASEIC2763EUQ@2\m\maven-scm-plugin\target\local-repo\org\apache\maven\scm\maven-scm-provider-svntest\1.9.6-SNAPSHOT\maven-scm-provider-svntest-1.9.6-SNAPSHOT.pom
[windows-jdk9] [INFO] Installing F:\jenkins\jenkins-slave\workspace\maven-wip_maven-scm_master-ADXNUB4JTUUV5E57KMRFZSZVGMFJJBVMKSOJS62JASEIC2763EUQ@2\m\maven-scm-providers\maven-scm-providers-svn\maven-scm-provider-svntest\target\maven-scm-provider-svntest-1.9.6-SNAPSHOT.jar to F:\jenkins\jenkins-slave\workspace\maven-wip_maven-scm_master-ADXNUB4JTUUV5E57KMRFZSZVGMFJJBVMKSOJS62JASEIC2763EUQ@2\m\maven-scm-plugin\target\local-repo\org\apache\maven\scm\maven-scm-provider-svntest\1.9.6-SNAPSHOT\maven-scm-provider-svntest-1.9.6-SNAPSHOT.jar
[windows-jdk9] [INFO] Installing F:\jenkins\jenkins-slave\workspace\maven-wip_maven-scm_master-ADXNUB4JTUUV5E57KMRFZSZVGMFJJBVMKSOJS62JASEIC2763EUQ@2\m\maven-scm-providers\maven-scm-providers-svn\maven-scm-provider-svnexe\pom.xml to F:\jenkins\jenkins-slave\workspace\maven-wip_maven-scm_master-ADXNUB4JTUUV5E57KMRFZSZVGMFJJBVMKSOJS62JASEIC2763EUQ@2\m\maven-scm-plugin\target\local-repo\org\apache\maven\scm\maven-scm-provider-svnexe\1.9.6-SNAPSHOT\maven-scm-provider-svnexe-1.9.6-SNAPSHOT.pom
[windows-jdk9] [INFO] Installing F:\jenkins\jenkins-slave\workspace\maven-wip_maven-scm_master-ADXNUB4JTUUV5E57KMRFZSZVGMFJJBVMKSOJS62JASEIC2763EUQ@2\m\maven-scm-providers\maven-scm-providers-svn\maven-scm-provider-svnexe\target\maven-scm-provider-svnexe-1.9.6-SNAPSHOT.jar to F:\jenkins\jenkins-slave\workspace\maven-wip_maven-scm_master-ADXNUB4JTUUV5E57KMRFZSZVGMFJJBVMKSOJS62JASEIC2763EUQ@2\m\maven-scm-plugin\target\local-repo\org\apache\maven\scm\maven-scm-provider-svnexe\1.9.6-SNAPSHOT\maven-scm-provider-svnexe-1.9.6-SNAPSHOT.jar
[windows-jdk9] [INFO] Installing F:\jenkins\jenkins-slave\workspace\maven-wip_maven-scm_master-ADXNUB4JTUUV5E57KMRFZSZVGMFJJBVMKSOJS62JASEIC2763EUQ@2\m\maven-scm-providers\maven-scm-provider-synergy\pom.xml to F:\jenkins\jenkins-slave\workspace\maven-wip_maven-scm_master-ADXNUB4JTUUV5E57KMRFZSZVGMFJJBVMKSOJS62JASEIC2763EUQ@2\m\maven-scm-plugin\target\local-repo\org\apache\maven\scm\maven-scm-provider-synergy\1.9.6-SNAPSHOT\maven-scm-provider-synergy-1.9.6-SNAPSHOT.pom
[windows-jdk9] [INFO] Installing F:\jenkins\jenkins-slave\workspace\maven-wip_maven-scm_master-ADXNUB4JTUUV5E57KMRFZSZVGMFJJBVMKSOJS62JASEIC2763EUQ@2\m\maven-scm-providers\maven-scm-provider-synergy\target\maven-scm-provider-synergy-1.9.6-SNAPSHOT.jar to F:\jenkins\jenkins-slave\workspace\maven-wip_maven-scm_master-ADXNUB4JTUUV5E57KMRFZSZVGMFJJBVMKSOJS62JASEIC2763EUQ@2\m\maven-scm-plugin\target\local-repo\org\apache\maven\scm\maven-scm-provider-synergy\1.9.6-SNAPSHOT\maven-scm-provider-synergy-1.9.6-SNAPSHOT.jar
[windows-jdk9] [INFO] Installing F:\jenkins\jenkins-slave\workspace\maven-wip_maven-scm_master-ADXNUB4JTUUV5E57KMRFZSZVGMFJJBVMKSOJS62JASEIC2763EUQ@2\m\maven-scm-providers\maven-scm-provider-vss\pom.xml to F:\jenkins\jenkins-slave\workspace\maven-wip_maven-scm_master-ADXNUB4JTUUV5E57KMRFZSZVGMFJJBVMKSOJS62JASEIC2763EUQ@2\m\maven-scm-plugin\target\local-repo\org\apache\maven\scm\maven-scm-provider-vss\1.9.6-SNAPSHOT\maven-scm-provider-vss-1.9.6-SNAPSHOT.pom
[windows-jdk9] [INFO] Installing F:\jenkins\jenkins-slave\workspace\maven-wip_maven-scm_master-ADXNUB4JTUUV5E57KMRFZSZVGMFJJBVMKSOJS62JASEIC2763EUQ@2\m\maven-scm-providers\maven-scm-provider-vss\target\maven-scm-provider-vss-1.9.6-SNAPSHOT.jar to F:\jenkins\jenkins-slave\workspace\maven-wip_maven-scm_master-ADXNUB4JTUUV5E57KMRFZSZVGMFJJBVMKSOJS62JASEIC2763EUQ@2\m\maven-scm-plugin\target\local-repo\org\apache\maven\scm\maven-scm-provider-vss\1.9.6-SNAPSHOT\maven-scm-provider-vss-1.9.6-SNAPSHOT.jar
[windows-jdk9] [INFO] Installing F:\jenkins\jenkins-slave\workspace\maven-wip_maven-scm_master-ADXNUB4JTUUV5E57KMRFZSZVGMFJJBVMKSOJS62JASEIC2763EUQ@2\m\maven-scm-providers\maven-scm-provider-tfs\pom.xml to F:\jenkins\jenkins-slave\workspace\maven-wip_maven-scm_master-ADXNUB4JTUUV5E57KMRFZSZVGMFJJBVMKSOJS62JASEIC2763EUQ@2\m\maven-scm-plugin\target\local-repo\org\apache\maven\scm\maven-scm-provider-tfs\1.9.6-SNAPSHOT\maven-scm-provider-tfs-1.9.6-SNAPSHOT.pom
[windows-jdk9] [INFO] Installing F:\jenkins\jenkins-slave\workspace\maven-wip_maven-scm_master-ADXNUB4JTUUV5E57KMRFZSZVGMFJJBVMKSOJS62JASEIC2763EUQ@2\m\maven-scm-providers\maven-scm-provider-tfs\target\maven-scm-provider-tfs-1.9.6-SNAPSHOT.jar to F:\jenkins\jenkins-slave\workspace\maven-wip_maven-scm_master-ADXNUB4JTUUV5E57KMRFZSZVGMFJJBVMKSOJS62JASEIC2763EUQ@2\m\maven-scm-plugin\target\local-repo\org\apache\maven\scm\maven-scm-provider-tfs\1.9.6-SNAPSHOT\maven-scm-provider-tfs-1.9.6-SNAPSHOT.jar
[windows-jdk9] [INFO] Installing F:\jenkins\jenkins-slave\workspace\maven-wip_maven-scm_master-ADXNUB4JTUUV5E57KMRFZSZVGMFJJBVMKSOJS62JASEIC2763EUQ@2\m\maven-scm-providers\maven-scm-provider-integrity\pom.xml to F:\jenkins\jenkins-slave\workspace\maven-wip_maven-scm_master-ADXNUB4JTUUV5E57KMRFZSZVGMFJJBVMKSOJS62JASEIC2763EUQ@2\m\maven-scm-plugin\target\local-repo\org\apache\maven\scm\maven-scm-provider-integrity\1.9.6-SNAPSHOT\maven-scm-provider-integrity-1.9.6-SNAPSHOT.pom
[windows-jdk9] [INFO] Installing F:\jenkins\jenkins-slave\workspace\maven-wip_maven-scm_master-ADXNUB4JTUUV5E57KMRFZSZVGMFJJBVMKSOJS62JASEIC2763EUQ@2\m\maven-scm-providers\maven-scm-provider-integrity\target\maven-scm-provider-integrity-1.9.6-SNAPSHOT.jar to F:\jenkins\jenkins-slave\workspace\maven-wip_maven-scm_master-ADXNUB4JTUUV5E57KMRFZSZVGMFJJBVMKSOJS62JASEIC2763EUQ@2\m\maven-scm-plugin\target\local-repo\org\apache\maven\scm\maven-scm-provider-integrity\1.9.6-SNAPSHOT\maven-scm-provider-integrity-1.9.6-SNAPSHOT.jar
[windows-jdk9] [INFO] Installing F:\jenkins\jenkins-slave\workspace\maven-wip_maven-scm_master-ADXNUB4JTUUV5E57KMRFZSZVGMFJJBVMKSOJS62JASEIC2763EUQ@2\m\maven-scm-providers\maven-scm-provider-jazz\pom.xml to F:\jenkins\jenkins-slave\workspace\maven-wip_maven-scm_master-ADXNUB4JTUUV5E57KMRFZSZVGMFJJBVMKSOJS62JASEIC2763EUQ@2\m\maven-scm-plugin\target\local-repo\org\apache\maven\scm\maven-scm-provider-jazz\1.9.6-SNAPSHOT\maven-scm-provider-jazz-1.9.6-SNAPSHOT.pom
[windows-jdk9] [INFO] Installing F:\jenkins\jenkins-slave\workspace\maven-wip_maven-scm_master-ADXNUB4JTUUV5E57KMRFZSZVGMFJJBVMKSOJS62JASEIC2763EUQ@2\m\maven-scm-providers\maven-scm-provider-jazz\target\maven-scm-provider-jazz-1.9.6-SNAPSHOT.jar to F:\jenkins\jenkins-slave\workspace\maven-wip_maven-scm_master-ADXNUB4JTUUV5E57KMRFZSZVGMFJJBVMKSOJS62JASEIC2763EUQ@2\m\maven-scm-plugin\target\local-repo\org\apache\maven\scm\maven-scm-provider-jazz\1.9.6-SNAPSHOT\maven-scm-provider-jazz-1.9.6-SNAPSHOT.jar
[windows-jdk9] [INFO] Installing F:\jenkins\jenkins-slave\workspace\maven-wip_maven-scm_master-ADXNUB4JTUUV5E57KMRFZSZVGMFJJBVMKSOJS62JASEIC2763EUQ@2\m\maven-scm-providers\maven-scm-providers-standard\pom.xml to F:\jenkins\jenkins-slave\workspace\maven-wip_maven-scm_master-ADXNUB4JTUUV5E57KMRFZSZVGMFJJBVMKSOJS62JASEIC2763EUQ@2\m\maven-scm-plugin\target\local-repo\org\apache\maven\scm\maven-scm-providers-standard\1.9.6-SNAPSHOT\maven-scm-providers-standard-1.9.6-SNAPSHOT.pom
[windows-jdk9] [INFO] Installing F:\jenkins\jenkins-slave\workspace\maven-wip_maven-scm_master-ADXNUB4JTUUV5E57KMRFZSZVGMFJJBVMKSOJS62JASEIC2763EUQ@2\m\maven-scm-client\pom.xml to F:\jenkins\jenkins-slave\workspace\maven-wip_maven-scm_master-ADXNUB4JTUUV5E57KMRFZSZVGMFJJBVMKSOJS62JASEIC2763EUQ@2\m\maven-scm-plugin\target\local-repo\org\apache\maven\scm\maven-scm-client\1.9.6-SNAPSHOT\maven-scm-client-1.9.6-SNAPSHOT.pom
[windows-jdk9] [INFO] Installing F:\jenkins\jenkins-slave\workspace\maven-wip_maven-scm_master-ADXNUB4JTUUV5E57KMRFZSZVGMFJJBVMKSOJS62JASEIC2763EUQ@2\m\maven-scm-client\target\maven-scm-client-1.9.6-SNAPSHOT.jar to F:\jenkins\jenkins-slave\workspace\maven-wip_maven-scm_master-ADXNUB4JTUUV5E57KMRFZSZVGMFJJBVMKSOJS62JASEIC2763EUQ@2\m\maven-scm-plugin\target\local-repo\org\apache\maven\scm\maven-scm-client\1.9.6-SNAPSHOT\maven-scm-client-1.9.6-SNAPSHOT.jar
[windows-jdk9] [INFO] Installing F:\jenkins\jenkins-slave\workspace\maven-wip_maven-scm_master-ADXNUB4JTUUV5E57KMRFZSZVGMFJJBVMKSOJS62JASEIC2763EUQ@2\m\maven-scm-client\target\maven-scm-client-1.9.6-SNAPSHOT-jar-with-dependencies.jar to F:\jenkins\jenkins-slave\workspace\maven-wip_maven-scm_master-ADXNUB4JTUUV5E57KMRFZSZVGMFJJBVMKSOJS62JASEIC2763EUQ@2\m\maven-scm-plugin\target\local-repo\org\apache\maven\scm\maven-scm-client\1.9.6-SNAPSHOT\maven-scm-client-1.9.6-SNAPSHOT-jar-with-dependencies.jar
[windows-jdk9] [INFO] Installing F:\jenkins\jenkins-slave\workspace\maven-wip_maven-scm_master-ADXNUB4JTUUV5E57KMRFZSZVGMFJJBVMKSOJS62JASEIC2763EUQ@2\m\maven-scm-plugin\pom.xml to F:\jenkins\jenkins-slave\workspace\maven-wip_maven-scm_master-ADXNUB4JTUUV5E57KMRFZSZVGMFJJBVMKSOJS62JASEIC2763EUQ@2\m\maven-scm-plugin\target\local-repo\org\apache\maven\plugins\maven-scm-plugin\1.9.6-SNAPSHOT\maven-scm-plugin-1.9.6-SNAPSHOT.pom
[windows-jdk9] [INFO] Installing F:\jenkins\jenkins-slave\workspace\maven-wip_maven-scm_master-ADXNUB4JTUUV5E57KMRFZSZVGMFJJBVMKSOJS62JASEIC2763EUQ@2\m\maven-scm-plugin\target\maven-scm-plugin-1.9.6-SNAPSHOT.jar to F:\jenkins\jenkins-slave\workspace\maven-wip_maven-scm_master-ADXNUB4JTUUV5E57KMRFZSZVGMFJJBVMKSOJS62JASEIC2763EUQ@2\m\maven-scm-plugin\target\local-repo\org\apache\maven\plugins\maven-scm-plugin\1.9.6-SNAPSHOT\maven-scm-plugin-1.9.6-SNAPSHOT.jar
[windows-jdk9] [INFO] 
[windows-jdk9] [INFO] --- maven-invoker-plugin:2.0.0:run (integration-test) @ maven-scm-plugin ---
[windows-jdk9] [INFO] No projects were selected for execution.
[windows-jdk9] [INFO] 
[windows-jdk9] [INFO] --- maven-checkstyle-plugin:2.15:check (checkstyle-check) @ maven-scm-plugin ---
[windows-jdk9] [INFO] There are 5 errors reported by Checkstyle 6.1.1 with config/maven_checks.xml ruleset.
[windows-jdk9] [ERROR] src\main\java\org\apache\maven\scm\plugin\BootstrapMojo.java[3] (header) RegexpHeader: Line does not match expected header line of '^/\*\s*$'.
[windows-jdk9] [ERROR] src\main\java\org\apache\maven\scm\plugin\BootstrapMojo.java[72:53] (whitespace) WhitespaceAround: '=' is not preceded with whitespace.
[windows-jdk9] [ERROR] src\main\java\org\apache\maven\scm\plugin\BootstrapMojo.java[72:54] (whitespace) WhitespaceAround: '=' is not followed by whitespace.
[windows-jdk9] [ERROR] src\main\java\org\apache\maven\scm\plugin\BootstrapMojo.java[72:69] (whitespace) ParenPad: ')' is not preceded with whitespace.
[windows-jdk9] [ERROR] src\main\java\org\apache\maven\scm\plugin\BootstrapMojo.java[120:39] (whitespace) WhitespaceAfter: ';' is not followed by whitespace.
[windows-jdk9] [WARNING] checkstyle:check violations detected but failOnViolation set to false
[windows-jdk9] [INFO] ------------------------------------------------------------------------
[windows-jdk9] [INFO] Reactor Summary:
[windows-jdk9] [INFO] 
[windows-jdk9] [INFO] Maven SCM .......................................... SUCCESS [ 17.287 s]
[windows-jdk9] [INFO] Maven SCM API ...................................... SUCCESS [ 10.598 s]
[windows-jdk9] [INFO] Maven SCM Managers ................................. SUCCESS [  1.648 s]
[windows-jdk9] [INFO] Maven SCM Manager for Plexus ....................... SUCCESS [  2.959 s]
[windows-jdk9] [INFO] Maven SCM Test ..................................... SUCCESS [  4.787 s]
[windows-jdk9] [INFO] Maven SCM Providers ................................ SUCCESS [  1.240 s]
[windows-jdk9] [INFO] Maven SCM AccuRev Provider ......................... SUCCESS [  7.268 s]
[windows-jdk9] [INFO] Maven SCM Bazaar Provider .......................... SUCCESS [  3.532 s]
[windows-jdk9] [INFO] Maven SCM Clearcase Provider ....................... SUCCESS [  5.283 s]
[windows-jdk9] [INFO] Maven SCM CVS Provider - Parent .................... SUCCESS [  0.844 s]
[windows-jdk9] [INFO] Maven SCM CVS Provider TCK tests ................... SUCCESS [  1.545 s]
[windows-jdk9] [INFO] Maven SCM CVS Provider - Common library ............ SUCCESS [  3.887 s]
[windows-jdk9] [INFO] Maven SCM CVS Provider - CVS Executable Impl. ...... SUCCESS [  3.068 s]
[windows-jdk9] [INFO] Maven SCM CVS Provider - CVS Java Impl. ............ SUCCESS [  3.633 s]
[windows-jdk9] [INFO] Maven SCM Mercurial (Hg) Provider .................. SUCCESS [  3.920 s]
[windows-jdk9] [INFO] Maven SCM Git Provider - Parent .................... SUCCESS [  0.816 s]
[windows-jdk9] [INFO] Maven SCM Git Provider - Common library ............ SUCCESS [  2.860 s]
[windows-jdk9] [INFO] Maven SCM Git Provider TCK Tests ................... SUCCESS [  1.707 s]
[windows-jdk9] [INFO] Maven SCM Git Provider - Git Executable Impl. ...... SUCCESS [  5.596 s]
[windows-jdk9] [INFO] Maven SCM Git Provider - JGit Impl. ................ SUCCESS [ 21.979 s]
[windows-jdk9] [INFO] Maven SCM Local Provider ........................... SUCCESS [  3.340 s]
[windows-jdk9] [INFO] Maven SCM Perforce Provider ........................ SUCCESS [  4.237 s]
[windows-jdk9] [INFO] Maven SCM Starteam Provider ........................ SUCCESS [  5.772 s]
[windows-jdk9] [INFO] Maven SCM Subversion Provider - Parent ............. SUCCESS [  1.089 s]
[windows-jdk9] [INFO] Maven SCM Subversion Provider - Common library ..... SUCCESS [  3.332 s]
[windows-jdk9] [INFO] Maven SCM Subversion Provider TCK Tests ............ SUCCESS [  1.268 s]
[windows-jdk9] [INFO] Maven SCM Subversion Provider - SVN Executable Impl. SUCCESS [  6.269 s]
[windows-jdk9] [INFO] Maven SCM Synergy Provider ......................... SUCCESS [  3.535 s]
[windows-jdk9] [INFO] Maven SCM Visual Source Safe Provider .............. SUCCESS [  4.005 s]
[windows-jdk9] [INFO] Maven SCM TFS Provider ............................. SUCCESS [  3.379 s]
[windows-jdk9] [INFO] Maven SCM MKS Integrity Provider ................... SUCCESS [  4.389 s]
[windows-jdk9] [INFO] Maven SCM Jazz/Rational Team Concert Provider ...... SUCCESS [  3.880 s]
[windows-jdk9] [INFO] Maven SCM Standard Providers ....................... SUCCESS [  2.046 s]
[windows-jdk9] [INFO] Maven SCM Client ................................... SUCCESS [  3.820 s]
[windows-jdk9] [INFO] Maven SCM Plugin ................................... SUCCESS [ 29.954 s]
[windows-jdk9] [INFO] ------------------------------------------------------------------------
[windows-jdk9] [INFO] BUILD SUCCESS
[windows-jdk9] [INFO] ------------------------------------------------------------------------
[windows-jdk9] [INFO] Total time: 03:06 min
[windows-jdk9] [INFO] Finished at: 2018-03-03T10:10:50Z
[windows-jdk9] [INFO] Final Memory: 59M/197M
[windows-jdk9] [INFO] ------------------------------------------------------------------------
[windows-jdk9] [WARNING] The requested profile "run-its" could not be activated because it does not exist.
[windows-jdk9] [INFO] [jenkins-event-spy] Generated F:\jenkins\jenkins-slave\workspace\maven-wip_maven-scm_master-ADXNUB4JTUUV5E57KMRFZSZVGMFJJBVMKSOJS62JASEIC2763EUQ@2@tmp\withMavenb83d6726\maven-spy-20180303-100743-7816849515093217069655.log
[Pipeline] [windows-jdk9] }
[Pipeline] [windows-jdk9] // dir
[Pipeline] [windows-jdk9] }
[windows-jdk9] [withMaven] invokerPublisher - Archive invoker results for Maven artifact MavenArtifact{org.apache.maven.plugins:maven-scm-plugin::1.9.6-SNAPSHOT(version: 1.9.6-SNAPSHOT, snapshot:false) } generated by PluginInvocation{org.apache.maven.plugins:maven-invoker-plugin:2.0.0@run  integration-test}: m\maven-scm-plugin\target\invoker-reports\*.xml
[windows-jdk9] performing MavenInvokerRecorder, reportsFilenamePattern:'**/m\maven-scm-plugin\target\invoker-reports/BUILD*.xml', invokerBuildDir:'**/m\maven-scm-plugin\target\it'
[windows-jdk9] Found reports:[]
[windows-jdk9] Found logs:[]
[windows-jdk9] Finished parsing Maven Invoker results (found 0)
[windows-jdk9] [withMaven] junitPublisher - Archive test results for Maven artifact org.apache.maven.scm:maven-scm-api:1.9.6-SNAPSHOT generated by maven-surefire-plugin:test (default-test): m\maven-scm-api\target\surefire-reports\*.xml
[windows-jdk9] [withMaven] junitPublisher - Jenkins JUnit Attachments Plugin not found, can't publish test attachments.Recording test results
[windows-jdk9] [withMaven] junitPublisher - Archive test results for Maven artifact org.apache.maven.scm:maven-scm-manager-plexus:1.9.6-SNAPSHOT generated by maven-surefire-plugin:test (default-test): m\maven-scm-managers\maven-scm-manager-plexus\target\surefire-reports\*.xml
[windows-jdk9] [withMaven] junitPublisher - Jenkins JUnit Attachments Plugin not found, can't publish test attachments.Recording test results
[windows-jdk9] None of the test reports contained any result
[windows-jdk9] [withMaven] junitPublisher - Archive test results for Maven artifact org.apache.maven.scm:maven-scm-test:1.9.6-SNAPSHOT generated by maven-surefire-plugin:test (default-test): m\maven-scm-test\target\surefire-reports\*.xml
[windows-jdk9] [withMaven] junitPublisher - Jenkins JUnit Attachments Plugin not found, can't publish test attachments.Recording test results
[windows-jdk9] [withMaven] junitPublisher - Archive test results for Maven artifact org.apache.maven.scm:maven-scm-provider-accurev:1.9.6-SNAPSHOT generated by maven-surefire-plugin:test (default-test): m\maven-scm-providers\maven-scm-provider-accurev\target\surefire-reports\*.xml
[windows-jdk9] [withMaven] junitPublisher - Jenkins JUnit Attachments Plugin not found, can't publish test attachments.Recording test results
[windows-jdk9] [withMaven] junitPublisher - Archive test results for Maven artifact org.apache.maven.scm:maven-scm-provider-bazaar:1.9.6-SNAPSHOT generated by maven-surefire-plugin:test (default-test): m\maven-scm-providers\maven-scm-provider-bazaar\target\surefire-reports\*.xml
[windows-jdk9] [withMaven] junitPublisher - Jenkins JUnit Attachments Plugin not found, can't publish test attachments.Recording test results
[windows-jdk9] [withMaven] junitPublisher - Archive test results for Maven artifact org.apache.maven.scm:maven-scm-provider-clearcase:1.9.6-SNAPSHOT generated by maven-surefire-plugin:test (default-test): m\maven-scm-providers\maven-scm-provider-clearcase\target\surefire-reports\*.xml
[windows-jdk9] [withMaven] junitPublisher - Jenkins JUnit Attachments Plugin not found, can't publish test attachments.Recording test results
[windows-jdk9] [withMaven] junitPublisher - Archive test results for Maven artifact org.apache.maven.scm:maven-scm-provider-cvstest:1.9.6-SNAPSHOT generated by maven-surefire-plugin:test (default-test): m\maven-scm-providers\maven-scm-providers-cvs\maven-scm-provider-cvstest\target\surefire-reports\*.xml
[windows-jdk9] [withMaven] junitPublisher - Jenkins JUnit Attachments Plugin not found, can't publish test attachments.Recording test results
[windows-jdk9] None of the test reports contained any result
[windows-jdk9] [withMaven] junitPublisher - Archive test results for Maven artifact org.apache.maven.scm:maven-scm-provider-cvs-commons:1.9.6-SNAPSHOT generated by maven-surefire-plugin:test (default-test): m\maven-scm-providers\maven-scm-providers-cvs\maven-scm-provider-cvs-commons\target\surefire-reports\*.xml
[windows-jdk9] [withMaven] junitPublisher - Jenkins JUnit Attachments Plugin not found, can't publish test attachments.Recording test results
[windows-jdk9] [withMaven] junitPublisher - Archive test results for Maven artifact org.apache.maven.scm:maven-scm-provider-cvsexe:1.9.6-SNAPSHOT generated by maven-surefire-plugin:test (default-test): m\maven-scm-providers\maven-scm-providers-cvs\maven-scm-provider-cvsexe\target\surefire-reports\*.xml
[windows-jdk9] [withMaven] junitPublisher - Jenkins JUnit Attachments Plugin not found, can't publish test attachments.Recording test results
[windows-jdk9] [withMaven] junitPublisher - Archive test results for Maven artifact org.apache.maven.scm:maven-scm-provider-cvsjava:1.9.6-SNAPSHOT generated by maven-surefire-plugin:test (default-test): m\maven-scm-providers\maven-scm-providers-cvs\maven-scm-provider-cvsjava\target\surefire-reports\*.xml
[windows-jdk9] [withMaven] junitPublisher - Jenkins JUnit Attachments Plugin not found, can't publish test attachments.Recording test results
[windows-jdk9] [withMaven] junitPublisher - Archive test results for Maven artifact org.apache.maven.scm:maven-scm-provider-hg:1.9.6-SNAPSHOT generated by maven-surefire-plugin:test (default-test): m\maven-scm-providers\maven-scm-provider-hg\target\surefire-reports\*.xml
[windows-jdk9] [withMaven] junitPublisher - Jenkins JUnit Attachments Plugin not found, can't publish test attachments.Recording test results
[windows-jdk9] [withMaven] junitPublisher - Archive test results for Maven artifact org.apache.maven.scm:maven-scm-provider-git-commons:1.9.6-SNAPSHOT generated by maven-surefire-plugin:test (default-test): m\maven-scm-providers\maven-scm-providers-git\maven-scm-provider-git-commons\target\surefire-reports\*.xml
[windows-jdk9] [withMaven] junitPublisher - Jenkins JUnit Attachments Plugin not found, can't publish test attachments.Recording test results
[windows-jdk9] [withMaven] junitPublisher - Archive test results for Maven artifact org.apache.maven.scm:maven-scm-provider-gittest:1.9.6-SNAPSHOT generated by maven-surefire-plugin:test (default-test): m\maven-scm-providers\maven-scm-providers-git\maven-scm-provider-gittest\target\surefire-reports\*.xml
[windows-jdk9] [withMaven] junitPublisher - Jenkins JUnit Attachments Plugin not found, can't publish test attachments.Recording test results
[windows-jdk9] None of the test reports contained any result
[windows-jdk9] [withMaven] junitPublisher - Archive test results for Maven artifact org.apache.maven.scm:maven-scm-provider-gitexe:1.9.6-SNAPSHOT generated by maven-surefire-plugin:test (default-test): m\maven-scm-providers\maven-scm-providers-git\maven-scm-provider-gitexe\target\surefire-reports\*.xml
[windows-jdk9] [withMaven] junitPublisher - Jenkins JUnit Attachments Plugin not found, can't publish test attachments.Recording test results
[windows-jdk9] [withMaven] junitPublisher - Archive test results for Maven artifact org.apache.maven.scm:maven-scm-provider-jgit:1.9.6-SNAPSHOT generated by maven-surefire-plugin:test (default-test): m\maven-scm-providers\maven-scm-providers-git\maven-scm-provider-jgit\target\surefire-reports\*.xml
[windows-jdk9] [withMaven] junitPublisher - Jenkins JUnit Attachments Plugin not found, can't publish test attachments.Recording test results
[windows-jdk9] [withMaven] junitPublisher - Archive test results for Maven artifact org.apache.maven.scm:maven-scm-provider-local:1.9.6-SNAPSHOT generated by maven-surefire-plugin:test (default-test): m\maven-scm-providers\maven-scm-provider-local\target\surefire-reports\*.xml
[windows-jdk9] [withMaven] junitPublisher - Jenkins JUnit Attachments Plugin not found, can't publish test attachments.Recording test results
[windows-jdk9] [withMaven] junitPublisher - Archive test results for Maven artifact org.apache.maven.scm:maven-scm-provider-perforce:1.9.6-SNAPSHOT generated by maven-surefire-plugin:test (default-test): m\maven-scm-providers\maven-scm-provider-perforce\target\surefire-reports\*.xml
[windows-jdk9] [withMaven] junitPublisher - Jenkins JUnit Attachments Plugin not found, can't publish test attachments.Recording test results
[windows-jdk9] [withMaven] junitPublisher - Archive test results for Maven artifact org.apache.maven.scm:maven-scm-provider-starteam:1.9.6-SNAPSHOT generated by maven-surefire-plugin:test (default-test): m\maven-scm-providers\maven-scm-provider-starteam\target\surefire-reports\*.xml
[windows-jdk9] [withMaven] junitPublisher - Jenkins JUnit Attachments Plugin not found, can't publish test attachments.Recording test results
[windows-jdk9] [withMaven] junitPublisher - Archive test results for Maven artifact org.apache.maven.scm:maven-scm-provider-svn-commons:1.9.6-SNAPSHOT generated by maven-surefire-plugin:test (default-test): m\maven-scm-providers\maven-scm-providers-svn\maven-scm-provider-svn-commons\target\surefire-reports\*.xml
[windows-jdk9] [withMaven] junitPublisher - Jenkins JUnit Attachments Plugin not found, can't publish test attachments.Recording test results
[windows-jdk9] [withMaven] junitPublisher - Archive test results for Maven artifact org.apache.maven.scm:maven-scm-provider-svntest:1.9.6-SNAPSHOT generated by maven-surefire-plugin:test (default-test): m\maven-scm-providers\maven-scm-providers-svn\maven-scm-provider-svntest\target\surefire-reports\*.xml
[windows-jdk9] [withMaven] junitPublisher - Jenkins JUnit Attachments Plugin not found, can't publish test attachments.Recording test results
[windows-jdk9] None of the test reports contained any result
[windows-jdk9] [withMaven] junitPublisher - Archive test results for Maven artifact org.apache.maven.scm:maven-scm-provider-svnexe:1.9.6-SNAPSHOT generated by maven-surefire-plugin:test (default-test): m\maven-scm-providers\maven-scm-providers-svn\maven-scm-provider-svnexe\target\surefire-reports\*.xml
[windows-jdk9] [withMaven] junitPublisher - Jenkins JUnit Attachments Plugin not found, can't publish test attachments.Recording test results
[windows-jdk9] [withMaven] junitPublisher - Archive test results for Maven artifact org.apache.maven.scm:maven-scm-provider-synergy:1.9.6-SNAPSHOT generated by maven-surefire-plugin:test (default-test): m\maven-scm-providers\maven-scm-provider-synergy\target\surefire-reports\*.xml
[windows-jdk9] [withMaven] junitPublisher - Jenkins JUnit Attachments Plugin not found, can't publish test attachments.Recording test results
[windows-jdk9] [withMaven] junitPublisher - Archive test results for Maven artifact org.apache.maven.scm:maven-scm-provider-vss:1.9.6-SNAPSHOT generated by maven-surefire-plugin:test (default-test): m\maven-scm-providers\maven-scm-provider-vss\target\surefire-reports\*.xml
[windows-jdk9] [withMaven] junitPublisher - Jenkins JUnit Attachments Plugin not found, can't publish test attachments.Recording test results
[windows-jdk9] [withMaven] junitPublisher - Archive test results for Maven artifact org.apache.maven.scm:maven-scm-provider-tfs:1.9.6-SNAPSHOT generated by maven-surefire-plugin:test (default-test): m\maven-scm-providers\maven-scm-provider-tfs\target\surefire-reports\*.xml
[windows-jdk9] [withMaven] junitPublisher - Jenkins JUnit Attachments Plugin not found, can't publish test attachments.Recording test results
[windows-jdk9] [withMaven] junitPublisher - Archive test results for Maven artifact org.apache.maven.scm:maven-scm-provider-integrity:1.9.6-SNAPSHOT generated by maven-surefire-plugin:test (default-test): m\maven-scm-providers\maven-scm-provider-integrity\target\surefire-reports\*.xml
[windows-jdk9] [withMaven] junitPublisher - Jenkins JUnit Attachments Plugin not found, can't publish test attachments.Recording test results
[windows-jdk9] [withMaven] junitPublisher - Archive test results for Maven artifact org.apache.maven.scm:maven-scm-provider-jazz:1.9.6-SNAPSHOT generated by maven-surefire-plugin:test (default-test): m\maven-scm-providers\maven-scm-provider-jazz\target\surefire-reports\*.xml
[windows-jdk9] [withMaven] junitPublisher - Jenkins JUnit Attachments Plugin not found, can't publish test attachments.Recording test results
[windows-jdk9] [withMaven] junitPublisher - Archive test results for Maven artifact org.apache.maven.scm:maven-scm-client:1.9.6-SNAPSHOT generated by maven-surefire-plugin:test (default-test): m\maven-scm-client\target\surefire-reports\*.xml
[windows-jdk9] [withMaven] junitPublisher - Jenkins JUnit Attachments Plugin not found, can't publish test attachments.Recording test results
[windows-jdk9] None of the test reports contained any result
[windows-jdk9] [withMaven] junitPublisher - Archive test results for Maven artifact org.apache.maven.plugins:maven-scm-plugin:1.9.6-SNAPSHOT generated by maven-surefire-plugin:test (default-test): m\maven-scm-plugin\target\surefire-reports\*.xml
[windows-jdk9] [withMaven] junitPublisher - Jenkins JUnit Attachments Plugin not found, can't publish test attachments.Recording test results
[Pipeline] [windows-jdk9] // withMaven
[Pipeline] [windows-jdk9] }
[Pipeline] [windows-jdk9] // stage
[Pipeline] [windows-jdk9] }
[Pipeline] [windows-jdk9] // node
[Pipeline] [windows-jdk9] }
[Pipeline] // parallel
[Pipeline] stage
[Pipeline] { (Notifications)
[Pipeline] echo
Build result: UNSTABLE
[Pipeline] jiraIssueSelector
[Pipeline] emailext
Mime
  • Unnamed multipart/mixed (inline, None, 0 bytes)
View raw message