maven-notifications mailing list archives

Site index · List index
Message view « Date » · « Thread »
Top « Date » · « Thread »
From Apache Jenkins Server <jenk...@builds.apache.org>
Subject Build failed in Jenkins: Maven TLP » maven-compiler-plugin » master #6
Date Tue, 13 Mar 2018 12:16:43 GMT
See https://builds.apache.org/job/maven-box/job/maven-compiler-plugin/job/master/6/

Changes:

* add some debug for ASF Jenkins failure

All tests passed

Build log:
[...truncated 1.08 MB...]
[windows-jdk9] [DEBUG]   (f) showDeprecation = false
[windows-jdk9] [DEBUG]   (f) showWarnings = false
[windows-jdk9] [DEBUG]   (f) skipMultiThreadWarning = false
[windows-jdk9] [DEBUG]   (f) source = 1.7
[windows-jdk9] [DEBUG]   (f) staleMillis = 0
[windows-jdk9] [DEBUG]   (f) target = 1.7
[windows-jdk9] [DEBUG]   (f) useIncrementalCompilation = true
[windows-jdk9] [DEBUG]   (f) verbose = false
[windows-jdk9] [DEBUG] -- end configuration --
[windows-jdk9] [DEBUG] Using compiler 'javac'.
[windows-jdk9] [DEBUG] Adding F:\jenkins\jenkins-slave\workspace\aven-compiler-plugin_master-ZJAT6KVU5YD2ZHLXVB5R3ACA7QPEPYTMSCTEWBA7FHQAS4NXT2KQ\m\target\it\MCOMPILER-192\target\generated-sources\annotations
to compile source roots:
[windows-jdk9]   F:\jenkins\jenkins-slave\workspace\aven-compiler-plugin_master-ZJAT6KVU5YD2ZHLXVB5R3ACA7QPEPYTMSCTEWBA7FHQAS4NXT2KQ\m\target\it\MCOMPILER-192\src\main\java
[windows-jdk9] [DEBUG] New compile source roots:
[windows-jdk9]   F:\jenkins\jenkins-slave\workspace\aven-compiler-plugin_master-ZJAT6KVU5YD2ZHLXVB5R3ACA7QPEPYTMSCTEWBA7FHQAS4NXT2KQ\m\target\it\MCOMPILER-192\src\main\java
[windows-jdk9]   F:\jenkins\jenkins-slave\workspace\aven-compiler-plugin_master-ZJAT6KVU5YD2ZHLXVB5R3ACA7QPEPYTMSCTEWBA7FHQAS4NXT2KQ\m\target\it\MCOMPILER-192\target\generated-sources\annotations
[windows-jdk9] [DEBUG] CompilerReuseStrategy: reuseCreated
[windows-jdk9] [DEBUG] useIncrementalCompilation enabled
[windows-jdk9] [DEBUG] Stale source detected: F:\jenkins\jenkins-slave\workspace\aven-compiler-plugin_master-ZJAT6KVU5YD2ZHLXVB5R3ACA7QPEPYTMSCTEWBA7FHQAS4NXT2KQ\m\target\it\MCOMPILER-192\src\main\java\dummy\HelloWorld.java
[windows-jdk9] [INFO] Changes detected - recompiling the module!
[windows-jdk9] [DEBUG] Classpath:
[windows-jdk9] [DEBUG]  F:\jenkins\jenkins-slave\workspace\aven-compiler-plugin_master-ZJAT6KVU5YD2ZHLXVB5R3ACA7QPEPYTMSCTEWBA7FHQAS4NXT2KQ\m\target\it\MCOMPILER-192\target\classes
[windows-jdk9] [DEBUG] Source roots:
[windows-jdk9] [DEBUG]  F:\jenkins\jenkins-slave\workspace\aven-compiler-plugin_master-ZJAT6KVU5YD2ZHLXVB5R3ACA7QPEPYTMSCTEWBA7FHQAS4NXT2KQ\m\target\it\MCOMPILER-192\src\main\java
[windows-jdk9] [DEBUG]  F:\jenkins\jenkins-slave\workspace\aven-compiler-plugin_master-ZJAT6KVU5YD2ZHLXVB5R3ACA7QPEPYTMSCTEWBA7FHQAS4NXT2KQ\m\target\it\MCOMPILER-192\target\generated-sources\annotations
[windows-jdk9] [DEBUG] Command line options:
[windows-jdk9] [DEBUG] -d F:\jenkins\jenkins-slave\workspace\aven-compiler-plugin_master-ZJAT6KVU5YD2ZHLXVB5R3ACA7QPEPYTMSCTEWBA7FHQAS4NXT2KQ\m\target\it\MCOMPILER-192\target\classes
-classpath F:\jenkins\jenkins-slave\workspace\aven-compiler-plugin_master-ZJAT6KVU5YD2ZHLXVB5R3ACA7QPEPYTMSCTEWBA7FHQAS4NXT2KQ\m\target\it\MCOMPILER-192\target\classes;
-sourcepath F:\jenkins\jenkins-slave\workspace\aven-compiler-plugin_master-ZJAT6KVU5YD2ZHLXVB5R3ACA7QPEPYTMSCTEWBA7FHQAS4NXT2KQ\m\target\it\MCOMPILER-192\src\main\java;F:\jenkins\jenkins-slave\workspace\aven-compiler-plugin_master-ZJAT6KVU5YD2ZHLXVB5R3ACA7QPEPYTMSCTEWBA7FHQAS4NXT2KQ\m\target\it\MCOMPILER-192\target\generated-sources\annotations;
F:\jenkins\jenkins-slave\workspace\aven-compiler-plugin_master-ZJAT6KVU5YD2ZHLXVB5R3ACA7QPEPYTMSCTEWBA7FHQAS4NXT2KQ\m\target\it\MCOMPILER-192\src\main\java\dummy\HelloWorld.java
F:\jenkins\jenkins-slave\workspace\aven-compiler-plugin_master-ZJAT6KVU5YD2ZHLXVB5R3ACA7QPEPYTMSCTEWBA7FHQAS4NXT2KQ\m\target\it\MCOMPILER-192\src\main\java\dummy\license.txt
-s F:\jenkins\jenkins-slave\workspace\aven-compiler-plugin_master-ZJAT6KVU5YD2ZHLXVB5R3ACA7QPEPYTMSCTEWBA7FHQAS4NXT2KQ\m\target\it\MCOMPILER-192\target\generated-sources\annotations
-g -nowarn -target 1.7 -source 1.7
[windows-jdk9] [WARNING] File encoding has not been set, using platform encoding Cp1252, i.e.
build is platform dependent!
[windows-jdk9] [DEBUG] incrementalBuildHelper#beforeRebuildExecution
[windows-jdk9] [INFO] Compiling 2 source files to F:\jenkins\jenkins-slave\workspace\aven-compiler-plugin_master-ZJAT6KVU5YD2ZHLXVB5R3ACA7QPEPYTMSCTEWBA7FHQAS4NXT2KQ\m\target\it\MCOMPILER-192\target\classes
[windows-jdk9] [DEBUG] incrementalBuildHelper#afterRebuildExecution
[windows-jdk9] [INFO] ------------------------------------------------------------------------
[windows-jdk9] [INFO] BUILD FAILURE
[windows-jdk9] [INFO] ------------------------------------------------------------------------
[windows-jdk9] [INFO] Total time: 1.970 s
[windows-jdk9] [INFO] Finished at: 2018-03-13T12:13:33Z
[windows-jdk9] [INFO] Final Memory: 10M/34M
[windows-jdk9] [INFO] ------------------------------------------------------------------------
[windows-jdk9] [ERROR] Failed to execute goal org.apache.maven.plugins:maven-compiler-plugin:3.7.1-SNAPSHOT:compile
(default-compile) on project blah: Compilation failure -> [Help 1]
[windows-jdk9] org.apache.maven.lifecycle.LifecycleExecutionException: Failed to execute goal
org.apache.maven.plugins:maven-compiler-plugin:3.7.1-SNAPSHOT:compile (default-compile) on
project blah: Compilation failure
[windows-jdk9] 	at org.apache.maven.lifecycle.internal.MojoExecutor.execute(MojoExecutor.java:213)
[windows-jdk9] 	at org.apache.maven.lifecycle.internal.MojoExecutor.execute(MojoExecutor.java:154)
[windows-jdk9] 	at org.apache.maven.lifecycle.internal.MojoExecutor.execute(MojoExecutor.java:146)
[windows-jdk9] 	at org.apache.maven.lifecycle.internal.LifecycleModuleBuilder.buildProject(LifecycleModuleBuilder.java:117)
[windows-jdk9] 	at org.apache.maven.lifecycle.internal.LifecycleModuleBuilder.buildProject(LifecycleModuleBuilder.java:81)
[windows-jdk9] 	at org.apache.maven.lifecycle.internal.builder.singlethreaded.SingleThreadedBuilder.build(SingleThreadedBuilder.java:51)
[windows-jdk9] 	at org.apache.maven.lifecycle.internal.LifecycleStarter.execute(LifecycleStarter.java:128)
[windows-jdk9] 	at org.apache.maven.DefaultMaven.doExecute(DefaultMaven.java:309)
[windows-jdk9] 	at org.apache.maven.DefaultMaven.doExecute(DefaultMaven.java:194)
[windows-jdk9] 	at org.apache.maven.DefaultMaven.execute(DefaultMaven.java:107)
[windows-jdk9] 	at org.apache.maven.cli.MavenCli.execute(MavenCli.java:993)
[windows-jdk9] 	at org.apache.maven.cli.MavenCli.doMain(MavenCli.java:345)
[windows-jdk9] 	at org.apache.maven.cli.MavenCli.main(MavenCli.java:191)
[windows-jdk9] 	at java.base/jdk.internal.reflect.NativeMethodAccessorImpl.invoke0(Native
Method)
[windows-jdk9] 	at java.base/jdk.internal.reflect.NativeMethodAccessorImpl.invoke(NativeMethodAccessorImpl.java:62)
[windows-jdk9] 	at java.base/jdk.internal.reflect.DelegatingMethodAccessorImpl.invoke(DelegatingMethodAccessorImpl.java:43)
[windows-jdk9] 	at java.base/java.lang.reflect.Method.invoke(Method.java:564)
[windows-jdk9] 	at org.codehaus.plexus.classworlds.launcher.Launcher.launchEnhanced(Launcher.java:289)
[windows-jdk9] 	at org.codehaus.plexus.classworlds.launcher.Launcher.launch(Launcher.java:229)
[windows-jdk9] 	at org.codehaus.plexus.classworlds.launcher.Launcher.mainWithExitCode(Launcher.java:415)
[windows-jdk9] 	at org.codehaus.plexus.classworlds.launcher.Launcher.main(Launcher.java:356)
[windows-jdk9] Caused by: org.apache.maven.plugin.compiler.CompilationFailureException: Compilation
failure
[windows-jdk9] 	at org.apache.maven.plugin.compiler.AbstractCompilerMojo.execute(AbstractCompilerMojo.java:1165)
[windows-jdk9] 	at org.apache.maven.plugin.compiler.CompilerMojo.execute(CompilerMojo.java:168)
[windows-jdk9] 	at org.apache.maven.plugin.DefaultBuildPluginManager.executeMojo(DefaultBuildPluginManager.java:134)
[windows-jdk9] 	at org.apache.maven.lifecycle.internal.MojoExecutor.execute(MojoExecutor.java:208)
[windows-jdk9] 	... 20 more
[windows-jdk9] [ERROR] 
[windows-jdk9] [ERROR] 
[windows-jdk9] [ERROR] For more information about the errors and possible solutions, please
read the following articles:
[windows-jdk9] [ERROR] [Help 1] http://cwiki.apache.org/confluence/display/MAVEN/MojoFailureException
[windows-jdk9] Running post-build script: f:\jenkins\jenkins-slave\workspace\aven-compiler-plugin_master-ZJAT6KVU5YD2ZHLXVB5R3ACA7QPEPYTMSCTEWBA7FHQAS4NXT2KQ\m\target\it\MCOMPILER-192\verify.groovy
[windows-jdk9] 
[windows-jdk9] [INFO] Building: MCOMPILER-197\pom.xml
[windows-jdk9] [INFO] run post-build script verify.groovy
[windows-jdk9] [INFO]           MCOMPILER-197\pom.xml ............................ FAILED
(5.3 s)
[windows-jdk9] [INFO]   The post-build script did not succeed. assert sourceFile.exists()
[windows-jdk9]        |          |
[windows-jdk9]        |          false
[windows-jdk9]        f:\jenkins\jenkins-slave\workspace\aven-compiler-plugin_master-ZJAT6KVU5YD2ZHLXVB5R3ACA7QPEPYTMSCTEWBA7FHQAS4NXT2KQ\m\target\it\MCOMPILER-197\target\generated-sources\org\issue\Person_.java
[windows-jdk9] [INFO] Building: MCOMPILER-203-processorpath\pom.xml
[windows-jdk9] [INFO]           MCOMPILER-203-processorpath\pom.xml .............. SUCCESS
(13.9 s)
[windows-jdk9] [INFO] Building: mcompiler-21_class-remove\pom.xml
[windows-jdk9] [INFO] run post-build script verify.groovy
[windows-jdk9] [INFO]           mcompiler-21_class-remove\pom.xml ................ SUCCESS
(15.8 s)
[windows-jdk9] [INFO] Building: mcompiler-21_methodname-change\pom.xml
[windows-jdk9] [INFO] run post-build script verify.groovy
[windows-jdk9] [INFO]           mcompiler-21_methodname-change\pom.xml ........... SUCCESS
(16.2 s)
[windows-jdk9] [INFO] Building: MCOMPILER-224\pom.xml
[windows-jdk9] [INFO] run post-build script verify.groovy
[windows-jdk9] [INFO]           MCOMPILER-224\pom.xml ............................ SUCCESS
(5.6 s)
[windows-jdk9] [INFO] Building: MCOMPILER-228\pom.xml
[windows-jdk9] [INFO]           MCOMPILER-228\pom.xml ............................ SUCCESS
(5.2 s)
[windows-jdk9] [INFO] Building: MCOMPILER-260_customArguments\pom.xml
[windows-jdk9] [INFO]           MCOMPILER-260_customArguments\pom.xml ............ SUCCESS
(5.2 s)
[windows-jdk9] [INFO] Building: MCOMPILER-268_modulepath\pom.xml
[windows-jdk9] [INFO] run post-build script verify.groovy
[windows-jdk9] [INFO]           MCOMPILER-268_modulepath\pom.xml ................. SUCCESS
(6.8 s)
[windows-jdk9] [INFO] Building: MCOMPILER-270_release\pom.xml
[windows-jdk9] [INFO] run post-build script verify.groovy
[windows-jdk9] [INFO]           MCOMPILER-270_release\pom.xml .................... SUCCESS
(5.2 s)
[windows-jdk9] [INFO] Building: MCOMPILER-275_separate-moduleinfo\pom.xml
[windows-jdk9] [INFO] run post-build script verify.groovy
[windows-jdk9] [INFO]           MCOMPILER-275_separate-moduleinfo\pom.xml ........ SUCCESS
(5.6 s)
[windows-jdk9] [INFO] Building: MCOMPILER-284\pom.xml
[windows-jdk9] [INFO] run post-build script verify.bsh
[windows-jdk9] [INFO]           MCOMPILER-284\pom.xml ............................ SUCCESS
(4.2 s)
[windows-jdk9] [INFO] Building: MCOMPILER-294\pom.xml
[windows-jdk9] [INFO]           MCOMPILER-294\pom.xml ............................ SUCCESS
(5.5 s)
[windows-jdk9] [INFO] Building: MCOMPILER-298\pom.xml
[windows-jdk9] [INFO]           MCOMPILER-298\pom.xml ............................ SUCCESS
(7.5 s)
[windows-jdk9] [INFO] Building: non-english-warnings\pom.xml
[windows-jdk9] [INFO] run post-build script verify.bsh
[windows-jdk9] [INFO]           non-english-warnings\pom.xml ..................... SUCCESS
(5.2 s)
[windows-jdk9] [INFO] Building: test1\pom.xml
[windows-jdk9] [INFO]           test1\pom.xml .................................... SUCCESS
(5.7 s)
[windows-jdk9] [INFO] 
[windows-jdk9] [INFO] --- maven-checkstyle-plugin:3.0.0:check (checkstyle-check) @ maven-compiler-plugin
---
[windows-jdk9] [INFO] Downloading: https://repo.maven.apache.org/maven2/org/apache/maven/shared/maven-shared-resources/2/maven-shared-resources-2.pom
[windows-jdk9] [INFO] Downloaded: https://repo.maven.apache.org/maven2/org/apache/maven/shared/maven-shared-resources/2/maven-shared-resources-2.pom
(3.0 kB at 95 kB/s)
[windows-jdk9] [INFO] Downloading: https://repo.maven.apache.org/maven2/org/codehaus/plexus/plexus-utils/3.0.10/plexus-utils-3.0.10.pom
[windows-jdk9] [INFO] Downloaded: https://repo.maven.apache.org/maven2/org/codehaus/plexus/plexus-utils/3.0.10/plexus-utils-3.0.10.pom
(3.1 kB at 112 kB/s)
[windows-jdk9] [INFO] Downloading: https://repo.maven.apache.org/maven2/org/codehaus/plexus/plexus/3.3/plexus-3.3.pom
[windows-jdk9] [INFO] Downloaded: https://repo.maven.apache.org/maven2/org/codehaus/plexus/plexus/3.3/plexus-3.3.pom
(20 kB at 663 kB/s)
[windows-jdk9] [INFO] Downloading: https://repo.maven.apache.org/maven2/org/apache/maven/doxia/doxia-integration-tools/1.6/doxia-integration-tools-1.6.pom
[windows-jdk9] [INFO] Downloaded: https://repo.maven.apache.org/maven2/org/apache/maven/doxia/doxia-integration-tools/1.6/doxia-integration-tools-1.6.pom
(7.0 kB at 248 kB/s)
[windows-jdk9] [INFO] Downloading: https://repo.maven.apache.org/maven2/org/apache/maven/doxia/doxia-tools/3/doxia-tools-3.pom
[windows-jdk9] [INFO] Downloaded: https://repo.maven.apache.org/maven2/org/apache/maven/doxia/doxia-tools/3/doxia-tools-3.pom
(9.9 kB at 331 kB/s)
[windows-jdk9] [INFO] Downloading: https://repo.maven.apache.org/maven2/org/codehaus/plexus/plexus-resources/1.1.0/plexus-resources-1.1.0.pom
[windows-jdk9] [INFO] Downloaded: https://repo.maven.apache.org/maven2/org/codehaus/plexus/plexus-resources/1.1.0/plexus-resources-1.1.0.pom
(3.2 kB at 118 kB/s)
[windows-jdk9] [INFO] Downloading: https://repo.maven.apache.org/maven2/com/puppycrawl/tools/checkstyle/6.18/checkstyle-6.18.pom
[windows-jdk9] [INFO] Downloaded: https://repo.maven.apache.org/maven2/com/puppycrawl/tools/checkstyle/6.18/checkstyle-6.18.pom
(71 kB at 2.0 MB/s)
[windows-jdk9] [INFO] Downloading: https://repo.maven.apache.org/maven2/antlr/antlr/2.7.7/antlr-2.7.7.pom
[windows-jdk9] [INFO] Downloaded: https://repo.maven.apache.org/maven2/antlr/antlr/2.7.7/antlr-2.7.7.pom
(632 B at 21 kB/s)
[windows-jdk9] [INFO] Downloading: https://repo.maven.apache.org/maven2/org/antlr/antlr4-runtime/4.5.3/antlr4-runtime-4.5.3.pom
[windows-jdk9] [INFO] Downloaded: https://repo.maven.apache.org/maven2/org/antlr/antlr4-runtime/4.5.3/antlr4-runtime-4.5.3.pom
(2.3 kB at 75 kB/s)
[windows-jdk9] [INFO] Downloading: https://repo.maven.apache.org/maven2/org/antlr/antlr4-master/4.5.3/antlr4-master-4.5.3.pom
[windows-jdk9] [INFO] Downloaded: https://repo.maven.apache.org/maven2/org/antlr/antlr4-master/4.5.3/antlr4-master-4.5.3.pom
(3.7 kB at 105 kB/s)
[windows-jdk9] [INFO] Downloading: https://repo.maven.apache.org/maven2/commons-beanutils/commons-beanutils/1.9.2/commons-beanutils-1.9.2.pom
[windows-jdk9] [INFO] Downloaded: https://repo.maven.apache.org/maven2/commons-beanutils/commons-beanutils/1.9.2/commons-beanutils-1.9.2.pom
(14 kB at 493 kB/s)
[windows-jdk9] [INFO] Downloading: https://repo.maven.apache.org/maven2/org/apache/commons/commons-parent/33/commons-parent-33.pom
[windows-jdk9] [INFO] Downloaded: https://repo.maven.apache.org/maven2/org/apache/commons/commons-parent/33/commons-parent-33.pom
(53 kB at 1.8 MB/s)
[windows-jdk9] [INFO] Downloading: https://repo.maven.apache.org/maven2/commons-cli/commons-cli/1.3.1/commons-cli-1.3.1.pom
[windows-jdk9] [INFO] Downloaded: https://repo.maven.apache.org/maven2/commons-cli/commons-cli/1.3.1/commons-cli-1.3.1.pom
(10 kB at 385 kB/s)
[windows-jdk9] [INFO] Downloading: https://repo.maven.apache.org/maven2/com/google/guava/guava/19.0/guava-19.0.pom
[windows-jdk9] [INFO] Downloaded: https://repo.maven.apache.org/maven2/com/google/guava/guava/19.0/guava-19.0.pom
(6.8 kB at 243 kB/s)
[windows-jdk9] [INFO] Downloading: https://repo.maven.apache.org/maven2/com/google/guava/guava-parent/19.0/guava-parent-19.0.pom
[windows-jdk9] [INFO] Downloaded: https://repo.maven.apache.org/maven2/com/google/guava/guava-parent/19.0/guava-parent-19.0.pom
(9.9 kB at 341 kB/s)
[windows-jdk9] [INFO] Downloading: https://repo.maven.apache.org/maven2/org/sonatype/oss/oss-parent/7/oss-parent-7.pom
[windows-jdk9] [INFO] Downloaded: https://repo.maven.apache.org/maven2/org/sonatype/oss/oss-parent/7/oss-parent-7.pom
(4.8 kB at 179 kB/s)
[windows-jdk9] [INFO] Downloading: https://repo.maven.apache.org/maven2/javax/xml/bind/jaxb-api/2.3.0/jaxb-api-2.3.0.pom
[windows-jdk9] [INFO] Downloaded: https://repo.maven.apache.org/maven2/javax/xml/bind/jaxb-api/2.3.0/jaxb-api-2.3.0.pom
(23 kB at 793 kB/s)
[windows-jdk9] [INFO] Downloading: https://repo.maven.apache.org/maven2/javax/xml/bind/jaxb-api-parent/2.3.0/jaxb-api-parent-2.3.0.pom
[windows-jdk9] [INFO] Downloaded: https://repo.maven.apache.org/maven2/javax/xml/bind/jaxb-api-parent/2.3.0/jaxb-api-parent-2.3.0.pom
(5.6 kB at 209 kB/s)
[windows-jdk9] [INFO] Downloading: https://repo.maven.apache.org/maven2/net/java/jvnet-parent/5/jvnet-parent-5.pom
[windows-jdk9] [INFO] Downloaded: https://repo.maven.apache.org/maven2/net/java/jvnet-parent/5/jvnet-parent-5.pom
(8.9 kB at 306 kB/s)
[windows-jdk9] [INFO] Downloading: https://repo.maven.apache.org/maven2/commons-digester/commons-digester/1.6/commons-digester-1.6.jar
[windows-jdk9] [INFO] Downloading: https://repo.maven.apache.org/maven2/org/apache/maven/doxia/doxia-core/1.2/doxia-core-1.2.jar
[windows-jdk9] [INFO] Downloading: https://repo.maven.apache.org/maven2/commons-logging/commons-logging/1.0.4/commons-logging-1.0.4.jar
[windows-jdk9] [INFO] Downloading: https://repo.maven.apache.org/maven2/org/apache/maven/shared/maven-shared-resources/2/maven-shared-resources-2.jar
[windows-jdk9] [INFO] Downloading: https://repo.maven.apache.org/maven2/org/apache/maven/doxia/doxia-integration-tools/1.6/doxia-integration-tools-1.6.jar
[windows-jdk9] [INFO] Downloaded: https://repo.maven.apache.org/maven2/org/apache/maven/shared/maven-shared-resources/2/maven-shared-resources-2.jar
(13 kB at 344 kB/s)
[windows-jdk9] [INFO] Downloading: https://repo.maven.apache.org/maven2/commons-io/commons-io/1.4/commons-io-1.4.jar
[windows-jdk9] [INFO] Downloaded: https://repo.maven.apache.org/maven2/commons-logging/commons-logging/1.0.4/commons-logging-1.0.4.jar
(38 kB at 1.0 MB/s)
[windows-jdk9] [INFO] Downloading: https://repo.maven.apache.org/maven2/org/codehaus/plexus/plexus-resources/1.1.0/plexus-resources-1.1.0.jar
[windows-jdk9] [INFO] Downloaded: https://repo.maven.apache.org/maven2/org/apache/maven/doxia/doxia-integration-tools/1.6/doxia-integration-tools-1.6.jar
(45 kB at 1.1 MB/s)
[windows-jdk9] [INFO] Downloading: https://repo.maven.apache.org/maven2/com/puppycrawl/tools/checkstyle/6.18/checkstyle-6.18.jar
[windows-jdk9] [INFO] Downloaded: https://repo.maven.apache.org/maven2/org/apache/maven/doxia/doxia-core/1.2/doxia-core-1.2.jar
(154 kB at 3.4 MB/s)
[windows-jdk9] [INFO] Downloading: https://repo.maven.apache.org/maven2/antlr/antlr/2.7.7/antlr-2.7.7.jar
[windows-jdk9] [INFO] Downloaded: https://repo.maven.apache.org/maven2/commons-digester/commons-digester/1.6/commons-digester-1.6.jar
(168 kB at 3.0 MB/s)
[windows-jdk9] [INFO] Downloading: https://repo.maven.apache.org/maven2/org/antlr/antlr4-runtime/4.5.3/antlr4-runtime-4.5.3.jar
[windows-jdk9] [INFO] Downloaded: https://repo.maven.apache.org/maven2/org/codehaus/plexus/plexus-resources/1.1.0/plexus-resources-1.1.0.jar
(23 kB at 357 kB/s)
[windows-jdk9] [INFO] Downloading: https://repo.maven.apache.org/maven2/commons-beanutils/commons-beanutils/1.9.2/commons-beanutils-1.9.2.jar
[windows-jdk9] [INFO] Downloaded: https://repo.maven.apache.org/maven2/commons-io/commons-io/1.4/commons-io-1.4.jar
(109 kB at 1.4 MB/s)
[windows-jdk9] [INFO] Downloading: https://repo.maven.apache.org/maven2/commons-cli/commons-cli/1.3.1/commons-cli-1.3.1.jar
[windows-jdk9] [INFO] Downloaded: https://repo.maven.apache.org/maven2/antlr/antlr/2.7.7/antlr-2.7.7.jar
(445 kB at 4.4 MB/s)
[windows-jdk9] [INFO] Downloading: https://repo.maven.apache.org/maven2/com/google/guava/guava/19.0/guava-19.0.jar
[windows-jdk9] [INFO] Downloaded: https://repo.maven.apache.org/maven2/commons-beanutils/commons-beanutils/1.9.2/commons-beanutils-1.9.2.jar
(234 kB at 2.2 MB/s)
[windows-jdk9] [INFO] Downloading: https://repo.maven.apache.org/maven2/commons-lang/commons-lang/2.1/commons-lang-2.1.jar
[windows-jdk9] [INFO] Downloaded: https://repo.maven.apache.org/maven2/org/antlr/antlr4-runtime/4.5.3/antlr4-runtime-4.5.3.jar
(302 kB at 2.7 MB/s)
[windows-jdk9] [INFO] Downloading: https://repo.maven.apache.org/maven2/javax/xml/bind/jaxb-api/2.3.0/jaxb-api-2.3.0.jar
[windows-jdk9] [INFO] Downloaded: https://repo.maven.apache.org/maven2/commons-cli/commons-cli/1.3.1/commons-cli-1.3.1.jar
(53 kB at 482 kB/s)
[windows-jdk9] [INFO] Downloaded: https://repo.maven.apache.org/maven2/com/puppycrawl/tools/checkstyle/6.18/checkstyle-6.18.jar
(1.2 MB at 9.9 MB/s)
[windows-jdk9] [INFO] Downloaded: https://repo.maven.apache.org/maven2/commons-lang/commons-lang/2.1/commons-lang-2.1.jar
(208 kB at 1.5 MB/s)
[windows-jdk9] [INFO] Downloaded: https://repo.maven.apache.org/maven2/javax/xml/bind/jaxb-api/2.3.0/jaxb-api-2.3.0.jar
(126 kB at 838 kB/s)
[windows-jdk9] [INFO] Downloaded: https://repo.maven.apache.org/maven2/com/google/guava/guava/19.0/guava-19.0.jar
(2.3 MB at 8.3 MB/s)
[windows-jdk9] [INFO] There is 1 error reported by Checkstyle 6.18 with config/maven_checks.xml
ruleset.
[windows-jdk9] [INFO] Ignored 1 error, 0 violation remaining.
[windows-jdk9] [INFO] 
[windows-jdk9] [INFO] --- maven-invoker-plugin:3.0.1:verify (integration-test) @ maven-compiler-plugin
---
[windows-jdk9] [INFO] -------------------------------------------------
[windows-jdk9] [INFO] Build Summary:
[windows-jdk9] [INFO]   Passed: 39, Failed: 3, Errors: 0, Skipped: 0
[windows-jdk9] [INFO] -------------------------------------------------
[windows-jdk9] [ERROR] The following builds failed:
[windows-jdk9] [ERROR] *  groovy-project-with-new-plexus-compiler\pom.xml
[windows-jdk9] [ERROR] *  MCOMPILER-192\pom.xml
[windows-jdk9] [ERROR] *  MCOMPILER-197\pom.xml
[windows-jdk9] [INFO] -------------------------------------------------
[windows-jdk9] [INFO] ------------------------------------------------------------------------
[windows-jdk9] [INFO] BUILD FAILURE
[windows-jdk9] [INFO] ------------------------------------------------------------------------
[windows-jdk9] [INFO] Total time: 05:59 min
[windows-jdk9] [INFO] Finished at: 2018-03-13T12:15:29Z
[windows-jdk9] [INFO] Final Memory: 47M/158M
[windows-jdk9] [INFO] ------------------------------------------------------------------------
[windows-jdk9] [INFO] [jenkins-event-spy] Generated F:\jenkins\jenkins-slave\workspace\aven-compiler-plugin_master-ZJAT6KVU5YD2ZHLXVB5R3ACA7QPEPYTMSCTEWBA7FHQAS4NXT2KQ@tmp\withMavena03055e2\maven-spy-20180313-120930-84821825751365053894.log
[windows-jdk9] [ERROR] Failed to execute goal org.apache.maven.plugins:maven-invoker-plugin:3.0.1:verify
(integration-test) on project maven-compiler-plugin: 3 builds failed. See console output above
for details. -> [Help 1]
[windows-jdk9] [ERROR] 
[windows-jdk9] [ERROR] To see the full stack trace of the errors, re-run Maven with the -e
switch.
[windows-jdk9] [ERROR] Re-run Maven using the -X switch to enable full debug logging.
[windows-jdk9] [ERROR] 
[windows-jdk9] [ERROR] For more information about the errors and possible solutions, please
read the following articles:
[windows-jdk9] [ERROR] [Help 1] http://cwiki.apache.org/confluence/display/MAVEN/MojoFailureException
[Pipeline] [windows-jdk9] }
[Pipeline] [windows-jdk9] // dir
[Pipeline] [windows-jdk9] }
[windows-jdk9] [withMaven] junitPublisher - Archive test results for Maven artifact org.apache.maven.plugins:maven-compiler-plugin:3.7.1-SNAPSHOT
generated by maven-surefire-plugin:test (default-test): m\target\surefire-reports\*.xml
[windows-jdk9] [withMaven] junitPublisher - Jenkins JUnit Attachments Plugin not found, can't
publish test attachments.Recording test results
[Pipeline] [windows-jdk9] // withMaven
[Pipeline] [windows-jdk9] echo
[windows-jdk9] [FAIL FAST] This is the first failure and likely root cause
[Pipeline] [windows-jdk9] }
[Pipeline] [windows-jdk9] // stage
[Pipeline] [windows-jdk9] }
[Pipeline] [windows-jdk9] // node
[Pipeline] [windows-jdk9] }
[windows-jdk9] Failed in branch windows-jdk9
[Pipeline] [linux-jdk7] // node
[Pipeline] [linux-jdk8] // node
[Pipeline] [linux-jdk9] // node
[Pipeline] [linux-jdk7] }
[linux-jdk7] Failed in branch linux-jdk7
[Pipeline] [linux-jdk8] }
[linux-jdk8] Failed in branch linux-jdk8
[Pipeline] [linux-jdk9] }
[linux-jdk9] Failed in branch linux-jdk9
[Pipeline] // parallel
[Pipeline] echo
***** FAST FAILURE *****

Fast failure triggered by windows-jdk9

***** FAST FAILURE *****
[Pipeline] stage
[Pipeline] { (Notifications)
[Pipeline] echo
Build result: FAILURE
[Pipeline] jiraIssueSelector
[Pipeline] emailext
Mime
  • Unnamed multipart/mixed (inline, None, 0 bytes)
View raw message