maven-notifications mailing list archives

Site index · List index
Message view « Date » · « Thread »
Top « Date » · « Thread »
From Apache Jenkins Server <jenk...@builds.apache.org>
Subject Build unstable in Jenkins: Maven TLP » maven-remote-resources-plugin » master #4
Date Fri, 09 Mar 2018 22:47:55 GMT
See https://builds.apache.org/job/maven-box/job/maven-remote-resources-plugin/job/master/4/

No changes.

5 tests failed.
FAILED:  org.apache.maven.plugin.resources.remote.it.IT_SupplementalArtifact.test

Error Message:
Exit code was non-zero: 1; command line and log = 
F:\jenkins\tools\maven\apache-maven-3.5.0\bin\mvn -e --batch-mode -Dmaven.repo.local=f:\jenkins\jenkins-slave\workspace\ote-resources-plugin_master-FTEJEAA7J3RSA3RGNRQRTOLNK5IUQ7QP3AJQZXDE4RWB3DK3KFPQ\m\target/it-repo org.apache.maven.plugins:maven-clean-plugin:clean deploy
Picked up JAVA_TOOL_OPTIONS: -Dmaven.ext.class.path="f:\jenkins\jenkins-slave\workspace\ote-resources-plugin_master-FTEJEAA7J3RSA3RGNRQRTOLNK5IUQ7QP3AJQZXDE4RWB3DK3KFPQ@tmp\withMaven0b26eef1\pipeline-maven-spy.jar" -Dorg.jenkinsci.plugins.pipeline.maven.reportsFolder="f:\jenkins\jenkins-slave\workspace\ote-resources-plugin_master-FTEJEAA7J3RSA3RGNRQRTOLNK5IUQ7QP3AJQZXDE4RWB3DK3KFPQ@tmp\withMaven0b26eef1" 
[INFO] [jenkins-event-spy] Generate F:\jenkins\jenkins-slave\workspace\ote-resources-plugin_master-FTEJEAA7J3RSA3RGNRQRTOLNK5IUQ7QP3AJQZXDE4RWB3DK3KFPQ@tmp\withMaven0b26eef1\maven-spy-20180309-222527-85816339386134749018219.log.tmp ...
[INFO] Error stacktraces are turned on.
[INFO] Scanning for projects...
[INFO] ------------------------------------------------------------------------
[INFO] Reactor Build Order:
[INFO] 
[INFO] resources
[INFO] supplemental-models
[INFO] deficient-dep
[INFO] 
[INFO] ------------------------------------------------------------------------
[INFO] Building resources 1
[INFO] ------------------------------------------------------------------------
[INFO] 
[INFO] --- maven-clean-plugin:2.5:clean (default-cli) @ resources ---
[INFO] 
[INFO] --- maven-install-plugin:2.4:install (default-install) @ resources ---
[INFO] Installing f:\jenkins\jenkins-slave\workspace\ote-resources-plugin_master-FTEJEAA7J3RSA3RGNRQRTOLNK5IUQ7QP3AJQZXDE4RWB3DK3KFPQ\m\target\test-classes\supplemental-artifact\resource-projects\pom.xml to f:\jenkins\jenkins-slave\workspace\ote-resources-plugin_master-FTEJEAA7J3RSA3RGNRQRTOLNK5IUQ7QP3AJQZXDE4RWB3DK3KFPQ\m\target\it-repo\org\apache\maven\plugin\rresource\it\mrr43\resources\1\resources-1.pom
[INFO] 
[INFO] --- maven-deploy-plugin:2.7:deploy (default-deploy) @ resources ---
[INFO] Uploading: file:f:\\jenkins\\jenkins-slave\\workspace\\ote-resources-plugin_master-FTEJEAA7J3RSA3RGNRQRTOLNK5IUQ7QP3AJQZXDE4RWB3DK3KFPQ\\m\\target/remote-repo/org/apache/maven/plugin/rresource/it/mrr43/resources/1/resources-1.pom
[INFO] Uploaded: file:f:\\jenkins\\jenkins-slave\\workspace\\ote-resources-plugin_master-FTEJEAA7J3RSA3RGNRQRTOLNK5IUQ7QP3AJQZXDE4RWB3DK3KFPQ\\m\\target/remote-repo/org/apache/maven/plugin/rresource/it/mrr43/resources/1/resources-1.pom (1.6 kB at 63 kB/s)
[INFO] Downloading: file:f:\\jenkins\\jenkins-slave\\workspace\\ote-resources-plugin_master-FTEJEAA7J3RSA3RGNRQRTOLNK5IUQ7QP3AJQZXDE4RWB3DK3KFPQ\\m\\target/remote-repo/org/apache/maven/plugin/rresource/it/mrr43/resources/maven-metadata.xml
[INFO] Uploading: file:f:\\jenkins\\jenkins-slave\\workspace\\ote-resources-plugin_master-FTEJEAA7J3RSA3RGNRQRTOLNK5IUQ7QP3AJQZXDE4RWB3DK3KFPQ\\m\\target/remote-repo/org/apache/maven/plugin/rresource/it/mrr43/resources/maven-metadata.xml
[INFO] Uploaded: file:f:\\jenkins\\jenkins-slave\\workspace\\ote-resources-plugin_master-FTEJEAA7J3RSA3RGNRQRTOLNK5IUQ7QP3AJQZXDE4RWB3DK3KFPQ\\m\\target/remote-repo/org/apache/maven/plugin/rresource/it/mrr43/resources/maven-metadata.xml (323 B at 162 kB/s)
[INFO] 
[INFO] ------------------------------------------------------------------------
[INFO] Building supplemental-models 1
[INFO] ------------------------------------------------------------------------
[INFO] 
[INFO] --- maven-clean-plugin:2.5:clean (default-cli) @ supplemental-models ---
[INFO] 
[INFO] --- maven-resources-plugin:2.6:resources (default-resources) @ supplemental-models ---
[WARNING] Using platform encoding (Cp1252 actually) to copy filtered resources, i.e. build is platform dependent!
[INFO] Copying 1 resource
[INFO] 
[INFO] --- maven-compiler-plugin:3.1:compile (default-compile) @ supplemental-models ---
[INFO] No sources to compile
[INFO] 
[INFO] --- maven-resources-plugin:2.6:testResources (default-testResources) @ supplemental-models ---
[WARNING] Using platform encoding (Cp1252 actually) to copy filtered resources, i.e. build is platform dependent!
[INFO] skip non existing resourceDirectory F:\jenkins\jenkins-slave\workspace\ote-resources-plugin_master-FTEJEAA7J3RSA3RGNRQRTOLNK5IUQ7QP3AJQZXDE4RWB3DK3KFPQ\m\target\test-classes\supplemental-artifact\resource-projects\supplemental-models\src\test\resources
[INFO] 
[INFO] --- maven-compiler-plugin:3.1:testCompile (default-testCompile) @ supplemental-models ---
[INFO] No sources to compile
[INFO] 
[INFO] --- maven-surefire-plugin:2.12.4:test (default-test) @ supplemental-models ---
[INFO] No tests to run.
[INFO] 
[INFO] --- maven-jar-plugin:2.4:jar (default-jar) @ supplemental-models ---
[INFO] Building jar: F:\jenkins\jenkins-slave\workspace\ote-resources-plugin_master-FTEJEAA7J3RSA3RGNRQRTOLNK5IUQ7QP3AJQZXDE4RWB3DK3KFPQ\m\target\test-classes\supplemental-artifact\resource-projects\supplemental-models\target\supplemental-models-1.jar
[INFO] 
[INFO] --- maven-install-plugin:2.4:install (default-install) @ supplemental-models ---
[INFO] Installing F:\jenkins\jenkins-slave\workspace\ote-resources-plugin_master-FTEJEAA7J3RSA3RGNRQRTOLNK5IUQ7QP3AJQZXDE4RWB3DK3KFPQ\m\target\test-classes\supplemental-artifact\resource-projects\supplemental-models\target\supplemental-models-1.jar to f:\jenkins\jenkins-slave\workspace\ote-resources-plugin_master-FTEJEAA7J3RSA3RGNRQRTOLNK5IUQ7QP3AJQZXDE4RWB3DK3KFPQ\m\target\it-repo\org\apache\maven\plugin\rresource\it\mrr43\supplemental-models\1\supplemental-models-1.jar
[INFO] Installing F:\jenkins\jenkins-slave\workspace\ote-resources-plugin_master-FTEJEAA7J3RSA3RGNRQRTOLNK5IUQ7QP3AJQZXDE4RWB3DK3KFPQ\m\target\test-classes\supplemental-artifact\resource-projects\supplemental-models\pom.xml to f:\jenkins\jenkins-slave\workspace\ote-resources-plugin_master-FTEJEAA7J3RSA3RGNRQRTOLNK5IUQ7QP3AJQZXDE4RWB3DK3KFPQ\m\target\it-repo\org\apache\maven\plugin\rresource\it\mrr43\supplemental-models\1\supplemental-models-1.pom
[INFO] 
[INFO] --- maven-deploy-plugin:2.7:deploy (default-deploy) @ supplemental-models ---
[INFO] Uploading: file:f:\\jenkins\\jenkins-slave\\workspace\\ote-resources-plugin_master-FTEJEAA7J3RSA3RGNRQRTOLNK5IUQ7QP3AJQZXDE4RWB3DK3KFPQ\\m\\target/remote-repo/org/apache/maven/plugin/rresource/it/mrr43/supplemental-models/1/supplemental-models-1.jar
[INFO] Uploaded: file:f:\\jenkins\\jenkins-slave\\workspace\\ote-resources-plugin_master-FTEJEAA7J3RSA3RGNRQRTOLNK5IUQ7QP3AJQZXDE4RWB3DK3KFPQ\\m\\target/remote-repo/org/apache/maven/plugin/rresource/it/mrr43/supplemental-models/1/supplemental-models-1.jar (3.0 kB at 995 kB/s)
[INFO] Uploading: file:f:\\jenkins\\jenkins-slave\\workspace\\ote-resources-plugin_master-FTEJEAA7J3RSA3RGNRQRTOLNK5IUQ7QP3AJQZXDE4RWB3DK3KFPQ\\m\\target/remote-repo/org/apache/maven/plugin/rresource/it/mrr43/supplemental-models/1/supplemental-models-1.pom
[INFO] Uploaded: file:f:\\jenkins\\jenkins-slave\\workspace\\ote-resources-plugin_master-FTEJEAA7J3RSA3RGNRQRTOLNK5IUQ7QP3AJQZXDE4RWB3DK3KFPQ\\m\\target/remote-repo/org/apache/maven/plugin/rresource/it/mrr43/supplemental-models/1/supplemental-models-1.pom (1.3 kB at 648 kB/s)
[INFO] Downloading: file:f:\\jenkins\\jenkins-slave\\workspace\\ote-resources-plugin_master-FTEJEAA7J3RSA3RGNRQRTOLNK5IUQ7QP3AJQZXDE4RWB3DK3KFPQ\\m\\target/remote-repo/org/apache/maven/plugin/rresource/it/mrr43/supplemental-models/maven-metadata.xml
[INFO] Uploading: file:f:\\jenkins\\jenkins-slave\\workspace\\ote-resources-plugin_master-FTEJEAA7J3RSA3RGNRQRTOLNK5IUQ7QP3AJQZXDE4RWB3DK3KFPQ\\m\\target/remote-repo/org/apache/maven/plugin/rresource/it/mrr43/supplemental-models/maven-metadata.xml
[INFO] Uploaded: file:f:\\jenkins\\jenkins-slave\\workspace\\ote-resources-plugin_master-FTEJEAA7J3RSA3RGNRQRTOLNK5IUQ7QP3AJQZXDE4RWB3DK3KFPQ\\m\\target/remote-repo/org/apache/maven/plugin/rresource/it/mrr43/supplemental-models/maven-metadata.xml (333 B at 166 kB/s)
[INFO] 
[INFO] ------------------------------------------------------------------------
[INFO] Building deficient-dep 1
[INFO] ------------------------------------------------------------------------
[INFO] 
[INFO] --- maven-clean-plugin:2.5:clean (default-cli) @ deficient-dep ---
[INFO] 
[INFO] --- maven-resources-plugin:2.6:resources (default-resources) @ deficient-dep ---
[WARNING] Using platform encoding (Cp1252 actually) to copy filtered resources, i.e. build is platform dependent!
[INFO] skip non existing resourceDirectory F:\jenkins\jenkins-slave\workspace\ote-resources-plugin_master-FTEJEAA7J3RSA3RGNRQRTOLNK5IUQ7QP3AJQZXDE4RWB3DK3KFPQ\m\target\test-classes\supplemental-artifact\resource-projects\deficient-dep\src\main\resources
[INFO] 
[INFO] --- maven-compiler-plugin:3.1:compile (default-compile) @ deficient-dep ---
[INFO] Changes detected - recompiling the module!
[WARNING] File encoding has not been set, using platform encoding Cp1252, i.e. build is platform dependent!
[INFO] Compiling 1 source file to F:\jenkins\jenkins-slave\workspace\ote-resources-plugin_master-FTEJEAA7J3RSA3RGNRQRTOLNK5IUQ7QP3AJQZXDE4RWB3DK3KFPQ\m\target\test-classes\supplemental-artifact\resource-projects\deficient-dep\target\classes
[INFO] -------------------------------------------------------------
[ERROR] COMPILATION ERROR : 
[INFO] -------------------------------------------------------------
[ERROR] Source option 1.5 is no longer supported. Use 1.6 or later.
[ERROR] Target option 1.5 is no longer supported. Use 1.6 or later.
[INFO] 2 errors 
[INFO] -------------------------------------------------------------
[INFO] ------------------------------------------------------------------------
[INFO] Reactor Summary:
[INFO] 
[INFO] resources .......................................... SUCCESS [  0.586 s]
[INFO] supplemental-models ................................ SUCCESS [  1.088 s]
[INFO] deficient-dep ...................................... FAILURE [  0.706 s]
[INFO] ------------------------------------------------------------------------
[INFO] BUILD FAILURE
[INFO] ------------------------------------------------------------------------
[INFO] Total time: 2.692 s
[INFO] Finished at: 2018-03-09T22:25:30Z
[INFO] Final Memory: 14M/48M
[INFO] ------------------------------------------------------------------------
[INFO] [jenkins-event-spy] Generated F:\jenkins\jenkins-slave\workspace\ote-resources-plugin_master-FTEJEAA7J3RSA3RGNRQRTOLNK5IUQ7QP3AJQZXDE4RWB3DK3KFPQ@tmp\withMaven0b26eef1\maven-spy-20180309-222527-85816339386134749018219.log
[ERROR] Failed to execute goal org.apache.maven.plugins:maven-compiler-plugin:3.1:compile (default-compile) on project deficient-dep: Compilation failure: Compilation failure: 
[ERROR] Source option 1.5 is no longer supported. Use 1.6 or later.
[ERROR] Target option 1.5 is no longer supported. Use 1.6 or later.
[ERROR] -> [Help 1]
org.apache.maven.lifecycle.LifecycleExecutionException: Failed to execute goal org.apache.maven.plugins:maven-compiler-plugin:3.1:compile (default-compile) on project deficient-dep: Compilation failure
 at org.apache.maven.lifecycle.internal.MojoExecutor.execute(MojoExecutor.java:213)
 at org.apache.maven.lifecycle.internal.MojoExecutor.execute(MojoExecutor.java:154)
 at org.apache.maven.lifecycle.internal.MojoExecutor.execute(MojoExecutor.java:146)
 at org.apache.maven.lifecycle.internal.LifecycleModuleBuilder.buildProject(LifecycleModuleBuilder.java:117)
 at org.apache.maven.lifecycle.internal.LifecycleModuleBuilder.buildProject(LifecycleModuleBuilder.java:81)
 at org.apache.maven.lifecycle.internal.builder.singlethreaded.SingleThreadedBuilder.build(SingleThreadedBuilder.java:51)
 at org.apache.maven.lifecycle.internal.LifecycleStarter.execute(LifecycleStarter.java:128)
 at org.apache.maven.DefaultMaven.doExecute(DefaultMaven.java:309)
 at org.apache.maven.DefaultMaven.doExecute(DefaultMaven.java:194)
 at org.apache.maven.DefaultMaven.execute(DefaultMaven.java:107)
 at org.apache.maven.cli.MavenCli.execute(MavenCli.java:993)
 at org.apache.maven.cli.MavenCli.doMain(MavenCli.java:345)
 at org.apache.maven.cli.MavenCli.main(MavenCli.java:191)
 at java.base/jdk.internal.reflect.NativeMethodAccessorImpl.invoke0(Native Method)
 at java.base/jdk.internal.reflect.NativeMethodAccessorImpl.invoke(NativeMethodAccessorImpl.java:62)
 at java.base/jdk.internal.reflect.DelegatingMethodAccessorImpl.invoke(DelegatingMethodAccessorImpl.java:43)
 at java.base/java.lang.reflect.Method.invoke(Method.java:564)
 at org.codehaus.plexus.classworlds.launcher.Launcher.launchEnhanced(Launcher.java:289)
 at org.codehaus.plexus.classworlds.launcher.Launcher.launch(Launcher.java:229)
 at org.codehaus.plexus.classworlds.launcher.Launcher.mainWithExitCode(Launcher.java:415)
 at org.codehaus.plexus.classworlds.launcher.Launcher.main(Launcher.java:356)
Caused by: org.apache.maven.plugin.compiler.CompilationFailureException: Compilation failure
 at org.apache.maven.plugin.compiler.AbstractCompilerMojo.execute(AbstractCompilerMojo.java:858)
 at org.apache.maven.plugin.compiler.CompilerMojo.execute(CompilerMojo.java:129)
 at org.apache.maven.plugin.DefaultBuildPluginManager.executeMojo(DefaultBuildPluginManager.java:134)
 at org.apache.maven.lifecycle.internal.MojoExecutor.execute(MojoExecutor.java:208)
 ... 20 more
[ERROR] 
[ERROR] Re-run Maven using the -X switch to enable full debug logging.
[ERROR] 
[ERROR] For more information about the errors and possible solutions, please read the following articles:
[ERROR] [Help 1] http://cwiki.apache.org/confluence/display/MAVEN/MojoFailureException
[ERROR] 
[ERROR] After correcting the problems, you can resume the build with the command
[ERROR]   mvn <goals> -rf :deficient-dep


Stack Trace:
org.apache.maven.it.VerificationException: 
Exit code was non-zero: 1; command line and log = 
F:\jenkins\tools\maven\apache-maven-3.5.0\bin\mvn -e --batch-mode -Dmaven.repo.local=f:\jenkins\jenkins-slave\workspace\ote-resources-plugin_master-FTEJEAA7J3RSA3RGNRQRTOLNK5IUQ7QP3AJQZXDE4RWB3DK3KFPQ\m\target/it-repo org.apache.maven.plugins:maven-clean-plugin:clean deploy
Picked up JAVA_TOOL_OPTIONS: -Dmaven.ext.class.path="f:\jenkins\jenkins-slave\workspace\ote-resources-plugin_master-FTEJEAA7J3RSA3RGNRQRTOLNK5IUQ7QP3AJQZXDE4RWB3DK3KFPQ@tmp\withMaven0b26eef1\pipeline-maven-spy.jar" -Dorg.jenkinsci.plugins.pipeline.maven.reportsFolder="f:\jenkins\jenkins-slave\workspace\ote-resources-plugin_master-FTEJEAA7J3RSA3RGNRQRTOLNK5IUQ7QP3AJQZXDE4RWB3DK3KFPQ@tmp\withMaven0b26eef1" 
[INFO] [jenkins-event-spy] Generate F:\jenkins\jenkins-slave\workspace\ote-resources-plugin_master-FTEJEAA7J3RSA3RGNRQRTOLNK5IUQ7QP3AJQZXDE4RWB3DK3KFPQ@tmp\withMaven0b26eef1\maven-spy-20180309-222527-85816339386134749018219.log.tmp ...
[INFO] Error stacktraces are turned on.
[INFO] Scanning for projects...
[INFO] ------------------------------------------------------------------------
[INFO] Reactor Build Order:
[INFO] 
[INFO] resources
[INFO] supplemental-models
[INFO] deficient-dep
[INFO] 
[INFO] ------------------------------------------------------------------------
[INFO] Building resources 1
[INFO] ------------------------------------------------------------------------
[INFO] 
[INFO] --- maven-clean-plugin:2.5:clean (default-cli) @ resources ---
[INFO] 
[INFO] --- maven-install-plugin:2.4:install (default-install) @ resources ---
[INFO] Installing f:\jenkins\jenkins-slave\workspace\ote-resources-plugin_master-FTEJEAA7J3RSA3RGNRQRTOLNK5IUQ7QP3AJQZXDE4RWB3DK3KFPQ\m\target\test-classes\supplemental-artifact\resource-projects\pom.xml to f:\jenkins\jenkins-slave\workspace\ote-resources-plugin_master-FTEJEAA7J3RSA3RGNRQRTOLNK5IUQ7QP3AJQZXDE4RWB3DK3KFPQ\m\target\it-repo\org\apache\maven\plugin\rresource\it\mrr43\resources\1\resources-1.pom
[INFO] 
[INFO] --- maven-deploy-plugin:2.7:deploy (default-deploy) @ resources ---
[INFO] Uploading: file:f:\\jenkins\\jenkins-slave\\workspace\\ote-resources-plugin_master-FTEJEAA7J3RSA3RGNRQRTOLNK5IUQ7QP3AJQZXDE4RWB3DK3KFPQ\\m\\target/remote-repo/org/apache/maven/plugin/rresource/it/mrr43/resources/1/resources-1.pom
[INFO] Uploaded: file:f:\\jenkins\\jenkins-slave\\workspace\\ote-resources-plugin_master-FTEJEAA7J3RSA3RGNRQRTOLNK5IUQ7QP3AJQZXDE4RWB3DK3KFPQ\\m\\target/remote-repo/org/apache/maven/plugin/rresource/it/mrr43/resources/1/resources-1.pom (1.6 kB at 63 kB/s)
[INFO] Downloading: file:f:\\jenkins\\jenkins-slave\\workspace\\ote-resources-plugin_master-FTEJEAA7J3RSA3RGNRQRTOLNK5IUQ7QP3AJQZXDE4RWB3DK3KFPQ\\m\\target/remote-repo/org/apache/maven/plugin/rresource/it/mrr43/resources/maven-metadata.xml
[INFO] Uploading: file:f:\\jenkins\\jenkins-slave\\workspace\\ote-resources-plugin_master-FTEJEAA7J3RSA3RGNRQRTOLNK5IUQ7QP3AJQZXDE4RWB3DK3KFPQ\\m\\target/remote-repo/org/apache/maven/plugin/rresource/it/mrr43/resources/maven-metadata.xml
[INFO] Uploaded: file:f:\\jenkins\\jenkins-slave\\workspace\\ote-resources-plugin_master-FTEJEAA7J3RSA3RGNRQRTOLNK5IUQ7QP3AJQZXDE4RWB3DK3KFPQ\\m\\target/remote-repo/org/apache/maven/plugin/rresource/it/mrr43/resources/maven-metadata.xml (323 B at 162 kB/s)
[INFO] 
[INFO] ------------------------------------------------------------------------
[INFO] Building supplemental-models 1
[INFO] ------------------------------------------------------------------------
[INFO] 
[INFO] --- maven-clean-plugin:2.5:clean (default-cli) @ supplemental-models ---
[INFO] 
[INFO] --- maven-resources-plugin:2.6:resources (default-resources) @ supplemental-models ---
[WARNING] Using platform encoding (Cp1252 actually) to copy filtered resources, i.e. build is platform dependent!
[INFO] Copying 1 resource
[INFO] 
[INFO] --- maven-compiler-plugin:3.1:compile (default-compile) @ supplemental-models ---
[INFO] No sources to compile
[INFO] 
[INFO] --- maven-resources-plugin:2.6:testResources (default-testResources) @ supplemental-models ---
[WARNING] Using platform encoding (Cp1252 actually) to copy filtered resources, i.e. build is platform dependent!
[INFO] skip non existing resourceDirectory F:\jenkins\jenkins-slave\workspace\ote-resources-plugin_master-FTEJEAA7J3RSA3RGNRQRTOLNK5IUQ7QP3AJQZXDE4RWB3DK3KFPQ\m\target\test-classes\supplemental-artifact\resource-projects\supplemental-models\src\test\resources
[INFO] 
[INFO] --- maven-compiler-plugin:3.1:testCompile (default-testCompile) @ supplemental-models ---
[INFO] No sources to compile
[INFO] 
[INFO] --- maven-surefire-plugin:2.12.4:test (default-test) @ supplemental-models ---
[INFO] No tests to run.
[INFO] 
[INFO] --- maven-jar-plugin:2.4:jar (default-jar) @ supplemental-models ---
[INFO] Building jar: F:\jenkins\jenkins-slave\workspace\ote-resources-plugin_master-FTEJEAA7J3RSA3RGNRQRTOLNK5IUQ7QP3AJQZXDE4RWB3DK3KFPQ\m\target\test-classes\supplemental-artifact\resource-projects\supplemental-models\target\supplemental-models-1.jar
[INFO] 
[INFO] --- maven-install-plugin:2.4:install (default-install) @ supplemental-models ---
[INFO] Installing F:\jenkins\jenkins-slave\workspace\ote-resources-plugin_master-FTEJEAA7J3RSA3RGNRQRTOLNK5IUQ7QP3AJQZXDE4RWB3DK3KFPQ\m\target\test-classes\supplemental-artifact\resource-projects\supplemental-models\target\supplemental-models-1.jar to f:\jenkins\jenkins-slave\workspace\ote-resources-plugin_master-FTEJEAA7J3RSA3RGNRQRTOLNK5IUQ7QP3AJQZXDE4RWB3DK3KFPQ\m\target\it-repo\org\apache\maven\plugin\rresource\it\mrr43\supplemental-models\1\supplemental-models-1.jar
[INFO] Installing F:\jenkins\jenkins-slave\workspace\ote-resources-plugin_master-FTEJEAA7J3RSA3RGNRQRTOLNK5IUQ7QP3AJQZXDE4RWB3DK3KFPQ\m\target\test-classes\supplemental-artifact\resource-projects\supplemental-models\pom.xml to f:\jenkins\jenkins-slave\workspace\ote-resources-plugin_master-FTEJEAA7J3RSA3RGNRQRTOLNK5IUQ7QP3AJQZXDE4RWB3DK3KFPQ\m\target\it-repo\org\apache\maven\plugin\rresource\it\mrr43\supplemental-models\1\supplemental-models-1.pom
[INFO] 
[INFO] --- maven-deploy-plugin:2.7:deploy (default-deploy) @ supplemental-models ---
[INFO] Uploading: file:f:\\jenkins\\jenkins-slave\\workspace\\ote-resources-plugin_master-FTEJEAA7J3RSA3RGNRQRTOLNK5IUQ7QP3AJQZXDE4RWB3DK3KFPQ\\m\\target/remote-repo/org/apache/maven/plugin/rresource/it/mrr43/supplemental-models/1/supplemental-models-1.jar
[INFO] Uploaded: file:f:\\jenkins\\jenkins-slave\\workspace\\ote-resources-plugin_master-FTEJEAA7J3RSA3RGNRQRTOLNK5IUQ7QP3AJQZXDE4RWB3DK3KFPQ\\m\\target/remote-repo/org/apache/maven/plugin/rresource/it/mrr43/supplemental-models/1/supplemental-models-1.jar (3.0 kB at 995 kB/s)
[INFO] Uploading: file:f:\\jenkins\\jenkins-slave\\workspace\\ote-resources-plugin_master-FTEJEAA7J3RSA3RGNRQRTOLNK5IUQ7QP3AJQZXDE4RWB3DK3KFPQ\\m\\target/remote-repo/org/apache/maven/plugin/rresource/it/mrr43/supplemental-models/1/supplemental-models-1.pom
[INFO] Uploaded: file:f:\\jenkins\\jenkins-slave\\workspace\\ote-resources-plugin_master-FTEJEAA7J3RSA3RGNRQRTOLNK5IUQ7QP3AJQZXDE4RWB3DK3KFPQ\\m\\target/remote-repo/org/apache/maven/plugin/rresource/it/mrr43/supplemental-models/1/supplemental-models-1.pom (1.3 kB at 648 kB/s)
[INFO] Downloading: file:f:\\jenkins\\jenkins-slave\\workspace\\ote-resources-plugin_master-FTEJEAA7J3RSA3RGNRQRTOLNK5IUQ7QP3AJQZXDE4RWB3DK3KFPQ\\m\\target/remote-repo/org/apache/maven/plugin/rresource/it/mrr43/supplemental-models/maven-metadata.xml
[INFO] Uploading: file:f:\\jenkins\\jenkins-slave\\workspace\\ote-resources-plugin_master-FTEJEAA7J3RSA3RGNRQRTOLNK5IUQ7QP3AJQZXDE4RWB3DK3KFPQ\\m\\target/remote-repo/org/apache/maven/plugin/rresource/it/mrr43/supplemental-models/maven-metadata.xml
[INFO] Uploaded: file:f:\\jenkins\\jenkins-slave\\workspace\\ote-resources-plugin_master-FTEJEAA7J3RSA3RGNRQRTOLNK5IUQ7QP3AJQZXDE4RWB3DK3KFPQ\\m\\target/remote-repo/org/apache/maven/plugin/rresource/it/mrr43/supplemental-models/maven-metadata.xml (333 B at 166 kB/s)
[INFO] 
[INFO] ------------------------------------------------------------------------
[INFO] Building deficient-dep 1
[INFO] ------------------------------------------------------------------------
[INFO] 
[INFO] --- maven-clean-plugin:2.5:clean (default-cli) @ deficient-dep ---
[INFO] 
[INFO] --- maven-resources-plugin:2.6:resources (default-resources) @ deficient-dep ---
[WARNING] Using platform encoding (Cp1252 actually) to copy filtered resources, i.e. build is platform dependent!
[INFO] skip non existing resourceDirectory F:\jenkins\jenkins-slave\workspace\ote-resources-plugin_master-FTEJEAA7J3RSA3RGNRQRTOLNK5IUQ7QP3AJQZXDE4RWB3DK3KFPQ\m\target\test-classes\supplemental-artifact\resource-projects\deficient-dep\src\main\resources
[INFO] 
[INFO] --- maven-compiler-plugin:3.1:compile (default-compile) @ deficient-dep ---
[INFO] Changes detected - recompiling the module!
[WARNING] File encoding has not been set, using platform encoding Cp1252, i.e. build is platform dependent!
[INFO] Compiling 1 source file to F:\jenkins\jenkins-slave\workspace\ote-resources-plugin_master-FTEJEAA7J3RSA3RGNRQRTOLNK5IUQ7QP3AJQZXDE4RWB3DK3KFPQ\m\target\test-classes\supplemental-artifact\resource-projects\deficient-dep\target\classes
[INFO] -------------------------------------------------------------
[ERROR] COMPILATION ERROR : 
[INFO] -------------------------------------------------------------
[ERROR] Source option 1.5 is no longer supported. Use 1.6 or later.
[ERROR] Target option 1.5 is no longer supported. Use 1.6 or later.
[INFO] 2 errors 
[INFO] -------------------------------------------------------------
[INFO] ------------------------------------------------------------------------
[INFO] Reactor Summary:
[INFO] 
[INFO] resources .......................................... SUCCESS [  0.586 s]
[INFO] supplemental-models ................................ SUCCESS [  1.088 s]
[INFO] deficient-dep ...................................... FAILURE [  0.706 s]
[INFO] ------------------------------------------------------------------------
[INFO] BUILD FAILURE
[INFO] ------------------------------------------------------------------------
[INFO] Total time: 2.692 s
[INFO] Finished at: 2018-03-09T22:25:30Z
[INFO] Final Memory: 14M/48M
[INFO] ------------------------------------------------------------------------
[INFO] [jenkins-event-spy] Generated F:\jenkins\jenkins-slave\workspace\ote-resources-plugin_master-FTEJEAA7J3RSA3RGNRQRTOLNK5IUQ7QP3AJQZXDE4RWB3DK3KFPQ@tmp\withMaven0b26eef1\maven-spy-20180309-222527-85816339386134749018219.log
[ERROR] Failed to execute goal org.apache.maven.plugins:maven-compiler-plugin:3.1:compile (default-compile) on project deficient-dep: Compilation failure: Compilation failure: 
[ERROR] Source option 1.5 is no longer supported. Use 1.6 or later.
[ERROR] Target option 1.5 is no longer supported. Use 1.6 or later.
[ERROR] -> [Help 1]
org.apache.maven.lifecycle.LifecycleExecutionException: Failed to execute goal org.apache.maven.plugins:maven-compiler-plugin:3.1:compile (default-compile) on project deficient-dep: Compilation failure
	at org.apache.maven.lifecycle.internal.MojoExecutor.execute(MojoExecutor.java:213)
	at org.apache.maven.lifecycle.internal.MojoExecutor.execute(MojoExecutor.java:154)
	at org.apache.maven.lifecycle.internal.MojoExecutor.execute(MojoExecutor.java:146)
	at org.apache.maven.lifecycle.internal.LifecycleModuleBuilder.buildProject(LifecycleModuleBuilder.java:117)
	at org.apache.maven.lifecycle.internal.LifecycleModuleBuilder.buildProject(LifecycleModuleBuilder.java:81)
	at org.apache.maven.lifecycle.internal.builder.singlethreaded.SingleThreadedBuilder.build(SingleThreadedBuilder.java:51)
	at org.apache.maven.lifecycle.internal.LifecycleStarter.execute(LifecycleStarter.java:128)
	at org.apache.maven.DefaultMaven.doExecute(DefaultMaven.java:309)
	at org.apache.maven.DefaultMaven.doExecute(DefaultMaven.java:194)
	at org.apache.maven.DefaultMaven.execute(DefaultMaven.java:107)
	at org.apache.maven.cli.MavenCli.execute(MavenCli.java:993)
	at org.apache.maven.cli.MavenCli.doMain(MavenCli.java:345)
	at org.apache.maven.cli.MavenCli.main(MavenCli.java:191)
	at java.base/jdk.internal.reflect.NativeMethodAccessorImpl.invoke0(Native Method)
	at java.base/jdk.internal.reflect.NativeMethodAccessorImpl.invoke(NativeMethodAccessorImpl.java:62)
	at java.base/jdk.internal.reflect.DelegatingMethodAccessorImpl.invoke(DelegatingMethodAccessorImpl.java:43)
	at java.base/java.lang.reflect.Method.invoke(Method.java:564)
	at org.codehaus.plexus.classworlds.launcher.Launcher.launchEnhanced(Launcher.java:289)
	at org.codehaus.plexus.classworlds.launcher.Launcher.launch(Launcher.java:229)
	at org.codehaus.plexus.classworlds.launcher.Launcher.mainWithExitCode(Launcher.java:415)
	at org.codehaus.plexus.classworlds.launcher.Launcher.main(Launcher.java:356)
Caused by: org.apache.maven.plugin.compiler.CompilationFailureException: Compilation failure
	at org.apache.maven.plugin.compiler.AbstractCompilerMojo.execute(AbstractCompilerMojo.java:858)
	at org.apache.maven.plugin.compiler.CompilerMojo.execute(CompilerMojo.java:129)
	at org.apache.maven.plugin.DefaultBuildPluginManager.executeMojo(DefaultBuildPluginManager.java:134)
	at org.apache.maven.lifecycle.internal.MojoExecutor.execute(MojoExecutor.java:208)
	... 20 more
[ERROR] 
[ERROR] Re-run Maven using the -X switch to enable full debug logging.
[ERROR] 
[ERROR] For more information about the errors and possible solutions, please read the following articles:
[ERROR] [Help 1] http://cwiki.apache.org/confluence/display/MAVEN/MojoFailureException
[ERROR] 
[ERROR] After correcting the problems, you can resume the build with the command
[ERROR]   mvn <goals> -rf :deficient-dep

	at org.apache.maven.plugin.resources.remote.it.IT_SupplementalArtifact.test(IT_SupplementalArtifact.java:50)


FAILED:  org.apache.maven.plugin.resources.remote.it.IT_SupplementalArtifact.test

Error Message:
Exit code was non-zero: 1; command line and log = 
/home/jenkins/tools/maven/apache-maven-3.5.2/bin/mvn -e --batch-mode -Dmaven.repo.local=/home/jenkins/jenkins-slave/workspace/ote-resources-plugin_master-FTEJEAA7J3RSA3RGNRQRTOLNK5IUQ7QP3AJQZXDE4RWB3DK3KFPQ/m/target/it-repo org.apache.maven.plugins:maven-clean-plugin:clean deploy
Picked up JAVA_TOOL_OPTIONS: -Dmaven.ext.class.path="/home/jenkins/jenkins-slave/workspace/ote-resources-plugin_master-FTEJEAA7J3RSA3RGNRQRTOLNK5IUQ7QP3AJQZXDE4RWB3DK3KFPQ@tmp/withMaven326361b0/pipeline-maven-spy.jar" -Dorg.jenkinsci.plugins.pipeline.maven.reportsFolder="/home/jenkins/jenkins-slave/workspace/ote-resources-plugin_master-FTEJEAA7J3RSA3RGNRQRTOLNK5IUQ7QP3AJQZXDE4RWB3DK3KFPQ@tmp/withMaven326361b0" 
[INFO] [jenkins-event-spy] Generate /home/jenkins/jenkins-slave/workspace/ote-resources-plugin_master-FTEJEAA7J3RSA3RGNRQRTOLNK5IUQ7QP3AJQZXDE4RWB3DK3KFPQ@tmp/withMaven326361b0/maven-spy-20180309-224650-5592166231343142205754.log.tmp ...
[INFO] Error stacktraces are turned on.
[INFO] Scanning for projects...
[INFO] ------------------------------------------------------------------------
[INFO] Reactor Build Order:
[INFO] 
[INFO] resources
[INFO] supplemental-models
[INFO] deficient-dep
[INFO] 
[INFO] ------------------------------------------------------------------------
[INFO] Building resources 1
[INFO] ------------------------------------------------------------------------
[INFO] 
[INFO] --- maven-clean-plugin:2.5:clean (default-cli) @ resources ---
[INFO] 
[INFO] --- maven-install-plugin:2.4:install (default-install) @ resources ---
[INFO] Installing /home/jenkins/jenkins-slave/workspace/ote-resources-plugin_master-FTEJEAA7J3RSA3RGNRQRTOLNK5IUQ7QP3AJQZXDE4RWB3DK3KFPQ/m/target/test-classes/supplemental-artifact/resource-projects/pom.xml to /home/jenkins/jenkins-slave/workspace/ote-resources-plugin_master-FTEJEAA7J3RSA3RGNRQRTOLNK5IUQ7QP3AJQZXDE4RWB3DK3KFPQ/m/target/it-repo/org/apache/maven/plugin/rresource/it/mrr43/resources/1/resources-1.pom
[INFO] 
[INFO] --- maven-deploy-plugin:2.7:deploy (default-deploy) @ resources ---
[INFO] Uploading to it-remote: file:/home/jenkins/jenkins-slave/workspace/ote-resources-plugin_master-FTEJEAA7J3RSA3RGNRQRTOLNK5IUQ7QP3AJQZXDE4RWB3DK3KFPQ/m/target/remote-repo/org/apache/maven/plugin/rresource/it/mrr43/resources/1/resources-1.pom
[INFO] Uploaded to it-remote: file:/home/jenkins/jenkins-slave/workspace/ote-resources-plugin_master-FTEJEAA7J3RSA3RGNRQRTOLNK5IUQ7QP3AJQZXDE4RWB3DK3KFPQ/m/target/remote-repo/org/apache/maven/plugin/rresource/it/mrr43/resources/1/resources-1.pom (1.6 kB at 80 kB/s)
[INFO] Downloading from it-remote: file:/home/jenkins/jenkins-slave/workspace/ote-resources-plugin_master-FTEJEAA7J3RSA3RGNRQRTOLNK5IUQ7QP3AJQZXDE4RWB3DK3KFPQ/m/target/remote-repo/org/apache/maven/plugin/rresource/it/mrr43/resources/maven-metadata.xml
[INFO] Uploading to it-remote: file:/home/jenkins/jenkins-slave/workspace/ote-resources-plugin_master-FTEJEAA7J3RSA3RGNRQRTOLNK5IUQ7QP3AJQZXDE4RWB3DK3KFPQ/m/target/remote-repo/org/apache/maven/plugin/rresource/it/mrr43/resources/maven-metadata.xml
[INFO] Uploaded to it-remote: file:/home/jenkins/jenkins-slave/workspace/ote-resources-plugin_master-FTEJEAA7J3RSA3RGNRQRTOLNK5IUQ7QP3AJQZXDE4RWB3DK3KFPQ/m/target/remote-repo/org/apache/maven/plugin/rresource/it/mrr43/resources/maven-metadata.xml (323 B at 323 kB/s)
[INFO] 
[INFO] ------------------------------------------------------------------------
[INFO] Building supplemental-models 1
[INFO] ------------------------------------------------------------------------
[INFO] 
[INFO] --- maven-clean-plugin:2.5:clean (default-cli) @ supplemental-models ---
[INFO] 
[INFO] --- maven-resources-plugin:2.6:resources (default-resources) @ supplemental-models ---
[WARNING] Using platform encoding (ISO-8859-1 actually) to copy filtered resources, i.e. build is platform dependent!
[INFO] Copying 1 resource
[INFO] 
[INFO] --- maven-compiler-plugin:3.1:compile (default-compile) @ supplemental-models ---
[INFO] No sources to compile
[INFO] 
[INFO] --- maven-resources-plugin:2.6:testResources (default-testResources) @ supplemental-models ---
[WARNING] Using platform encoding (ISO-8859-1 actually) to copy filtered resources, i.e. build is platform dependent!
[INFO] skip non existing resourceDirectory /home/jenkins/jenkins-slave/workspace/ote-resources-plugin_master-FTEJEAA7J3RSA3RGNRQRTOLNK5IUQ7QP3AJQZXDE4RWB3DK3KFPQ/m/target/test-classes/supplemental-artifact/resource-projects/supplemental-models/src/test/resources
[INFO] 
[INFO] --- maven-compiler-plugin:3.1:testCompile (default-testCompile) @ supplemental-models ---
[INFO] No sources to compile
[INFO] 
[INFO] --- maven-surefire-plugin:2.12.4:test (default-test) @ supplemental-models ---
[INFO] No tests to run.
[INFO] 
[INFO] --- maven-jar-plugin:2.4:jar (default-jar) @ supplemental-models ---
[INFO] Building jar: /home/jenkins/jenkins-slave/workspace/ote-resources-plugin_master-FTEJEAA7J3RSA3RGNRQRTOLNK5IUQ7QP3AJQZXDE4RWB3DK3KFPQ/m/target/test-classes/supplemental-artifact/resource-projects/supplemental-models/target/supplemental-models-1.jar
[INFO] 
[INFO] --- maven-install-plugin:2.4:install (default-install) @ supplemental-models ---
[INFO] Installing /home/jenkins/jenkins-slave/workspace/ote-resources-plugin_master-FTEJEAA7J3RSA3RGNRQRTOLNK5IUQ7QP3AJQZXDE4RWB3DK3KFPQ/m/target/test-classes/supplemental-artifact/resource-projects/supplemental-models/target/supplemental-models-1.jar to /home/jenkins/jenkins-slave/workspace/ote-resources-plugin_master-FTEJEAA7J3RSA3RGNRQRTOLNK5IUQ7QP3AJQZXDE4RWB3DK3KFPQ/m/target/it-repo/org/apache/maven/plugin/rresource/it/mrr43/supplemental-models/1/supplemental-models-1.jar
[INFO] Installing /home/jenkins/jenkins-slave/workspace/ote-resources-plugin_master-FTEJEAA7J3RSA3RGNRQRTOLNK5IUQ7QP3AJQZXDE4RWB3DK3KFPQ/m/target/test-classes/supplemental-artifact/resource-projects/supplemental-models/pom.xml to /home/jenkins/jenkins-slave/workspace/ote-resources-plugin_master-FTEJEAA7J3RSA3RGNRQRTOLNK5IUQ7QP3AJQZXDE4RWB3DK3KFPQ/m/target/it-repo/org/apache/maven/plugin/rresource/it/mrr43/supplemental-models/1/supplemental-models-1.pom
[INFO] 
[INFO] --- maven-deploy-plugin:2.7:deploy (default-deploy) @ supplemental-models ---
[INFO] Uploading to it-remote: file:/home/jenkins/jenkins-slave/workspace/ote-resources-plugin_master-FTEJEAA7J3RSA3RGNRQRTOLNK5IUQ7QP3AJQZXDE4RWB3DK3KFPQ/m/target/remote-repo/org/apache/maven/plugin/rresource/it/mrr43/supplemental-models/1/supplemental-models-1.jar
[INFO] Uploaded to it-remote: file:/home/jenkins/jenkins-slave/workspace/ote-resources-plugin_master-FTEJEAA7J3RSA3RGNRQRTOLNK5IUQ7QP3AJQZXDE4RWB3DK3KFPQ/m/target/remote-repo/org/apache/maven/plugin/rresource/it/mrr43/supplemental-models/1/supplemental-models-1.jar (3.0 kB at 1.5 MB/s)
[INFO] Uploading to it-remote: file:/home/jenkins/jenkins-slave/workspace/ote-resources-plugin_master-FTEJEAA7J3RSA3RGNRQRTOLNK5IUQ7QP3AJQZXDE4RWB3DK3KFPQ/m/target/remote-repo/org/apache/maven/plugin/rresource/it/mrr43/supplemental-models/1/supplemental-models-1.pom
[INFO] Uploaded to it-remote: file:/home/jenkins/jenkins-slave/workspace/ote-resources-plugin_master-FTEJEAA7J3RSA3RGNRQRTOLNK5IUQ7QP3AJQZXDE4RWB3DK3KFPQ/m/target/remote-repo/org/apache/maven/plugin/rresource/it/mrr43/supplemental-models/1/supplemental-models-1.pom (1.3 kB at 1.3 MB/s)
[INFO] Downloading from it-remote: file:/home/jenkins/jenkins-slave/workspace/ote-resources-plugin_master-FTEJEAA7J3RSA3RGNRQRTOLNK5IUQ7QP3AJQZXDE4RWB3DK3KFPQ/m/target/remote-repo/org/apache/maven/plugin/rresource/it/mrr43/supplemental-models/maven-metadata.xml
[INFO] Uploading to it-remote: file:/home/jenkins/jenkins-slave/workspace/ote-resources-plugin_master-FTEJEAA7J3RSA3RGNRQRTOLNK5IUQ7QP3AJQZXDE4RWB3DK3KFPQ/m/target/remote-repo/org/apache/maven/plugin/rresource/it/mrr43/supplemental-models/maven-metadata.xml
[INFO] Uploaded to it-remote: file:/home/jenkins/jenkins-slave/workspace/ote-resources-plugin_master-FTEJEAA7J3RSA3RGNRQRTOLNK5IUQ7QP3AJQZXDE4RWB3DK3KFPQ/m/target/remote-repo/org/apache/maven/plugin/rresource/it/mrr43/supplemental-models/maven-metadata.xml (333 B at 333 kB/s)
[INFO] 
[INFO] ------------------------------------------------------------------------
[INFO] Building deficient-dep 1
[INFO] ------------------------------------------------------------------------
[INFO] 
[INFO] --- maven-clean-plugin:2.5:clean (default-cli) @ deficient-dep ---
[INFO] 
[INFO] --- maven-resources-plugin:2.6:resources (default-resources) @ deficient-dep ---
[WARNING] Using platform encoding (ISO-8859-1 actually) to copy filtered resources, i.e. build is platform dependent!
[INFO] skip non existing resourceDirectory /home/jenkins/jenkins-slave/workspace/ote-resources-plugin_master-FTEJEAA7J3RSA3RGNRQRTOLNK5IUQ7QP3AJQZXDE4RWB3DK3KFPQ/m/target/test-classes/supplemental-artifact/resource-projects/deficient-dep/src/main/resources
[INFO] 
[INFO] --- maven-compiler-plugin:3.1:compile (default-compile) @ deficient-dep ---
[INFO] Changes detected - recompiling the module!
[WARNING] File encoding has not been set, using platform encoding ISO-8859-1, i.e. build is platform dependent!
[INFO] Compiling 1 source file to /home/jenkins/jenkins-slave/workspace/ote-resources-plugin_master-FTEJEAA7J3RSA3RGNRQRTOLNK5IUQ7QP3AJQZXDE4RWB3DK3KFPQ/m/target/test-classes/supplemental-artifact/resource-projects/deficient-dep/target/classes
[INFO] -------------------------------------------------------------
[ERROR] COMPILATION ERROR : 
[INFO] -------------------------------------------------------------
[ERROR] Source option 1.5 is no longer supported. Use 1.6 or later.
[ERROR] Target option 1.5 is no longer supported. Use 1.6 or later.
[INFO] 2 errors 
[INFO] -------------------------------------------------------------
[INFO] ------------------------------------------------------------------------
[INFO] Reactor Summary:
[INFO] 
[INFO] resources .......................................... SUCCESS [  0.539 s]
[INFO] supplemental-models ................................ SUCCESS [  0.738 s]
[INFO] deficient-dep ...................................... FAILURE [  0.345 s]
[INFO] ------------------------------------------------------------------------
[INFO] BUILD FAILURE
[INFO] ------------------------------------------------------------------------
[INFO] Total time: 1.826 s
[INFO] Finished at: 2018-03-09T22:46:52Z
[INFO] Final Memory: 14M/52M
[INFO] ------------------------------------------------------------------------
[INFO] [jenkins-event-spy] Generated /home/jenkins/jenkins-slave/workspace/ote-resources-plugin_master-FTEJEAA7J3RSA3RGNRQRTOLNK5IUQ7QP3AJQZXDE4RWB3DK3KFPQ@tmp/withMaven326361b0/maven-spy-20180309-224650-5592166231343142205754.log
[ERROR] Failed to execute goal org.apache.maven.plugins:maven-compiler-plugin:3.1:compile (default-compile) on project deficient-dep: Compilation failure: Compilation failure: 
[ERROR] Source option 1.5 is no longer supported. Use 1.6 or later.
[ERROR] Target option 1.5 is no longer supported. Use 1.6 or later.
[ERROR] -> [Help 1]
org.apache.maven.lifecycle.LifecycleExecutionException: Failed to execute goal org.apache.maven.plugins:maven-compiler-plugin:3.1:compile (default-compile) on project deficient-dep: Compilation failure
    at org.apache.maven.lifecycle.internal.MojoExecutor.execute (MojoExecutor.java:213)
    at org.apache.maven.lifecycle.internal.MojoExecutor.execute (MojoExecutor.java:154)
    at org.apache.maven.lifecycle.internal.MojoExecutor.execute (MojoExecutor.java:146)
    at org.apache.maven.lifecycle.internal.LifecycleModuleBuilder.buildProject (LifecycleModuleBuilder.java:117)
    at org.apache.maven.lifecycle.internal.LifecycleModuleBuilder.buildProject (LifecycleModuleBuilder.java:81)
    at org.apache.maven.lifecycle.internal.builder.singlethreaded.SingleThreadedBuilder.build (SingleThreadedBuilder.java:51)
    at org.apache.maven.lifecycle.internal.LifecycleStarter.execute (LifecycleStarter.java:128)
    at org.apache.maven.DefaultMaven.doExecute (DefaultMaven.java:309)
    at org.apache.maven.DefaultMaven.doExecute (DefaultMaven.java:194)
    at org.apache.maven.DefaultMaven.execute (DefaultMaven.java:107)
    at org.apache.maven.cli.MavenCli.execute (MavenCli.java:955)
    at org.apache.maven.cli.MavenCli.doMain (MavenCli.java:290)
    at org.apache.maven.cli.MavenCli.main (MavenCli.java:194)
    at jdk.internal.reflect.NativeMethodAccessorImpl.invoke0 (Native Method)
    at jdk.internal.reflect.NativeMethodAccessorImpl.invoke (NativeMethodAccessorImpl.java:62)
    at jdk.internal.reflect.DelegatingMethodAccessorImpl.invoke (DelegatingMethodAccessorImpl.java:43)
    at java.lang.reflect.Method.invoke (Method.java:564)
    at org.codehaus.plexus.classworlds.launcher.Launcher.launchEnhanced (Launcher.java:289)
    at org.codehaus.plexus.classworlds.launcher.Launcher.launch (Launcher.java:229)
    at org.codehaus.plexus.classworlds.launcher.Launcher.mainWithExitCode (Launcher.java:415)
    at org.codehaus.plexus.classworlds.launcher.Launcher.main (Launcher.java:356)
Caused by: org.apache.maven.plugin.compiler.CompilationFailureException: Compilation failure
    at org.apache.maven.plugin.compiler.AbstractCompilerMojo.execute (AbstractCompilerMojo.java:858)
    at org.apache.maven.plugin.compiler.CompilerMojo.execute (CompilerMojo.java:129)
    at org.apache.maven.plugin.DefaultBuildPluginManager.executeMojo (DefaultBuildPluginManager.java:134)
    at org.apache.maven.lifecycle.internal.MojoExecutor.execute (MojoExecutor.java:208)
    at org.apache.maven.lifecycle.internal.MojoExecutor.execute (MojoExecutor.java:154)
    at org.apache.maven.lifecycle.internal.MojoExecutor.execute (MojoExecutor.java:146)
    at org.apache.maven.lifecycle.internal.LifecycleModuleBuilder.buildProject (LifecycleModuleBuilder.java:117)
    at org.apache.maven.lifecycle.internal.LifecycleModuleBuilder.buildProject (LifecycleModuleBuilder.java:81)
    at org.apache.maven.lifecycle.internal.builder.singlethreaded.SingleThreadedBuilder.build (SingleThreadedBuilder.java:51)
    at org.apache.maven.lifecycle.internal.LifecycleStarter.execute (LifecycleStarter.java:128)
    at org.apache.maven.DefaultMaven.doExecute (DefaultMaven.java:309)
    at org.apache.maven.DefaultMaven.doExecute (DefaultMaven.java:194)
    at org.apache.maven.DefaultMaven.execute (DefaultMaven.java:107)
    at org.apache.maven.cli.MavenCli.execute (MavenCli.java:955)
    at org.apache.maven.cli.MavenCli.doMain (MavenCli.java:290)
    at org.apache.maven.cli.MavenCli.main (MavenCli.java:194)
    at jdk.internal.reflect.NativeMethodAccessorImpl.invoke0 (Native Method)
    at jdk.internal.reflect.NativeMethodAccessorImpl.invoke (NativeMethodAccessorImpl.java:62)
    at jdk.internal.reflect.DelegatingMethodAccessorImpl.invoke (DelegatingMethodAccessorImpl.java:43)
    at java.lang.reflect.Method.invoke (Method.java:564)
    at org.codehaus.plexus.classworlds.launcher.Launcher.launchEnhanced (Launcher.java:289)
    at org.codehaus.plexus.classworlds.launcher.Launcher.launch (Launcher.java:229)
    at org.codehaus.plexus.classworlds.launcher.Launcher.mainWithExitCode (Launcher.java:415)
    at org.codehaus.plexus.classworlds.launcher.Launcher.main (Launcher.java:356)
[ERROR] 
[ERROR] Re-run Maven using the -X switch to enable full debug logging.
[ERROR] 
[ERROR] For more information about the errors and possible solutions, please read the following articles:
[ERROR] [Help 1] http://cwiki.apache.org/confluence/display/MAVEN/MojoFailureException
[ERROR] 
[ERROR] After correcting the problems, you can resume the build with the command
[ERROR]   mvn <goals> -rf :deficient-dep


Stack Trace:
org.apache.maven.it.VerificationException: 
Exit code was non-zero: 1; command line and log = 
/home/jenkins/tools/maven/apache-maven-3.5.2/bin/mvn -e --batch-mode -Dmaven.repo.local=/home/jenkins/jenkins-slave/workspace/ote-resources-plugin_master-FTEJEAA7J3RSA3RGNRQRTOLNK5IUQ7QP3AJQZXDE4RWB3DK3KFPQ/m/target/it-repo org.apache.maven.plugins:maven-clean-plugin:clean deploy
Picked up JAVA_TOOL_OPTIONS: -Dmaven.ext.class.path="/home/jenkins/jenkins-slave/workspace/ote-resources-plugin_master-FTEJEAA7J3RSA3RGNRQRTOLNK5IUQ7QP3AJQZXDE4RWB3DK3KFPQ@tmp/withMaven326361b0/pipeline-maven-spy.jar" -Dorg.jenkinsci.plugins.pipeline.maven.reportsFolder="/home/jenkins/jenkins-slave/workspace/ote-resources-plugin_master-FTEJEAA7J3RSA3RGNRQRTOLNK5IUQ7QP3AJQZXDE4RWB3DK3KFPQ@tmp/withMaven326361b0" 
[INFO] [jenkins-event-spy] Generate /home/jenkins/jenkins-slave/workspace/ote-resources-plugin_master-FTEJEAA7J3RSA3RGNRQRTOLNK5IUQ7QP3AJQZXDE4RWB3DK3KFPQ@tmp/withMaven326361b0/maven-spy-20180309-224650-5592166231343142205754.log.tmp ...
[INFO] Error stacktraces are turned on.
[INFO] Scanning for projects...
[INFO] ------------------------------------------------------------------------
[INFO] Reactor Build Order:
[INFO] 
[INFO] resources
[INFO] supplemental-models
[INFO] deficient-dep
[INFO] 
[INFO] ------------------------------------------------------------------------
[INFO] Building resources 1
[INFO] ------------------------------------------------------------------------
[INFO] 
[INFO] --- maven-clean-plugin:2.5:clean (default-cli) @ resources ---
[INFO] 
[INFO] --- maven-install-plugin:2.4:install (default-install) @ resources ---
[INFO] Installing /home/jenkins/jenkins-slave/workspace/ote-resources-plugin_master-FTEJEAA7J3RSA3RGNRQRTOLNK5IUQ7QP3AJQZXDE4RWB3DK3KFPQ/m/target/test-classes/supplemental-artifact/resource-projects/pom.xml to /home/jenkins/jenkins-slave/workspace/ote-resources-plugin_master-FTEJEAA7J3RSA3RGNRQRTOLNK5IUQ7QP3AJQZXDE4RWB3DK3KFPQ/m/target/it-repo/org/apache/maven/plugin/rresource/it/mrr43/resources/1/resources-1.pom
[INFO] 
[INFO] --- maven-deploy-plugin:2.7:deploy (default-deploy) @ resources ---
[INFO] Uploading to it-remote: file:/home/jenkins/jenkins-slave/workspace/ote-resources-plugin_master-FTEJEAA7J3RSA3RGNRQRTOLNK5IUQ7QP3AJQZXDE4RWB3DK3KFPQ/m/target/remote-repo/org/apache/maven/plugin/rresource/it/mrr43/resources/1/resources-1.pom
[INFO] Uploaded to it-remote: file:/home/jenkins/jenkins-slave/workspace/ote-resources-plugin_master-FTEJEAA7J3RSA3RGNRQRTOLNK5IUQ7QP3AJQZXDE4RWB3DK3KFPQ/m/target/remote-repo/org/apache/maven/plugin/rresource/it/mrr43/resources/1/resources-1.pom (1.6 kB at 80 kB/s)
[INFO] Downloading from it-remote: file:/home/jenkins/jenkins-slave/workspace/ote-resources-plugin_master-FTEJEAA7J3RSA3RGNRQRTOLNK5IUQ7QP3AJQZXDE4RWB3DK3KFPQ/m/target/remote-repo/org/apache/maven/plugin/rresource/it/mrr43/resources/maven-metadata.xml
[INFO] Uploading to it-remote: file:/home/jenkins/jenkins-slave/workspace/ote-resources-plugin_master-FTEJEAA7J3RSA3RGNRQRTOLNK5IUQ7QP3AJQZXDE4RWB3DK3KFPQ/m/target/remote-repo/org/apache/maven/plugin/rresource/it/mrr43/resources/maven-metadata.xml
[INFO] Uploaded to it-remote: file:/home/jenkins/jenkins-slave/workspace/ote-resources-plugin_master-FTEJEAA7J3RSA3RGNRQRTOLNK5IUQ7QP3AJQZXDE4RWB3DK3KFPQ/m/target/remote-repo/org/apache/maven/plugin/rresource/it/mrr43/resources/maven-metadata.xml (323 B at 323 kB/s)
[INFO] 
[INFO] ------------------------------------------------------------------------
[INFO] Building supplemental-models 1
[INFO] ------------------------------------------------------------------------
[INFO] 
[INFO] --- maven-clean-plugin:2.5:clean (default-cli) @ supplemental-models ---
[INFO] 
[INFO] --- maven-resources-plugin:2.6:resources (default-resources) @ supplemental-models ---
[WARNING] Using platform encoding (ISO-8859-1 actually) to copy filtered resources, i.e. build is platform dependent!
[INFO] Copying 1 resource
[INFO] 
[INFO] --- maven-compiler-plugin:3.1:compile (default-compile) @ supplemental-models ---
[INFO] No sources to compile
[INFO] 
[INFO] --- maven-resources-plugin:2.6:testResources (default-testResources) @ supplemental-models ---
[WARNING] Using platform encoding (ISO-8859-1 actually) to copy filtered resources, i.e. build is platform dependent!
[INFO] skip non existing resourceDirectory /home/jenkins/jenkins-slave/workspace/ote-resources-plugin_master-FTEJEAA7J3RSA3RGNRQRTOLNK5IUQ7QP3AJQZXDE4RWB3DK3KFPQ/m/target/test-classes/supplemental-artifact/resource-projects/supplemental-models/src/test/resources
[INFO] 
[INFO] --- maven-compiler-plugin:3.1:testCompile (default-testCompile) @ supplemental-models ---
[INFO] No sources to compile
[INFO] 
[INFO] --- maven-surefire-plugin:2.12.4:test (default-test) @ supplemental-models ---
[INFO] No tests to run.
[INFO] 
[INFO] --- maven-jar-plugin:2.4:jar (default-jar) @ supplemental-models ---
[INFO] Building jar: /home/jenkins/jenkins-slave/workspace/ote-resources-plugin_master-FTEJEAA7J3RSA3RGNRQRTOLNK5IUQ7QP3AJQZXDE4RWB3DK3KFPQ/m/target/test-classes/supplemental-artifact/resource-projects/supplemental-models/target/supplemental-models-1.jar
[INFO] 
[INFO] --- maven-install-plugin:2.4:install (default-install) @ supplemental-models ---
[INFO] Installing /home/jenkins/jenkins-slave/workspace/ote-resources-plugin_master-FTEJEAA7J3RSA3RGNRQRTOLNK5IUQ7QP3AJQZXDE4RWB3DK3KFPQ/m/target/test-classes/supplemental-artifact/resource-projects/supplemental-models/target/supplemental-models-1.jar to /home/jenkins/jenkins-slave/workspace/ote-resources-plugin_master-FTEJEAA7J3RSA3RGNRQRTOLNK5IUQ7QP3AJQZXDE4RWB3DK3KFPQ/m/target/it-repo/org/apache/maven/plugin/rresource/it/mrr43/supplemental-models/1/supplemental-models-1.jar
[INFO] Installing /home/jenkins/jenkins-slave/workspace/ote-resources-plugin_master-FTEJEAA7J3RSA3RGNRQRTOLNK5IUQ7QP3AJQZXDE4RWB3DK3KFPQ/m/target/test-classes/supplemental-artifact/resource-projects/supplemental-models/pom.xml to /home/jenkins/jenkins-slave/workspace/ote-resources-plugin_master-FTEJEAA7J3RSA3RGNRQRTOLNK5IUQ7QP3AJQZXDE4RWB3DK3KFPQ/m/target/it-repo/org/apache/maven/plugin/rresource/it/mrr43/supplemental-models/1/supplemental-models-1.pom
[INFO] 
[INFO] --- maven-deploy-plugin:2.7:deploy (default-deploy) @ supplemental-models ---
[INFO] Uploading to it-remote: file:/home/jenkins/jenkins-slave/workspace/ote-resources-plugin_master-FTEJEAA7J3RSA3RGNRQRTOLNK5IUQ7QP3AJQZXDE4RWB3DK3KFPQ/m/target/remote-repo/org/apache/maven/plugin/rresource/it/mrr43/supplemental-models/1/supplemental-models-1.jar
[INFO] Uploaded to it-remote: file:/home/jenkins/jenkins-slave/workspace/ote-resources-plugin_master-FTEJEAA7J3RSA3RGNRQRTOLNK5IUQ7QP3AJQZXDE4RWB3DK3KFPQ/m/target/remote-repo/org/apache/maven/plugin/rresource/it/mrr43/supplemental-models/1/supplemental-models-1.jar (3.0 kB at 1.5 MB/s)
[INFO] Uploading to it-remote: file:/home/jenkins/jenkins-slave/workspace/ote-resources-plugin_master-FTEJEAA7J3RSA3RGNRQRTOLNK5IUQ7QP3AJQZXDE4RWB3DK3KFPQ/m/target/remote-repo/org/apache/maven/plugin/rresource/it/mrr43/supplemental-models/1/supplemental-models-1.pom
[INFO] Uploaded to it-remote: file:/home/jenkins/jenkins-slave/workspace/ote-resources-plugin_master-FTEJEAA7J3RSA3RGNRQRTOLNK5IUQ7QP3AJQZXDE4RWB3DK3KFPQ/m/target/remote-repo/org/apache/maven/plugin/rresource/it/mrr43/supplemental-models/1/supplemental-models-1.pom (1.3 kB at 1.3 MB/s)
[INFO] Downloading from it-remote: file:/home/jenkins/jenkins-slave/workspace/ote-resources-plugin_master-FTEJEAA7J3RSA3RGNRQRTOLNK5IUQ7QP3AJQZXDE4RWB3DK3KFPQ/m/target/remote-repo/org/apache/maven/plugin/rresource/it/mrr43/supplemental-models/maven-metadata.xml
[INFO] Uploading to it-remote: file:/home/jenkins/jenkins-slave/workspace/ote-resources-plugin_master-FTEJEAA7J3RSA3RGNRQRTOLNK5IUQ7QP3AJQZXDE4RWB3DK3KFPQ/m/target/remote-repo/org/apache/maven/plugin/rresource/it/mrr43/supplemental-models/maven-metadata.xml
[INFO] Uploaded to it-remote: file:/home/jenkins/jenkins-slave/workspace/ote-resources-plugin_master-FTEJEAA7J3RSA3RGNRQRTOLNK5IUQ7QP3AJQZXDE4RWB3DK3KFPQ/m/target/remote-repo/org/apache/maven/plugin/rresource/it/mrr43/supplemental-models/maven-metadata.xml (333 B at 333 kB/s)
[INFO] 
[INFO] ------------------------------------------------------------------------
[INFO] Building deficient-dep 1
[INFO] ------------------------------------------------------------------------
[INFO] 
[INFO] --- maven-clean-plugin:2.5:clean (default-cli) @ deficient-dep ---
[INFO] 
[INFO] --- maven-resources-plugin:2.6:resources (default-resources) @ deficient-dep ---
[WARNING] Using platform encoding (ISO-8859-1 actually) to copy filtered resources, i.e. build is platform dependent!
[INFO] skip non existing resourceDirectory /home/jenkins/jenkins-slave/workspace/ote-resources-plugin_master-FTEJEAA7J3RSA3RGNRQRTOLNK5IUQ7QP3AJQZXDE4RWB3DK3KFPQ/m/target/test-classes/supplemental-artifact/resource-projects/deficient-dep/src/main/resources
[INFO] 
[INFO] --- maven-compiler-plugin:3.1:compile (default-compile) @ deficient-dep ---
[INFO] Changes detected - recompiling the module!
[WARNING] File encoding has not been set, using platform encoding ISO-8859-1, i.e. build is platform dependent!
[INFO] Compiling 1 source file to /home/jenkins/jenkins-slave/workspace/ote-resources-plugin_master-FTEJEAA7J3RSA3RGNRQRTOLNK5IUQ7QP3AJQZXDE4RWB3DK3KFPQ/m/target/test-classes/supplemental-artifact/resource-projects/deficient-dep/target/classes
[INFO] -------------------------------------------------------------
[ERROR] COMPILATION ERROR : 
[INFO] -------------------------------------------------------------
[ERROR] Source option 1.5 is no longer supported. Use 1.6 or later.
[ERROR] Target option 1.5 is no longer supported. Use 1.6 or later.
[INFO] 2 errors 
[INFO] -------------------------------------------------------------
[INFO] ------------------------------------------------------------------------
[INFO] Reactor Summary:
[INFO] 
[INFO] resources .......................................... SUCCESS [  0.539 s]
[INFO] supplemental-models ................................ SUCCESS [  0.738 s]
[INFO] deficient-dep ...................................... FAILURE [  0.345 s]
[INFO] ------------------------------------------------------------------------
[INFO] BUILD FAILURE
[INFO] ------------------------------------------------------------------------
[INFO] Total time: 1.826 s
[INFO] Finished at: 2018-03-09T22:46:52Z
[INFO] Final Memory: 14M/52M
[INFO] ------------------------------------------------------------------------
[INFO] [jenkins-event-spy] Generated /home/jenkins/jenkins-slave/workspace/ote-resources-plugin_master-FTEJEAA7J3RSA3RGNRQRTOLNK5IUQ7QP3AJQZXDE4RWB3DK3KFPQ@tmp/withMaven326361b0/maven-spy-20180309-224650-5592166231343142205754.log
[ERROR] Failed to execute goal org.apache.maven.plugins:maven-compiler-plugin:3.1:compile (default-compile) on project deficient-dep: Compilation failure: Compilation failure: 
[ERROR] Source option 1.5 is no longer supported. Use 1.6 or later.
[ERROR] Target option 1.5 is no longer supported. Use 1.6 or later.
[ERROR] -> [Help 1]
org.apache.maven.lifecycle.LifecycleExecutionException: Failed to execute goal org.apache.maven.plugins:maven-compiler-plugin:3.1:compile (default-compile) on project deficient-dep: Compilation failure
    at org.apache.maven.lifecycle.internal.MojoExecutor.execute (MojoExecutor.java:213)
    at org.apache.maven.lifecycle.internal.MojoExecutor.execute (MojoExecutor.java:154)
    at org.apache.maven.lifecycle.internal.MojoExecutor.execute (MojoExecutor.java:146)
    at org.apache.maven.lifecycle.internal.LifecycleModuleBuilder.buildProject (LifecycleModuleBuilder.java:117)
    at org.apache.maven.lifecycle.internal.LifecycleModuleBuilder.buildProject (LifecycleModuleBuilder.java:81)
    at org.apache.maven.lifecycle.internal.builder.singlethreaded.SingleThreadedBuilder.build (SingleThreadedBuilder.java:51)
    at org.apache.maven.lifecycle.internal.LifecycleStarter.execute (LifecycleStarter.java:128)
    at org.apache.maven.DefaultMaven.doExecute (DefaultMaven.java:309)
    at org.apache.maven.DefaultMaven.doExecute (DefaultMaven.java:194)
    at org.apache.maven.DefaultMaven.execute (DefaultMaven.java:107)
    at org.apache.maven.cli.MavenCli.execute (MavenCli.java:955)
    at org.apache.maven.cli.MavenCli.doMain (MavenCli.java:290)
    at org.apache.maven.cli.MavenCli.main (MavenCli.java:194)
    at jdk.internal.reflect.NativeMethodAccessorImpl.invoke0 (Native Method)
    at jdk.internal.reflect.NativeMethodAccessorImpl.invoke (NativeMethodAccessorImpl.java:62)
    at jdk.internal.reflect.DelegatingMethodAccessorImpl.invoke (DelegatingMethodAccessorImpl.java:43)
    at java.lang.reflect.Method.invoke (Method.java:564)
    at org.codehaus.plexus.classworlds.launcher.Launcher.launchEnhanced (Launcher.java:289)
    at org.codehaus.plexus.classworlds.launcher.Launcher.launch (Launcher.java:229)
    at org.codehaus.plexus.classworlds.launcher.Launcher.mainWithExitCode (Launcher.java:415)
    at org.codehaus.plexus.classworlds.launcher.Launcher.main (Launcher.java:356)
Caused by: org.apache.maven.plugin.compiler.CompilationFailureException: Compilation failure
    at org.apache.maven.plugin.compiler.AbstractCompilerMojo.execute (AbstractCompilerMojo.java:858)
    at org.apache.maven.plugin.compiler.CompilerMojo.execute (CompilerMojo.java:129)
    at org.apache.maven.plugin.DefaultBuildPluginManager.executeMojo (DefaultBuildPluginManager.java:134)
    at org.apache.maven.lifecycle.internal.MojoExecutor.execute (MojoExecutor.java:208)
    at org.apache.maven.lifecycle.internal.MojoExecutor.execute (MojoExecutor.java:154)
    at org.apache.maven.lifecycle.internal.MojoExecutor.execute (MojoExecutor.java:146)
    at org.apache.maven.lifecycle.internal.LifecycleModuleBuilder.buildProject (LifecycleModuleBuilder.java:117)
    at org.apache.maven.lifecycle.internal.LifecycleModuleBuilder.buildProject (LifecycleModuleBuilder.java:81)
    at org.apache.maven.lifecycle.internal.builder.singlethreaded.SingleThreadedBuilder.build (SingleThreadedBuilder.java:51)
    at org.apache.maven.lifecycle.internal.LifecycleStarter.execute (LifecycleStarter.java:128)
    at org.apache.maven.DefaultMaven.doExecute (DefaultMaven.java:309)
    at org.apache.maven.DefaultMaven.doExecute (DefaultMaven.java:194)
    at org.apache.maven.DefaultMaven.execute (DefaultMaven.java:107)
    at org.apache.maven.cli.MavenCli.execute (MavenCli.java:955)
    at org.apache.maven.cli.MavenCli.doMain (MavenCli.java:290)
    at org.apache.maven.cli.MavenCli.main (MavenCli.java:194)
    at jdk.internal.reflect.NativeMethodAccessorImpl.invoke0 (Native Method)
    at jdk.internal.reflect.NativeMethodAccessorImpl.invoke (NativeMethodAccessorImpl.java:62)
    at jdk.internal.reflect.DelegatingMethodAccessorImpl.invoke (DelegatingMethodAccessorImpl.java:43)
    at java.lang.reflect.Method.invoke (Method.java:564)
    at org.codehaus.plexus.classworlds.launcher.Launcher.launchEnhanced (Launcher.java:289)
    at org.codehaus.plexus.classworlds.launcher.Launcher.launch (Launcher.java:229)
    at org.codehaus.plexus.classworlds.launcher.Launcher.mainWithExitCode (Launcher.java:415)
    at org.codehaus.plexus.classworlds.launcher.Launcher.main (Launcher.java:356)
[ERROR] 
[ERROR] Re-run Maven using the -X switch to enable full debug logging.
[ERROR] 
[ERROR] For more information about the errors and possible solutions, please read the following articles:
[ERROR] [Help 1] http://cwiki.apache.org/confluence/display/MAVEN/MojoFailureException
[ERROR] 
[ERROR] After correcting the problems, you can resume the build with the command
[ERROR]   mvn <goals> -rf :deficient-dep

	at org.apache.maven.plugin.resources.remote.it.IT_SupplementalArtifact.test(IT_SupplementalArtifact.java:50)


FAILED:  org.apache.maven.plugin.resources.remote.it.IT_RunOnlyAtExecutionRoot.test

Error Message:
Exit code was non-zero: 1; command line and log = 
F:\jenkins\tools\maven\apache-maven-3.5.0\bin\mvn -e --batch-mode -Dmaven.repo.local=f:\jenkins\jenkins-slave\workspace\ote-resources-plugin_master-FTEJEAA7J3RSA3RGNRQRTOLNK5IUQ7QP3AJQZXDE4RWB3DK3KFPQ\m\target/it-repo org.apache.maven.plugins:maven-clean-plugin:clean generate-resources
[INFO] [jenkins-event-spy] Generate F:\jenkins\jenkins-slave\workspace\ote-resources-plugin_master-FTEJEAA7J3RSA3RGNRQRTOLNK5IUQ7QP3AJQZXDE4RWB3DK3KFPQ@tmp\withMaven85f3cf8c\maven-spy-20180309-222516-583766476054060778677.log.tmp ...
[INFO] Error stacktraces are turned on.
[INFO] Scanning for projects...
[INFO] Downloading: http://repository.apache.org/snapshots/org/apache/maven/plugin/rresource/it/it-parent/1.6-SNAPSHOT/maven-metadata.xml
[INFO] Downloading: http://repository.apache.org/snapshots/org/apache/maven/plugin/rresource/it/it-parent/1.6-SNAPSHOT/it-parent-1.6-SNAPSHOT.pom
[ERROR] [ERROR] Some problems were encountered while processing the POMs:
[FATAL] Non-resolvable parent POM for org.apache.maven.plugin.rresource.it.mrr41:parent:[unknown-version]: Could not find artifact org.apache.maven.plugin.rresource.it:it-parent:pom:1.6-SNAPSHOT in apache-snapshots (http://repository.apache.org/snapshots/) and 'parent.relativePath' points at wrong local POM @ org.apache.maven.plugin.rresource.it.mrr41:parent:[unknown-version], F:\jenkins\jenkins-slave\workspace\ote-resources-plugin_master-FTEJEAA7J3RSA3RGNRQRTOLNK5IUQ7QP3AJQZXDE4RWB3DK3KFPQ\m\target\test-classes\run-only-at-execution-root\pom.xml, line 24, column 11
[FATAL] Non-resolvable parent POM for org.apache.maven.plugin.rresource.it.mrr41:parent:[unknown-version]: Failure to find org.apache.maven.plugin.rresource.it:it-parent:pom:1.6-SNAPSHOT in http://repository.apache.org/snapshots/ was cached in the local repository, resolution will not be reattempted until the update interval of apache-snapshots has elapsed or updates are forced and 'parent.relativePath' points at wrong local POM @ org.apache.maven.plugin.rresource.it.mrr41:parent:[unknown-version], F:\jenkins\jenkins-slave\workspace\ote-resources-plugin_master-FTEJEAA7J3RSA3RGNRQRTOLNK5IUQ7QP3AJQZXDE4RWB3DK3KFPQ\m\target\test-classes\run-only-at-execution-root\pom.xml, line 24, column 11
 @ 
[INFO] [jenkins-event-spy] Generated F:\jenkins\jenkins-slave\workspace\ote-resources-plugin_master-FTEJEAA7J3RSA3RGNRQRTOLNK5IUQ7QP3AJQZXDE4RWB3DK3KFPQ@tmp\withMaven85f3cf8c\maven-spy-20180309-222516-583766476054060778677.log
[ERROR] The build could not read 2 projects -> [Help 1]
org.apache.maven.project.ProjectBuildingException: Some problems were encountered while processing the POMs:
[FATAL] Non-resolvable parent POM for org.apache.maven.plugin.rresource.it.mrr41:parent:[unknown-version]: Could not find artifact org.apache.maven.plugin.rresource.it:it-parent:pom:1.6-SNAPSHOT in apache-snapshots (http://repository.apache.org/snapshots/) and 'parent.relativePath' points at wrong local POM @ org.apache.maven.plugin.rresource.it.mrr41:parent:[unknown-version], F:\jenkins\jenkins-slave\workspace\ote-resources-plugin_master-FTEJEAA7J3RSA3RGNRQRTOLNK5IUQ7QP3AJQZXDE4RWB3DK3KFPQ\m\target\test-classes\run-only-at-execution-root\pom.xml, line 24, column 11
[FATAL] Non-resolvable parent POM for org.apache.maven.plugin.rresource.it.mrr41:parent:[unknown-version]: Failure to find org.apache.maven.plugin.rresource.it:it-parent:pom:1.6-SNAPSHOT in http://repository.apache.org/snapshots/ was cached in the local repository, resolution will not be reattempted until the update interval of apache-snapshots has elapsed or updates are forced and 'parent.relativePath' points at wrong local POM @ org.apache.maven.plugin.rresource.it.mrr41:parent:[unknown-version], F:\jenkins\jenkins-slave\workspace\ote-resources-plugin_master-FTEJEAA7J3RSA3RGNRQRTOLNK5IUQ7QP3AJQZXDE4RWB3DK3KFPQ\m\target\test-classes\run-only-at-execution-root\pom.xml, line 24, column 11

 at org.apache.maven.project.DefaultProjectBuilder.build(DefaultProjectBuilder.java:382)
 at org.apache.maven.graph.DefaultGraphBuilder.collectProjects(DefaultGraphBuilder.java:400)
 at org.apache.maven.graph.DefaultGraphBuilder.getProjectsForMavenReactor(DefaultGraphBuilder.java:391)
 at org.apache.maven.graph.DefaultGraphBuilder.build(DefaultGraphBuilder.java:78)
 at org.apache.maven.DefaultMaven.buildGraph(DefaultMaven.java:511)
 at org.apache.maven.DefaultMaven.doExecute(DefaultMaven.java:221)
 at org.apache.maven.DefaultMaven.doExecute(DefaultMaven.java:194)
 at org.apache.maven.DefaultMaven.execute(DefaultMaven.java:107)
 at org.apache.maven.cli.MavenCli.execute(MavenCli.java:993)
 at org.apache.maven.cli.MavenCli.doMain(MavenCli.java:345)
 at org.apache.maven.cli.MavenCli.main(MavenCli.java:191)
 at sun.reflect.NativeMethodAccessorImpl.invoke0(Native Method)
 at sun.reflect.NativeMethodAccessorImpl.invoke(NativeMethodAccessorImpl.java:57)
 at sun.reflect.DelegatingMethodAccessorImpl.invoke(DelegatingMethodAccessorImpl.java:43)
 at java.lang.reflect.Method.invoke(Method.java:606)
 at org.codehaus.plexus.classworlds.launcher.Launcher.launchEnhanced(Launcher.java:289)
 at org.codehaus.plexus.classworlds.launcher.Launcher.launch(Launcher.java:229)
 at org.codehaus.plexus.classworlds.launcher.Launcher.mainWithExitCode(Launcher.java:415)
 at org.codehaus.plexus.classworlds.launcher.Launcher.main(Launcher.java:356)
[ERROR]   
[ERROR]   The project org.apache.maven.plugin.rresource.it.mrr41:child-1:[unknown-version] (F:\jenkins\jenkins-slave\workspace\ote-resources-plugin_master-FTEJEAA7J3RSA3RGNRQRTOLNK5IUQ7QP3AJQZXDE4RWB3DK3KFPQ\m\target\test-classes\run-only-at-execution-root\child1\pom.xml) has 1 error
[ERROR]     Non-resolvable parent POM for org.apache.maven.plugin.rresource.it.mrr41:parent:[unknown-version]: Could not find artifact org.apache.maven.plugin.rresource.it:it-parent:pom:1.6-SNAPSHOT in apache-snapshots (http://repository.apache.org/snapshots/) and 'parent.relativePath' points at wrong local POM @ org.apache.maven.plugin.rresource.it.mrr41:parent:[unknown-version], F:\jenkins\jenkins-slave\workspace\ote-resources-plugin_master-FTEJEAA7J3RSA3RGNRQRTOLNK5IUQ7QP3AJQZXDE4RWB3DK3KFPQ\m\target\test-classes\run-only-at-execution-root\pom.xml, line 24, column 11 -> [Help 2]
org.apache.maven.model.resolution.UnresolvableModelException: Could not find artifact org.apache.maven.plugin.rresource.it:it-parent:pom:1.6-SNAPSHOT in apache-snapshots (http://repository.apache.org/snapshots/)
 at org.apache.maven.project.ProjectModelResolver.resolveModel(ProjectModelResolver.java:197)
 at org.apache.maven.project.ProjectModelResolver.resolveModel(ProjectModelResolver.java:243)
 at org.apache.maven.model.building.DefaultModelBuilder.readParentExternally(DefaultModelBuilder.java:1051)
 at org.apache.maven.model.building.DefaultModelBuilder.readParent(DefaultModelBuilder.java:851)
 at org.apache.maven.model.building.DefaultModelBuilder.build(DefaultModelBuilder.java:331)
 at org.apache.maven.project.DefaultProjectBuilder.build(DefaultProjectBuilder.java:429)
 at org.apache.maven.project.DefaultProjectBuilder.build(DefaultProjectBuilder.java:398)
 at org.apache.maven.project.DefaultProjectBuilder.build(DefaultProjectBuilder.java:515)
 at org.apache.maven.project.DefaultProjectBuilder.build(DefaultProjectBuilder.java:398)
 at org.apache.maven.project.DefaultProjectBuilder.build(DefaultProjectBuilder.java:361)
 at org.apache.maven.graph.DefaultGraphBuilder.collectProjects(DefaultGraphBuilder.java:400)
 at org.apache.maven.graph.DefaultGraphBuilder.getProjectsForMavenReactor(DefaultGraphBuilder.java:391)
 at org.apache.maven.graph.DefaultGraphBuilder.build(DefaultGraphBuilder.java:78)
 at org.apache.maven.DefaultMaven.buildGraph(DefaultMaven.java:511)
 at org.apache.maven.DefaultMaven.doExecute(DefaultMaven.java:221)
 at org.apache.maven.DefaultMaven.doExecute(DefaultMaven.java:194)
 at org.apache.maven.DefaultMaven.execute(DefaultMaven.java:107)
 at org.apache.maven.cli.MavenCli.execute(MavenCli.java:993)
 at org.apache.maven.cli.MavenCli.doMain(MavenCli.java:345)
 at org.apache.maven.cli.MavenCli.main(MavenCli.java:191)
 at sun.reflect.NativeMethodAccessorImpl.invoke0(Native Method)
 at sun.reflect.NativeMethodAccessorImpl.invoke(NativeMethodAccessorImpl.java:57)
 at sun.reflect.DelegatingMethodAccessorImpl.invoke(DelegatingMethodAccessorImpl.java:43)
 at java.lang.reflect.Method.invoke(Method.java:606)
 at org.codehaus.plexus.classworlds.launcher.Launcher.launchEnhanced(Launcher.java:289)
 at org.codehaus.plexus.classworlds.launcher.Launcher.launch(Launcher.java:229)
 at org.codehaus.plexus.classworlds.launcher.Launcher.mainWithExitCode(Launcher.java:415)
 at org.codehaus.plexus.classworlds.launcher.Launcher.main(Launcher.java:356)
Caused by: org.eclipse.aether.resolution.ArtifactResolutionException: Could not find artifact org.apache.maven.plugin.rresource.it:it-parent:pom:1.6-SNAPSHOT in apache-snapshots (http://repository.apache.org/snapshots/)
 at org.eclipse.aether.internal.impl.DefaultArtifactResolver.resolve(DefaultArtifactResolver.java:453)
 at org.eclipse.aether.internal.impl.DefaultArtifactResolver.resolveArtifacts(DefaultArtifactResolver.java:255)
 at org.eclipse.aether.internal.impl.DefaultArtifactResolver.resolveArtifact(DefaultArtifactResolver.java:232)
 at org.eclipse.aether.internal.impl.DefaultRepositorySystem.resolveArtifact(DefaultRepositorySystem.java:303)
 at org.apache.maven.project.ProjectModelResolver.resolveModel(ProjectModelResolver.java:193)
 ... 27 more
Caused by: org.eclipse.aether.transfer.ArtifactNotFoundException: Could not find artifact org.apache.maven.plugin.rresource.it:it-parent:pom:1.6-SNAPSHOT in apache-snapshots (http://repository.apache.org/snapshots/)
 at org.eclipse.aether.connector.basic.ArtifactTransportListener.transferFailed(ArtifactTransportListener.java:48)
 at org.eclipse.aether.connector.basic.BasicRepositoryConnector$TaskRunner.run(BasicRepositoryConnector.java:364)
 at org.eclipse.aether.util.concurrency.RunnableErrorForwarder$1.run(RunnableErrorForwarder.java:76)
 at org.eclipse.aether.connector.basic.BasicRepositoryConnector$DirectExecutor.execute(BasicRepositoryConnector.java:590)
 at org.eclipse.aether.connector.basic.BasicRepositoryConnector.get(BasicRepositoryConnector.java:258)
 at org.eclipse.aether.internal.impl.DefaultArtifactResolver.performDownloads(DefaultArtifactResolver.java:529)
 at org.eclipse.aether.internal.impl.DefaultArtifactResolver.resolve(DefaultArtifactResolver.java:430)
 ... 31 more
[ERROR]   
[ERROR]   The project org.apache.maven.plugin.rresource.it.mrr41:child-2:[unknown-version] (F:\jenkins\jenkins-slave\workspace\ote-resources-plugin_master-FTEJEAA7J3RSA3RGNRQRTOLNK5IUQ7QP3AJQZXDE4RWB3DK3KFPQ\m\target\test-classes\run-only-at-execution-root\child2\pom.xml) has 1 error
[ERROR]     Non-resolvable parent POM for org.apache.maven.plugin.rresource.it.mrr41:parent:[unknown-version]: Failure to find org.apache.maven.plugin.rresource.it:it-parent:pom:1.6-SNAPSHOT in http://repository.apache.org/snapshots/ was cached in the local repository, resolution will not be reattempted until the update interval of apache-snapshots has elapsed or updates are forced and 'parent.relativePath' points at wrong local POM @ org.apache.maven.plugin.rresource.it.mrr41:parent:[unknown-version], F:\jenkins\jenkins-slave\workspace\ote-resources-plugin_master-FTEJEAA7J3RSA3RGNRQRTOLNK5IUQ7QP3AJQZXDE4RWB3DK3KFPQ\m\target\test-classes\run-only-at-execution-root\pom.xml, line 24, column 11 -> [Help 2]
org.apache.maven.model.resolution.UnresolvableModelException: Failure to find org.apache.maven.plugin.rresource.it:it-parent:pom:1.6-SNAPSHOT in http://repository.apache.org/snapshots/ was cached in the local repository, resolution will not be reattempted until the update interval of apache-snapshots has elapsed or updates are forced
 at org.apache.maven.project.ProjectModelResolver.resolveModel(ProjectModelResolver.java:197)
 at org.apache.maven.project.ProjectModelResolver.resolveModel(ProjectModelResolver.java:243)
 at org.apache.maven.model.building.DefaultModelBuilder.readParentExternally(DefaultModelBuilder.java:1051)
 at org.apache.maven.model.building.DefaultModelBuilder.readParent(DefaultModelBuilder.java:851)
 at org.apache.maven.model.building.DefaultModelBuilder.build(DefaultModelBuilder.java:331)
 at org.apache.maven.project.DefaultProjectBuilder.build(DefaultProjectBuilder.java:429)
 at org.apache.maven.project.DefaultProjectBuilder.build(DefaultProjectBuilder.java:398)
 at org.apache.maven.project.DefaultProjectBuilder.build(DefaultProjectBuilder.java:515)
 at org.apache.maven.project.DefaultProjectBuilder.build(DefaultProjectBuilder.java:398)
 at org.apache.maven.project.DefaultProjectBuilder.build(DefaultProjectBuilder.java:361)
 at org.apache.maven.graph.DefaultGraphBuilder.collectProjects(DefaultGraphBuilder.java:400)
 at org.apache.maven.graph.DefaultGraphBuilder.getProjectsForMavenReactor(DefaultGraphBuilder.java:391)
 at org.apache.maven.graph.DefaultGraphBuilder.build(DefaultGraphBuilder.java:78)
 at org.apache.maven.DefaultMaven.buildGraph(DefaultMaven.java:511)
 at org.apache.maven.DefaultMaven.doExecute(DefaultMaven.java:221)
 at org.apache.maven.DefaultMaven.doExecute(DefaultMaven.java:194)
 at org.apache.maven.DefaultMaven.execute(DefaultMaven.java:107)
 at org.apache.maven.cli.MavenCli.execute(MavenCli.java:993)
 at org.apache.maven.cli.MavenCli.doMain(MavenCli.java:345)
 at org.apache.maven.cli.MavenCli.main(MavenCli.java:191)
 at sun.reflect.NativeMethodAccessorImpl.invoke0(Native Method)
 at sun.reflect.NativeMethodAccessorImpl.invoke(NativeMethodAccessorImpl.java:57)
 at sun.reflect.DelegatingMethodAccessorImpl.invoke(DelegatingMethodAccessorImpl.java:43)
 at java.lang.reflect.Method.invoke(Method.java:606)
 at org.codehaus.plexus.classworlds.launcher.Launcher.launchEnhanced(Launcher.java:289)
 at org.codehaus.plexus.classworlds.launcher.Launcher.launch(Launcher.java:229)
 at org.codehaus.plexus.classworlds.launcher.Launcher.mainWithExitCode(Launcher.java:415)
 at org.codehaus.plexus.classworlds.launcher.Launcher.main(Launcher.java:356)
Caused by: org.eclipse.aether.resolution.ArtifactResolutionException: Failure to find org.apache.maven.plugin.rresource.it:it-parent:pom:1.6-SNAPSHOT in http://repository.apache.org/snapshots/ was cached in the local repository, resolution will not be reattempted until the update interval of apache-snapshots has elapsed or updates are forced
 at org.eclipse.aether.internal.impl.DefaultArtifactResolver.resolve(DefaultArtifactResolver.java:453)
 at org.eclipse.aether.internal.impl.DefaultArtifactResolver.resolveArtifacts(DefaultArtifactResolver.java:255)
 at org.eclipse.aether.internal.impl.DefaultArtifactResolver.resolveArtifact(DefaultArtifactResolver.java:232)
 at org.eclipse.aether.internal.impl.DefaultRepositorySystem.resolveArtifact(DefaultRepositorySystem.java:303)
 at org.apache.maven.project.ProjectModelResolver.resolveModel(ProjectModelResolver.java:193)
 ... 27 more
Caused by: org.eclipse.aether.transfer.ArtifactNotFoundException: Failure to find org.apache.maven.plugin.rresource.it:it-parent:pom:1.6-SNAPSHOT in http://repository.apache.org/snapshots/ was cached in the local repository, resolution will not be reattempted until the update interval of apache-snapshots has elapsed or updates are forced
 at org.eclipse.aether.internal.impl.DefaultUpdateCheckManager.newException(DefaultUpdateCheckManager.java:240)
 at org.eclipse.aether.internal.impl.DefaultUpdateCheckManager.checkArtifact(DefaultUpdateCheckManager.java:192)
 at org.eclipse.aether.internal.impl.DefaultArtifactResolver.gatherDownloads(DefaultArtifactResolver.java:594)
 at org.eclipse.aether.internal.impl.DefaultArtifactResolver.performDownloads(DefaultArtifactResolver.java:512)
 at org.eclipse.aether.internal.impl.DefaultArtifactResolver.resolve(DefaultArtifactResolver.java:430)
 ... 31 more
[ERROR] 
[ERROR] Re-run Maven using the -X switch to enable full debug logging.
[ERROR] 
[ERROR] For more information about the errors and possible solutions, please read the following articles:
[ERROR] [Help 1] http://cwiki.apache.org/confluence/display/MAVEN/ProjectBuildingException
[ERROR] [Help 2] http://cwiki.apache.org/confluence/display/MAVEN/UnresolvableModelException
Picked up JAVA_TOOL_OPTIONS: -Dmaven.ext.class.path="f:\jenkins\jenkins-slave\workspace\ote-resources-plugin_master-FTEJEAA7J3RSA3RGNRQRTOLNK5IUQ7QP3AJQZXDE4RWB3DK3KFPQ@tmp\withMaven85f3cf8c\pipeline-maven-spy.jar" -Dorg.jenkinsci.plugins.pipeline.maven.reportsFolder="f:\jenkins\jenkins-slave\workspace\ote-resources-plugin_master-FTEJEAA7J3RSA3RGNRQRTOLNK5IUQ7QP3AJQZXDE4RWB3DK3KFPQ@tmp\withMaven85f3cf8c" 


Stack Trace:
org.apache.maven.it.VerificationException: 
Exit code was non-zero: 1; command line and log = 
F:\jenkins\tools\maven\apache-maven-3.5.0\bin\mvn -e --batch-mode -Dmaven.repo.local=f:\jenkins\jenkins-slave\workspace\ote-resources-plugin_master-FTEJEAA7J3RSA3RGNRQRTOLNK5IUQ7QP3AJQZXDE4RWB3DK3KFPQ\m\target/it-repo org.apache.maven.plugins:maven-clean-plugin:clean generate-resources
[INFO] [jenkins-event-spy] Generate F:\jenkins\jenkins-slave\workspace\ote-resources-plugin_master-FTEJEAA7J3RSA3RGNRQRTOLNK5IUQ7QP3AJQZXDE4RWB3DK3KFPQ@tmp\withMaven85f3cf8c\maven-spy-20180309-222516-583766476054060778677.log.tmp ...
[INFO] Error stacktraces are turned on.
[INFO] Scanning for projects...
[INFO] Downloading: http://repository.apache.org/snapshots/org/apache/maven/plugin/rresource/it/it-parent/1.6-SNAPSHOT/maven-metadata.xml
[INFO] Downloading: http://repository.apache.org/snapshots/org/apache/maven/plugin/rresource/it/it-parent/1.6-SNAPSHOT/it-parent-1.6-SNAPSHOT.pom
[ERROR] [ERROR] Some problems were encountered while processing the POMs:
[FATAL] Non-resolvable parent POM for org.apache.maven.plugin.rresource.it.mrr41:parent:[unknown-version]: Could not find artifact org.apache.maven.plugin.rresource.it:it-parent:pom:1.6-SNAPSHOT in apache-snapshots (http://repository.apache.org/snapshots/) and 'parent.relativePath' points at wrong local POM @ org.apache.maven.plugin.rresource.it.mrr41:parent:[unknown-version], F:\jenkins\jenkins-slave\workspace\ote-resources-plugin_master-FTEJEAA7J3RSA3RGNRQRTOLNK5IUQ7QP3AJQZXDE4RWB3DK3KFPQ\m\target\test-classes\run-only-at-execution-root\pom.xml, line 24, column 11
[FATAL] Non-resolvable parent POM for org.apache.maven.plugin.rresource.it.mrr41:parent:[unknown-version]: Failure to find org.apache.maven.plugin.rresource.it:it-parent:pom:1.6-SNAPSHOT in http://repository.apache.org/snapshots/ was cached in the local repository, resolution will not be reattempted until the update interval of apache-snapshots has elapsed or updates are forced and 'parent.relativePath' points at wrong local POM @ org.apache.maven.plugin.rresource.it.mrr41:parent:[unknown-version], F:\jenkins\jenkins-slave\workspace\ote-resources-plugin_master-FTEJEAA7J3RSA3RGNRQRTOLNK5IUQ7QP3AJQZXDE4RWB3DK3KFPQ\m\target\test-classes\run-only-at-execution-root\pom.xml, line 24, column 11
 @ 
[INFO] [jenkins-event-spy] Generated F:\jenkins\jenkins-slave\workspace\ote-resources-plugin_master-FTEJEAA7J3RSA3RGNRQRTOLNK5IUQ7QP3AJQZXDE4RWB3DK3KFPQ@tmp\withMaven85f3cf8c\maven-spy-20180309-222516-583766476054060778677.log
[ERROR] The build could not read 2 projects -> [Help 1]
org.apache.maven.project.ProjectBuildingException: Some problems were encountered while processing the POMs:
[FATAL] Non-resolvable parent POM for org.apache.maven.plugin.rresource.it.mrr41:parent:[unknown-version]: Could not find artifact org.apache.maven.plugin.rresource.it:it-parent:pom:1.6-SNAPSHOT in apache-snapshots (http://repository.apache.org/snapshots/) and 'parent.relativePath' points at wrong local POM @ org.apache.maven.plugin.rresource.it.mrr41:parent:[unknown-version], F:\jenkins\jenkins-slave\workspace\ote-resources-plugin_master-FTEJEAA7J3RSA3RGNRQRTOLNK5IUQ7QP3AJQZXDE4RWB3DK3KFPQ\m\target\test-classes\run-only-at-execution-root\pom.xml, line 24, column 11
[FATAL] Non-resolvable parent POM for org.apache.maven.plugin.rresource.it.mrr41:parent:[unknown-version]: Failure to find org.apache.maven.plugin.rresource.it:it-parent:pom:1.6-SNAPSHOT in http://repository.apache.org/snapshots/ was cached in the local repository, resolution will not be reattempted until the update interval of apache-snapshots has elapsed or updates are forced and 'parent.relativePath' points at wrong local POM @ org.apache.maven.plugin.rresource.it.mrr41:parent:[unknown-version], F:\jenkins\jenkins-slave\workspace\ote-resources-plugin_master-FTEJEAA7J3RSA3RGNRQRTOLNK5IUQ7QP3AJQZXDE4RWB3DK3KFPQ\m\target\test-classes\run-only-at-execution-root\pom.xml, line 24, column 11

	at org.apache.maven.project.DefaultProjectBuilder.build(DefaultProjectBuilder.java:382)
	at org.apache.maven.graph.DefaultGraphBuilder.collectProjects(DefaultGraphBuilder.java:400)
	at org.apache.maven.graph.DefaultGraphBuilder.getProjectsForMavenReactor(DefaultGraphBuilder.java:391)
	at org.apache.maven.graph.DefaultGraphBuilder.build(DefaultGraphBuilder.java:78)
	at org.apache.maven.DefaultMaven.buildGraph(DefaultMaven.java:511)
	at org.apache.maven.DefaultMaven.doExecute(DefaultMaven.java:221)
	at org.apache.maven.DefaultMaven.doExecute(DefaultMaven.java:194)
	at org.apache.maven.DefaultMaven.execute(DefaultMaven.java:107)
	at org.apache.maven.cli.MavenCli.execute(MavenCli.java:993)
	at org.apache.maven.cli.MavenCli.doMain(MavenCli.java:345)
	at org.apache.maven.cli.MavenCli.main(MavenCli.java:191)
	at sun.reflect.NativeMethodAccessorImpl.invoke0(Native Method)
	at sun.reflect.NativeMethodAccessorImpl.invoke(NativeMethodAccessorImpl.java:57)
	at sun.reflect.DelegatingMethodAccessorImpl.invoke(DelegatingMethodAccessorImpl.java:43)
	at java.lang.reflect.Method.invoke(Method.java:606)
	at org.codehaus.plexus.classworlds.launcher.Launcher.launchEnhanced(Launcher.java:289)
	at org.codehaus.plexus.classworlds.launcher.Launcher.launch(Launcher.java:229)
	at org.codehaus.plexus.classworlds.launcher.Launcher.mainWithExitCode(Launcher.java:415)
	at org.codehaus.plexus.classworlds.launcher.Launcher.main(Launcher.java:356)
[ERROR]   
[ERROR]   The project org.apache.maven.plugin.rresource.it.mrr41:child-1:[unknown-version] (F:\jenkins\jenkins-slave\workspace\ote-resources-plugin_master-FTEJEAA7J3RSA3RGNRQRTOLNK5IUQ7QP3AJQZXDE4RWB3DK3KFPQ\m\target\test-classes\run-only-at-execution-root\child1\pom.xml) has 1 error
[ERROR]     Non-resolvable parent POM for org.apache.maven.plugin.rresource.it.mrr41:parent:[unknown-version]: Could not find artifact org.apache.maven.plugin.rresource.it:it-parent:pom:1.6-SNAPSHOT in apache-snapshots (http://repository.apache.org/snapshots/) and 'parent.relativePath' points at wrong local POM @ org.apache.maven.plugin.rresource.it.mrr41:parent:[unknown-version], F:\jenkins\jenkins-slave\workspace\ote-resources-plugin_master-FTEJEAA7J3RSA3RGNRQRTOLNK5IUQ7QP3AJQZXDE4RWB3DK3KFPQ\m\target\test-classes\run-only-at-execution-root\pom.xml, line 24, column 11 -> [Help 2]
org.apache.maven.model.resolution.UnresolvableModelException: Could not find artifact org.apache.maven.plugin.rresource.it:it-parent:pom:1.6-SNAPSHOT in apache-snapshots (http://repository.apache.org/snapshots/)
	at org.apache.maven.project.ProjectModelResolver.resolveModel(ProjectModelResolver.java:197)
	at org.apache.maven.project.ProjectModelResolver.resolveModel(ProjectModelResolver.java:243)
	at org.apache.maven.model.building.DefaultModelBuilder.readParentExternally(DefaultModelBuilder.java:1051)
	at org.apache.maven.model.building.DefaultModelBuilder.readParent(DefaultModelBuilder.java:851)
	at org.apache.maven.model.building.DefaultModelBuilder.build(DefaultModelBuilder.java:331)
	at org.apache.maven.project.DefaultProjectBuilder.build(DefaultProjectBuilder.java:429)
	at org.apache.maven.project.DefaultProjectBuilder.build(DefaultProjectBuilder.java:398)
	at org.apache.maven.project.DefaultProjectBuilder.build(DefaultProjectBuilder.java:515)
	at org.apache.maven.project.DefaultProjectBuilder.build(DefaultProjectBuilder.java:398)
	at org.apache.maven.project.DefaultProjectBuilder.build(DefaultProjectBuilder.java:361)
	at org.apache.maven.graph.DefaultGraphBuilder.collectProjects(DefaultGraphBuilder.java:400)
	at org.apache.maven.graph.DefaultGraphBuilder.getProjectsForMavenReactor(DefaultGraphBuilder.java:391)
	at org.apache.maven.graph.DefaultGraphBuilder.build(DefaultGraphBuilder.java:78)
	at org.apache.maven.DefaultMaven.buildGraph(DefaultMaven.java:511)
	at org.apache.maven.DefaultMaven.doExecute(DefaultMaven.java:221)
	at org.apache.maven.DefaultMaven.doExecute(DefaultMaven.java:194)
	at org.apache.maven.DefaultMaven.execute(DefaultMaven.java:107)
	at org.apache.maven.cli.MavenCli.execute(MavenCli.java:993)
	at org.apache.maven.cli.MavenCli.doMain(MavenCli.java:345)
	at org.apache.maven.cli.MavenCli.main(MavenCli.java:191)
	at sun.reflect.NativeMethodAccessorImpl.invoke0(Native Method)
	at sun.reflect.NativeMethodAccessorImpl.invoke(NativeMethodAccessorImpl.java:57)
	at sun.reflect.DelegatingMethodAccessorImpl.invoke(DelegatingMethodAccessorImpl.java:43)
	at java.lang.reflect.Method.invoke(Method.java:606)
	at org.codehaus.plexus.classworlds.launcher.Launcher.launchEnhanced(Launcher.java:289)
	at org.codehaus.plexus.classworlds.launcher.Launcher.launch(Launcher.java:229)
	at org.codehaus.plexus.classworlds.launcher.Launcher.mainWithExitCode(Launcher.java:415)
	at org.codehaus.plexus.classworlds.launcher.Launcher.main(Launcher.java:356)
Caused by: org.eclipse.aether.resolution.ArtifactResolutionException: Could not find artifact org.apache.maven.plugin.rresource.it:it-parent:pom:1.6-SNAPSHOT in apache-snapshots (http://repository.apache.org/snapshots/)
	at org.eclipse.aether.internal.impl.DefaultArtifactResolver.resolve(DefaultArtifactResolver.java:453)
	at org.eclipse.aether.internal.impl.DefaultArtifactResolver.resolveArtifacts(DefaultArtifactResolver.java:255)
	at org.eclipse.aether.internal.impl.DefaultArtifactResolver.resolveArtifact(DefaultArtifactResolver.java:232)
	at org.eclipse.aether.internal.impl.DefaultRepositorySystem.resolveArtifact(DefaultRepositorySystem.java:303)
	at org.apache.maven.project.ProjectModelResolver.resolveModel(ProjectModelResolver.java:193)
	... 27 more
Caused by: org.eclipse.aether.transfer.ArtifactNotFoundException: Could not find artifact org.apache.maven.plugin.rresource.it:it-parent:pom:1.6-SNAPSHOT in apache-snapshots (http://repository.apache.org/snapshots/)
	at org.eclipse.aether.connector.basic.ArtifactTransportListener.transferFailed(ArtifactTransportListener.java:48)
	at org.eclipse.aether.connector.basic.BasicRepositoryConnector$TaskRunner.run(BasicRepositoryConnector.java:364)
	at org.eclipse.aether.util.concurrency.RunnableErrorForwarder$1.run(RunnableErrorForwarder.java:76)
	at org.eclipse.aether.connector.basic.BasicRepositoryConnector$DirectExecutor.execute(BasicRepositoryConnector.java:590)
	at org.eclipse.aether.connector.basic.BasicRepositoryConnector.get(BasicRepositoryConnector.java:258)
	at org.eclipse.aether.internal.impl.DefaultArtifactResolver.performDownloads(DefaultArtifactResolver.java:529)
	at org.eclipse.aether.internal.impl.DefaultArtifactResolver.resolve(DefaultArtifactResolver.java:430)
	... 31 more
[ERROR]   
[ERROR]   The project org.apache.maven.plugin.rresource.it.mrr41:child-2:[unknown-version] (F:\jenkins\jenkins-slave\workspace\ote-resources-plugin_master-FTEJEAA7J3RSA3RGNRQRTOLNK5IUQ7QP3AJQZXDE4RWB3DK3KFPQ\m\target\test-classes\run-only-at-execution-root\child2\pom.xml) has 1 error
[ERROR]     Non-resolvable parent POM for org.apache.maven.plugin.rresource.it.mrr41:parent:[unknown-version]: Failure to find org.apache.maven.plugin.rresource.it:it-parent:pom:1.6-SNAPSHOT in http://repository.apache.org/snapshots/ was cached in the local repository, resolution will not be reattempted until the update interval of apache-snapshots has elapsed or updates are forced and 'parent.relativePath' points at wrong local POM @ org.apache.maven.plugin.rresource.it.mrr41:parent:[unknown-version], F:\jenkins\jenkins-slave\workspace\ote-resources-plugin_master-FTEJEAA7J3RSA3RGNRQRTOLNK5IUQ7QP3AJQZXDE4RWB3DK3KFPQ\m\target\test-classes\run-only-at-execution-root\pom.xml, line 24, column 11 -> [Help 2]
org.apache.maven.model.resolution.UnresolvableModelException: Failure to find org.apache.maven.plugin.rresource.it:it-parent:pom:1.6-SNAPSHOT in http://repository.apache.org/snapshots/ was cached in the local repository, resolution will not be reattempted until the update interval of apache-snapshots has elapsed or updates are forced
	at org.apache.maven.project.ProjectModelResolver.resolveModel(ProjectModelResolver.java:197)
	at org.apache.maven.project.ProjectModelResolver.resolveModel(ProjectModelResolver.java:243)
	at org.apache.maven.model.building.DefaultModelBuilder.readParentExternally(DefaultModelBuilder.java:1051)
	at org.apache.maven.model.building.DefaultModelBuilder.readParent(DefaultModelBuilder.java:851)
	at org.apache.maven.model.building.DefaultModelBuilder.build(DefaultModelBuilder.java:331)
	at org.apache.maven.project.DefaultProjectBuilder.build(DefaultProjectBuilder.java:429)
	at org.apache.maven.project.DefaultProjectBuilder.build(DefaultProjectBuilder.java:398)
	at org.apache.maven.project.DefaultProjectBuilder.build(DefaultProjectBuilder.java:515)
	at org.apache.maven.project.DefaultProjectBuilder.build(DefaultProjectBuilder.java:398)
	at org.apache.maven.project.DefaultProjectBuilder.build(DefaultProjectBuilder.java:361)
	at org.apache.maven.graph.DefaultGraphBuilder.collectProjects(DefaultGraphBuilder.java:400)
	at org.apache.maven.graph.DefaultGraphBuilder.getProjectsForMavenReactor(DefaultGraphBuilder.java:391)
	at org.apache.maven.graph.DefaultGraphBuilder.build(DefaultGraphBuilder.java:78)
	at org.apache.maven.DefaultMaven.buildGraph(DefaultMaven.java:511)
	at org.apache.maven.DefaultMaven.doExecute(DefaultMaven.java:221)
	at org.apache.maven.DefaultMaven.doExecute(DefaultMaven.java:194)
	at org.apache.maven.DefaultMaven.execute(DefaultMaven.java:107)
	at org.apache.maven.cli.MavenCli.execute(MavenCli.java:993)
	at org.apache.maven.cli.MavenCli.doMain(MavenCli.java:345)
	at org.apache.maven.cli.MavenCli.main(MavenCli.java:191)
	at sun.reflect.NativeMethodAccessorImpl.invoke0(Native Method)
	at sun.reflect.NativeMethodAccessorImpl.invoke(NativeMethodAccessorImpl.java:57)
	at sun.reflect.DelegatingMethodAccessorImpl.invoke(DelegatingMethodAccessorImpl.java:43)
	at java.lang.reflect.Method.invoke(Method.java:606)
	at org.codehaus.plexus.classworlds.launcher.Launcher.launchEnhanced(Launcher.java:289)
	at org.codehaus.plexus.classworlds.launcher.Launcher.launch(Launcher.java:229)
	at org.codehaus.plexus.classworlds.launcher.Launcher.mainWithExitCode(Launcher.java:415)
	at org.codehaus.plexus.classworlds.launcher.Launcher.main(Launcher.java:356)
Caused by: org.eclipse.aether.resolution.ArtifactResolutionException: Failure to find org.apache.maven.plugin.rresource.it:it-parent:pom:1.6-SNAPSHOT in http://repository.apache.org/snapshots/ was cached in the local repository, resolution will not be reattempted until the update interval of apache-snapshots has elapsed or updates are forced
	at org.eclipse.aether.internal.impl.DefaultArtifactResolver.resolve(DefaultArtifactResolver.java:453)
	at org.eclipse.aether.internal.impl.DefaultArtifactResolver.resolveArtifacts(DefaultArtifactResolver.java:255)
	at org.eclipse.aether.internal.impl.DefaultArtifactResolver.resolveArtifact(DefaultArtifactResolver.java:232)
	at org.eclipse.aether.internal.impl.DefaultRepositorySystem.resolveArtifact(DefaultRepositorySystem.java:303)
	at org.apache.maven.project.ProjectModelResolver.resolveModel(ProjectModelResolver.java:193)
	... 27 more
Caused by: org.eclipse.aether.transfer.ArtifactNotFoundException: Failure to find org.apache.maven.plugin.rresource.it:it-parent:pom:1.6-SNAPSHOT in http://repository.apache.org/snapshots/ was cached in the local repository, resolution will not be reattempted until the update interval of apache-snapshots has elapsed or updates are forced
	at org.eclipse.aether.internal.impl.DefaultUpdateCheckManager.newException(DefaultUpdateCheckManager.java:240)
	at org.eclipse.aether.internal.impl.DefaultUpdateCheckManager.checkArtifact(DefaultUpdateCheckManager.java:192)
	at org.eclipse.aether.internal.impl.DefaultArtifactResolver.gatherDownloads(DefaultArtifactResolver.java:594)
	at org.eclipse.aether.internal.impl.DefaultArtifactResolver.performDownloads(DefaultArtifactResolver.java:512)
	at org.eclipse.aether.internal.impl.DefaultArtifactResolver.resolve(DefaultArtifactResolver.java:430)
	... 31 more
[ERROR] 
[ERROR] Re-run Maven using the -X switch to enable full debug logging.
[ERROR] 
[ERROR] For more information about the errors and possible solutions, please read the following articles:
[ERROR] [Help 1] http://cwiki.apache.org/confluence/display/MAVEN/ProjectBuildingException
[ERROR] [Help 2] http://cwiki.apache.org/confluence/display/MAVEN/UnresolvableModelException
Picked up JAVA_TOOL_OPTIONS: -Dmaven.ext.class.path="f:\jenkins\jenkins-slave\workspace\ote-resources-plugin_master-FTEJEAA7J3RSA3RGNRQRTOLNK5IUQ7QP3AJQZXDE4RWB3DK3KFPQ@tmp\withMaven85f3cf8c\pipeline-maven-spy.jar" -Dorg.jenkinsci.plugins.pipeline.maven.reportsFolder="f:\jenkins\jenkins-slave\workspace\ote-resources-plugin_master-FTEJEAA7J3RSA3RGNRQRTOLNK5IUQ7QP3AJQZXDE4RWB3DK3KFPQ@tmp\withMaven85f3cf8c" 

	at org.apache.maven.plugin.resources.remote.it.IT_RunOnlyAtExecutionRoot.test(IT_RunOnlyAtExecutionRoot.java:60)


FAILED:  org.apache.maven.plugin.resources.remote.it.IT_RunOnlyAtExecutionRoot.test

Error Message:
Exit code was non-zero: 1; command line and log = 
F:\jenkins\tools\maven\apache-maven-3.5.0\bin\mvn -e --batch-mode -Dmaven.repo.local=f:\jenkins\jenkins-slave\workspace\ote-resources-plugin_master-FTEJEAA7J3RSA3RGNRQRTOLNK5IUQ7QP3AJQZXDE4RWB3DK3KFPQ\m\target/it-repo org.apache.maven.plugins:maven-clean-plugin:clean generate-resources
Picked up JAVA_TOOL_OPTIONS: -Dmaven.ext.class.path="f:\jenkins\jenkins-slave\workspace\ote-resources-plugin_master-FTEJEAA7J3RSA3RGNRQRTOLNK5IUQ7QP3AJQZXDE4RWB3DK3KFPQ@tmp\withMaven0b26eef1\pipeline-maven-spy.jar" -Dorg.jenkinsci.plugins.pipeline.maven.reportsFolder="f:\jenkins\jenkins-slave\workspace\ote-resources-plugin_master-FTEJEAA7J3RSA3RGNRQRTOLNK5IUQ7QP3AJQZXDE4RWB3DK3KFPQ@tmp\withMaven0b26eef1" 
[INFO] [jenkins-event-spy] Generate F:\jenkins\jenkins-slave\workspace\ote-resources-plugin_master-FTEJEAA7J3RSA3RGNRQRTOLNK5IUQ7QP3AJQZXDE4RWB3DK3KFPQ@tmp\withMaven0b26eef1\maven-spy-20180309-222523-5453441108199610595535.log.tmp ...
[INFO] Error stacktraces are turned on.
[INFO] Scanning for projects...
[INFO] Downloading: http://repository.apache.org/snapshots/org/apache/maven/plugin/rresource/it/it-parent/1.6-SNAPSHOT/maven-metadata.xml
[INFO] Downloading: http://repository.apache.org/snapshots/org/apache/maven/plugin/rresource/it/it-parent/1.6-SNAPSHOT/it-parent-1.6-SNAPSHOT.pom
[ERROR] [ERROR] Some problems were encountered while processing the POMs:
[FATAL] Non-resolvable parent POM for org.apache.maven.plugin.rresource.it.mrr41:parent:[unknown-version]: Could not find artifact org.apache.maven.plugin.rresource.it:it-parent:pom:1.6-SNAPSHOT in apache-snapshots (http://repository.apache.org/snapshots/) and 'parent.relativePath' points at wrong local POM @ org.apache.maven.plugin.rresource.it.mrr41:parent:[unknown-version], F:\jenkins\jenkins-slave\workspace\ote-resources-plugin_master-FTEJEAA7J3RSA3RGNRQRTOLNK5IUQ7QP3AJQZXDE4RWB3DK3KFPQ\m\target\test-classes\run-only-at-execution-root\pom.xml, line 24, column 11
[FATAL] Non-resolvable parent POM for org.apache.maven.plugin.rresource.it.mrr41:parent:[unknown-version]: Failure to find org.apache.maven.plugin.rresource.it:it-parent:pom:1.6-SNAPSHOT in http://repository.apache.org/snapshots/ was cached in the local repository, resolution will not be reattempted until the update interval of apache-snapshots has elapsed or updates are forced and 'parent.relativePath' points at wrong local POM @ org.apache.maven.plugin.rresource.it.mrr41:parent:[unknown-version], F:\jenkins\jenkins-slave\workspace\ote-resources-plugin_master-FTEJEAA7J3RSA3RGNRQRTOLNK5IUQ7QP3AJQZXDE4RWB3DK3KFPQ\m\target\test-classes\run-only-at-execution-root\pom.xml, line 24, column 11
 @ 
[INFO] [jenkins-event-spy] Generated F:\jenkins\jenkins-slave\workspace\ote-resources-plugin_master-FTEJEAA7J3RSA3RGNRQRTOLNK5IUQ7QP3AJQZXDE4RWB3DK3KFPQ@tmp\withMaven0b26eef1\maven-spy-20180309-222523-5453441108199610595535.log
[ERROR] The build could not read 2 projects -> [Help 1]
org.apache.maven.project.ProjectBuildingException: Some problems were encountered while processing the POMs:
[FATAL] Non-resolvable parent POM for org.apache.maven.plugin.rresource.it.mrr41:parent:[unknown-version]: Could not find artifact org.apache.maven.plugin.rresource.it:it-parent:pom:1.6-SNAPSHOT in apache-snapshots (http://repository.apache.org/snapshots/) and 'parent.relativePath' points at wrong local POM @ org.apache.maven.plugin.rresource.it.mrr41:parent:[unknown-version], F:\jenkins\jenkins-slave\workspace\ote-resources-plugin_master-FTEJEAA7J3RSA3RGNRQRTOLNK5IUQ7QP3AJQZXDE4RWB3DK3KFPQ\m\target\test-classes\run-only-at-execution-root\pom.xml, line 24, column 11
[FATAL] Non-resolvable parent POM for org.apache.maven.plugin.rresource.it.mrr41:parent:[unknown-version]: Failure to find org.apache.maven.plugin.rresource.it:it-parent:pom:1.6-SNAPSHOT in http://repository.apache.org/snapshots/ was cached in the local repository, resolution will not be reattempted until the update interval of apache-snapshots has elapsed or updates are forced and 'parent.relativePath' points at wrong local POM @ org.apache.maven.plugin.rresource.it.mrr41:parent:[unknown-version], F:\jenkins\jenkins-slave\workspace\ote-resources-plugin_master-FTEJEAA7J3RSA3RGNRQRTOLNK5IUQ7QP3AJQZXDE4RWB3DK3KFPQ\m\target\test-classes\run-only-at-execution-root\pom.xml, line 24, column 11

 at org.apache.maven.project.DefaultProjectBuilder.build(DefaultProjectBuilder.java:382)
 at org.apache.maven.graph.DefaultGraphBuilder.collectProjects(DefaultGraphBuilder.java:400)
 at org.apache.maven.graph.DefaultGraphBuilder.getProjectsForMavenReactor(DefaultGraphBuilder.java:391)
 at org.apache.maven.graph.DefaultGraphBuilder.build(DefaultGraphBuilder.java:78)
 at org.apache.maven.DefaultMaven.buildGraph(DefaultMaven.java:511)
 at org.apache.maven.DefaultMaven.doExecute(DefaultMaven.java:221)
 at org.apache.maven.DefaultMaven.doExecute(DefaultMaven.java:194)
 at org.apache.maven.DefaultMaven.execute(DefaultMaven.java:107)
 at org.apache.maven.cli.MavenCli.execute(MavenCli.java:993)
 at org.apache.maven.cli.MavenCli.doMain(MavenCli.java:345)
 at org.apache.maven.cli.MavenCli.main(MavenCli.java:191)
 at java.base/jdk.internal.reflect.NativeMethodAccessorImpl.invoke0(Native Method)
 at java.base/jdk.internal.reflect.NativeMethodAccessorImpl.invoke(NativeMethodAccessorImpl.java:62)
 at java.base/jdk.internal.reflect.DelegatingMethodAccessorImpl.invoke(DelegatingMethodAccessorImpl.java:43)
 at java.base/java.lang.reflect.Method.invoke(Method.java:564)
 at org.codehaus.plexus.classworlds.launcher.Launcher.launchEnhanced(Launcher.java:289)
 at org.codehaus.plexus.classworlds.launcher.Launcher.launch(Launcher.java:229)
 at org.codehaus.plexus.classworlds.launcher.Launcher.mainWithExitCode(Launcher.java:415)
 at org.codehaus.plexus.classworlds.launcher.Launcher.main(Launcher.java:356)
[ERROR]   
[ERROR]   The project org.apache.maven.plugin.rresource.it.mrr41:child-1:[unknown-version] (F:\jenkins\jenkins-slave\workspace\ote-resources-plugin_master-FTEJEAA7J3RSA3RGNRQRTOLNK5IUQ7QP3AJQZXDE4RWB3DK3KFPQ\m\target\test-classes\run-only-at-execution-root\child1\pom.xml) has 1 error
[ERROR]     Non-resolvable parent POM for org.apache.maven.plugin.rresource.it.mrr41:parent:[unknown-version]: Could not find artifact org.apache.maven.plugin.rresource.it:it-parent:pom:1.6-SNAPSHOT in apache-snapshots (http://repository.apache.org/snapshots/) and 'parent.relativePath' points at wrong local POM @ org.apache.maven.plugin.rresource.it.mrr41:parent:[unknown-version], F:\jenkins\jenkins-slave\workspace\ote-resources-plugin_master-FTEJEAA7J3RSA3RGNRQRTOLNK5IUQ7QP3AJQZXDE4RWB3DK3KFPQ\m\target\test-classes\run-only-at-execution-root\pom.xml, line 24, column 11 -> [Help 2]
org.apache.maven.model.resolution.UnresolvableModelException: Could not find artifact org.apache.maven.plugin.rresource.it:it-parent:pom:1.6-SNAPSHOT in apache-snapshots (http://repository.apache.org/snapshots/)
 at org.apache.maven.project.ProjectModelResolver.resolveModel(ProjectModelResolver.java:197)
 at org.apache.maven.project.ProjectModelResolver.resolveModel(ProjectModelResolver.java:243)
 at org.apache.maven.model.building.DefaultModelBuilder.readParentExternally(DefaultModelBuilder.java:1051)
 at org.apache.maven.model.building.DefaultModelBuilder.readParent(DefaultModelBuilder.java:851)
 at org.apache.maven.model.building.DefaultModelBuilder.build(DefaultModelBuilder.java:331)
 at org.apache.maven.project.DefaultProjectBuilder.build(DefaultProjectBuilder.java:429)
 at org.apache.maven.project.DefaultProjectBuilder.build(DefaultProjectBuilder.java:398)
 at org.apache.maven.project.DefaultProjectBuilder.build(DefaultProjectBuilder.java:515)
 at org.apache.maven.project.DefaultProjectBuilder.build(DefaultProjectBuilder.java:398)
 at org.apache.maven.project.DefaultProjectBuilder.build(DefaultProjectBuilder.java:361)
 at org.apache.maven.graph.DefaultGraphBuilder.collectProjects(DefaultGraphBuilder.java:400)
 at org.apache.maven.graph.DefaultGraphBuilder.getProjectsForMavenReactor(DefaultGraphBuilder.java:391)
 at org.apache.maven.graph.DefaultGraphBuilder.build(DefaultGraphBuilder.java:78)
 at org.apache.maven.DefaultMaven.buildGraph(DefaultMaven.java:511)
 at org.apache.maven.DefaultMaven.doExecute(DefaultMaven.java:221)
 at org.apache.maven.DefaultMaven.doExecute(DefaultMaven.java:194)
 at org.apache.maven.DefaultMaven.execute(DefaultMaven.java:107)
 at org.apache.maven.cli.MavenCli.execute(MavenCli.java:993)
 at org.apache.maven.cli.MavenCli.doMain(MavenCli.java:345)
 at org.apache.maven.cli.MavenCli.main(MavenCli.java:191)
 at java.base/jdk.internal.reflect.NativeMethodAccessorImpl.invoke0(Native Method)
 at java.base/jdk.internal.reflect.NativeMethodAccessorImpl.invoke(NativeMethodAccessorImpl.java:62)
 at java.base/jdk.internal.reflect.DelegatingMethodAccessorImpl.invoke(DelegatingMethodAccessorImpl.java:43)
 at java.base/java.lang.reflect.Method.invoke(Method.java:564)
 at org.codehaus.plexus.classworlds.launcher.Launcher.launchEnhanced(Launcher.java:289)
 at org.codehaus.plexus.classworlds.launcher.Launcher.launch(Launcher.java:229)
 at org.codehaus.plexus.classworlds.launcher.Launcher.mainWithExitCode(Launcher.java:415)
 at org.codehaus.plexus.classworlds.launcher.Launcher.main(Launcher.java:356)
Caused by: org.eclipse.aether.resolution.ArtifactResolutionException: Could not find artifact org.apache.maven.plugin.rresource.it:it-parent:pom:1.6-SNAPSHOT in apache-snapshots (http://repository.apache.org/snapshots/)
 at org.eclipse.aether.internal.impl.DefaultArtifactResolver.resolve(DefaultArtifactResolver.java:453)
 at org.eclipse.aether.internal.impl.DefaultArtifactResolver.resolveArtifacts(DefaultArtifactResolver.java:255)
 at org.eclipse.aether.internal.impl.DefaultArtifactResolver.resolveArtifact(DefaultArtifactResolver.java:232)
 at org.eclipse.aether.internal.impl.DefaultRepositorySystem.resolveArtifact(DefaultRepositorySystem.java:303)
 at org.apache.maven.project.ProjectModelResolver.resolveModel(ProjectModelResolver.java:193)
 ... 27 more
Caused by: org.eclipse.aether.transfer.ArtifactNotFoundException: Could not find artifact org.apache.maven.plugin.rresource.it:it-parent:pom:1.6-SNAPSHOT in apache-snapshots (http://repository.apache.org/snapshots/)
 at org.eclipse.aether.connector.basic.ArtifactTransportListener.transferFailed(ArtifactTransportListener.java:48)
 at org.eclipse.aether.connector.basic.BasicRepositoryConnector$TaskRunner.run(BasicRepositoryConnector.java:364)
 at org.eclipse.aether.util.concurrency.RunnableErrorForwarder$1.run(RunnableErrorForwarder.java:76)
 at org.eclipse.aether.connector.basic.BasicRepositoryConnector$DirectExecutor.execute(BasicRepositoryConnector.java:590)
 at org.eclipse.aether.connector.basic.BasicRepositoryConnector.get(BasicRepositoryConnector.java:258)
 at org.eclipse.aether.internal.impl.DefaultArtifactResolver.performDownloads(DefaultArtifactResolver.java:529)
 at org.eclipse.aether.internal.impl.DefaultArtifactResolver.resolve(DefaultArtifactResolver.java:430)
 ... 31 more
[ERROR]   
[ERROR]   The project org.apache.maven.plugin.rresource.it.mrr41:child-2:[unknown-version] (F:\jenkins\jenkins-slave\workspace\ote-resources-plugin_master-FTEJEAA7J3RSA3RGNRQRTOLNK5IUQ7QP3AJQZXDE4RWB3DK3KFPQ\m\target\test-classes\run-only-at-execution-root\child2\pom.xml) has 1 error
[ERROR]     Non-resolvable parent POM for org.apache.maven.plugin.rresource.it.mrr41:parent:[unknown-version]: Failure to find org.apache.maven.plugin.rresource.it:it-parent:pom:1.6-SNAPSHOT in http://repository.apache.org/snapshots/ was cached in the local repository, resolution will not be reattempted until the update interval of apache-snapshots has elapsed or updates are forced and 'parent.relativePath' points at wrong local POM @ org.apache.maven.plugin.rresource.it.mrr41:parent:[unknown-version], F:\jenkins\jenkins-slave\workspace\ote-resources-plugin_master-FTEJEAA7J3RSA3RGNRQRTOLNK5IUQ7QP3AJQZXDE4RWB3DK3KFPQ\m\target\test-classes\run-only-at-execution-root\pom.xml, line 24, column 11 -> [Help 2]
org.apache.maven.model.resolution.UnresolvableModelException: Failure to find org.apache.maven.plugin.rresource.it:it-parent:pom:1.6-SNAPSHOT in http://repository.apache.org/snapshots/ was cached in the local repository, resolution will not be reattempted until the update interval of apache-snapshots has elapsed or updates are forced
 at org.apache.maven.project.ProjectModelResolver.resolveModel(ProjectModelResolver.java:197)
 at org.apache.maven.project.ProjectModelResolver.resolveModel(ProjectModelResolver.java:243)
 at org.apache.maven.model.building.DefaultModelBuilder.readParentExternally(DefaultModelBuilder.java:1051)
 at org.apache.maven.model.building.DefaultModelBuilder.readParent(DefaultModelBuilder.java:851)
 at org.apache.maven.model.building.DefaultModelBuilder.build(DefaultModelBuilder.java:331)
 at org.apache.maven.project.DefaultProjectBuilder.build(DefaultProjectBuilder.java:429)
 at org.apache.maven.project.DefaultProjectBuilder.build(DefaultProjectBuilder.java:398)
 at org.apache.maven.project.DefaultProjectBuilder.build(DefaultProjectBuilder.java:515)
 at org.apache.maven.project.DefaultProjectBuilder.build(DefaultProjectBuilder.java:398)
 at org.apache.maven.project.DefaultProjectBuilder.build(DefaultProjectBuilder.java:361)
 at org.apache.maven.graph.DefaultGraphBuilder.collectProjects(DefaultGraphBuilder.java:400)
 at org.apache.maven.graph.DefaultGraphBuilder.getProjectsForMavenReactor(DefaultGraphBuilder.java:391)
 at org.apache.maven.graph.DefaultGraphBuilder.build(DefaultGraphBuilder.java:78)
 at org.apache.maven.DefaultMaven.buildGraph(DefaultMaven.java:511)
 at org.apache.maven.DefaultMaven.doExecute(DefaultMaven.java:221)
 at org.apache.maven.DefaultMaven.doExecute(DefaultMaven.java:194)
 at org.apache.maven.DefaultMaven.execute(DefaultMaven.java:107)
 at org.apache.maven.cli.MavenCli.execute(MavenCli.java:993)
 at org.apache.maven.cli.MavenCli.doMain(MavenCli.java:345)
 at org.apache.maven.cli.MavenCli.main(MavenCli.java:191)
 at java.base/jdk.internal.reflect.NativeMethodAccessorImpl.invoke0(Native Method)
 at java.base/jdk.internal.reflect.NativeMethodAccessorImpl.invoke(NativeMethodAccessorImpl.java:62)
 at java.base/jdk.internal.reflect.DelegatingMethodAccessorImpl.invoke(DelegatingMethodAccessorImpl.java:43)
 at java.base/java.lang.reflect.Method.invoke(Method.java:564)
 at org.codehaus.plexus.classworlds.launcher.Launcher.launchEnhanced(Launcher.java:289)
 at org.codehaus.plexus.classworlds.launcher.Launcher.launch(Launcher.java:229)
 at org.codehaus.plexus.classworlds.launcher.Launcher.mainWithExitCode(Launcher.java:415)
 at org.codehaus.plexus.classworlds.launcher.Launcher.main(Launcher.java:356)
Caused by: org.eclipse.aether.resolution.ArtifactResolutionException: Failure to find org.apache.maven.plugin.rresource.it:it-parent:pom:1.6-SNAPSHOT in http://repository.apache.org/snapshots/ was cached in the local repository, resolution will not be reattempted until the update interval of apache-snapshots has elapsed or updates are forced
 at org.eclipse.aether.internal.impl.DefaultArtifactResolver.resolve(DefaultArtifactResolver.java:453)
 at org.eclipse.aether.internal.impl.DefaultArtifactResolver.resolveArtifacts(DefaultArtifactResolver.java:255)
 at org.eclipse.aether.internal.impl.DefaultArtifactResolver.resolveArtifact(DefaultArtifactResolver.java:232)
 at org.eclipse.aether.internal.impl.DefaultRepositorySystem.resolveArtifact(DefaultRepositorySystem.java:303)
 at org.apache.maven.project.ProjectModelResolver.resolveModel(ProjectModelResolver.java:193)
 ... 27 more
Caused by: org.eclipse.aether.transfer.ArtifactNotFoundException: Failure to find org.apache.maven.plugin.rresource.it:it-parent:pom:1.6-SNAPSHOT in http://repository.apache.org/snapshots/ was cached in the local repository, resolution will not be reattempted until the update interval of apache-snapshots has elapsed or updates are forced
 at org.eclipse.aether.internal.impl.DefaultUpdateCheckManager.newException(DefaultUpdateCheckManager.java:240)
 at org.eclipse.aether.internal.impl.DefaultUpdateCheckManager.checkArtifact(DefaultUpdateCheckManager.java:192)
 at org.eclipse.aether.internal.impl.DefaultArtifactResolver.gatherDownloads(DefaultArtifactResolver.java:594)
 at org.eclipse.aether.internal.impl.DefaultArtifactResolver.performDownloads(DefaultArtifactResolver.java:512)
 at org.eclipse.aether.internal.impl.DefaultArtifactResolver.resolve(DefaultArtifactResolver.java:430)
 ... 31 more
[ERROR] 
[ERROR] Re-run Maven using the -X switch to enable full debug logging.
[ERROR] 
[ERROR] For more information about the errors and possible solutions, please read the following articles:
[ERROR] [Help 1] http://cwiki.apache.org/confluence/display/MAVEN/ProjectBuildingException
[ERROR] [Help 2] http://cwiki.apache.org/confluence/display/MAVEN/UnresolvableModelException


Stack Trace:
org.apache.maven.it.VerificationException: 
Exit code was non-zero: 1; command line and log = 
F:\jenkins\tools\maven\apache-maven-3.5.0\bin\mvn -e --batch-mode -Dmaven.repo.local=f:\jenkins\jenkins-slave\workspace\ote-resources-plugin_master-FTEJEAA7J3RSA3RGNRQRTOLNK5IUQ7QP3AJQZXDE4RWB3DK3KFPQ\m\target/it-repo org.apache.maven.plugins:maven-clean-plugin:clean generate-resources
Picked up JAVA_TOOL_OPTIONS: -Dmaven.ext.class.path="f:\jenkins\jenkins-slave\workspace\ote-resources-plugin_master-FTEJEAA7J3RSA3RGNRQRTOLNK5IUQ7QP3AJQZXDE4RWB3DK3KFPQ@tmp\withMaven0b26eef1\pipeline-maven-spy.jar" -Dorg.jenkinsci.plugins.pipeline.maven.reportsFolder="f:\jenkins\jenkins-slave\workspace\ote-resources-plugin_master-FTEJEAA7J3RSA3RGNRQRTOLNK5IUQ7QP3AJQZXDE4RWB3DK3KFPQ@tmp\withMaven0b26eef1" 
[INFO] [jenkins-event-spy] Generate F:\jenkins\jenkins-slave\workspace\ote-resources-plugin_master-FTEJEAA7J3RSA3RGNRQRTOLNK5IUQ7QP3AJQZXDE4RWB3DK3KFPQ@tmp\withMaven0b26eef1\maven-spy-20180309-222523-5453441108199610595535.log.tmp ...
[INFO] Error stacktraces are turned on.
[INFO] Scanning for projects...
[INFO] Downloading: http://repository.apache.org/snapshots/org/apache/maven/plugin/rresource/it/it-parent/1.6-SNAPSHOT/maven-metadata.xml
[INFO] Downloading: http://repository.apache.org/snapshots/org/apache/maven/plugin/rresource/it/it-parent/1.6-SNAPSHOT/it-parent-1.6-SNAPSHOT.pom
[ERROR] [ERROR] Some problems were encountered while processing the POMs:
[FATAL] Non-resolvable parent POM for org.apache.maven.plugin.rresource.it.mrr41:parent:[unknown-version]: Could not find artifact org.apache.maven.plugin.rresource.it:it-parent:pom:1.6-SNAPSHOT in apache-snapshots (http://repository.apache.org/snapshots/) and 'parent.relativePath' points at wrong local POM @ org.apache.maven.plugin.rresource.it.mrr41:parent:[unknown-version], F:\jenkins\jenkins-slave\workspace\ote-resources-plugin_master-FTEJEAA7J3RSA3RGNRQRTOLNK5IUQ7QP3AJQZXDE4RWB3DK3KFPQ\m\target\test-classes\run-only-at-execution-root\pom.xml, line 24, column 11
[FATAL] Non-resolvable parent POM for org.apache.maven.plugin.rresource.it.mrr41:parent:[unknown-version]: Failure to find org.apache.maven.plugin.rresource.it:it-parent:pom:1.6-SNAPSHOT in http://repository.apache.org/snapshots/ was cached in the local repository, resolution will not be reattempted until the update interval of apache-snapshots has elapsed or updates are forced and 'parent.relativePath' points at wrong local POM @ org.apache.maven.plugin.rresource.it.mrr41:parent:[unknown-version], F:\jenkins\jenkins-slave\workspace\ote-resources-plugin_master-FTEJEAA7J3RSA3RGNRQRTOLNK5IUQ7QP3AJQZXDE4RWB3DK3KFPQ\m\target\test-classes\run-only-at-execution-root\pom.xml, line 24, column 11
 @ 
[INFO] [jenkins-event-spy] Generated F:\jenkins\jenkins-slave\workspace\ote-resources-plugin_master-FTEJEAA7J3RSA3RGNRQRTOLNK5IUQ7QP3AJQZXDE4RWB3DK3KFPQ@tmp\withMaven0b26eef1\maven-spy-20180309-222523-5453441108199610595535.log
[ERROR] The build could not read 2 projects -> [Help 1]
org.apache.maven.project.ProjectBuildingException: Some problems were encountered while processing the POMs:
[FATAL] Non-resolvable parent POM for org.apache.maven.plugin.rresource.it.mrr41:parent:[unknown-version]: Could not find artifact org.apache.maven.plugin.rresource.it:it-parent:pom:1.6-SNAPSHOT in apache-snapshots (http://repository.apache.org/snapshots/) and 'parent.relativePath' points at wrong local POM @ org.apache.maven.plugin.rresource.it.mrr41:parent:[unknown-version], F:\jenkins\jenkins-slave\workspace\ote-resources-plugin_master-FTEJEAA7J3RSA3RGNRQRTOLNK5IUQ7QP3AJQZXDE4RWB3DK3KFPQ\m\target\test-classes\run-only-at-execution-root\pom.xml, line 24, column 11
[FATAL] Non-resolvable parent POM for org.apache.maven.plugin.rresource.it.mrr41:parent:[unknown-version]: Failure to find org.apache.maven.plugin.rresource.it:it-parent:pom:1.6-SNAPSHOT in http://repository.apache.org/snapshots/ was cached in the local repository, resolution will not be reattempted until the update interval of apache-snapshots has elapsed or updates are forced and 'parent.relativePath' points at wrong local POM @ org.apache.maven.plugin.rresource.it.mrr41:parent:[unknown-version], F:\jenkins\jenkins-slave\workspace\ote-resources-plugin_master-FTEJEAA7J3RSA3RGNRQRTOLNK5IUQ7QP3AJQZXDE4RWB3DK3KFPQ\m\target\test-classes\run-only-at-execution-root\pom.xml, line 24, column 11

	at org.apache.maven.project.DefaultProjectBuilder.build(DefaultProjectBuilder.java:382)
	at org.apache.maven.graph.DefaultGraphBuilder.collectProjects(DefaultGraphBuilder.java:400)
	at org.apache.maven.graph.DefaultGraphBuilder.getProjectsForMavenReactor(DefaultGraphBuilder.java:391)
	at org.apache.maven.graph.DefaultGraphBuilder.build(DefaultGraphBuilder.java:78)
	at org.apache.maven.DefaultMaven.buildGraph(DefaultMaven.java:511)
	at org.apache.maven.DefaultMaven.doExecute(DefaultMaven.java:221)
	at org.apache.maven.DefaultMaven.doExecute(DefaultMaven.java:194)
	at org.apache.maven.DefaultMaven.execute(DefaultMaven.java:107)
	at org.apache.maven.cli.MavenCli.execute(MavenCli.java:993)
	at org.apache.maven.cli.MavenCli.doMain(MavenCli.java:345)
	at org.apache.maven.cli.MavenCli.main(MavenCli.java:191)
	at java.base/jdk.internal.reflect.NativeMethodAccessorImpl.invoke0(Native Method)
	at java.base/jdk.internal.reflect.NativeMethodAccessorImpl.invoke(NativeMethodAccessorImpl.java:62)
	at java.base/jdk.internal.reflect.DelegatingMethodAccessorImpl.invoke(DelegatingMethodAccessorImpl.java:43)
	at java.base/java.lang.reflect.Method.invoke(Method.java:564)
	at org.codehaus.plexus.classworlds.launcher.Launcher.launchEnhanced(Launcher.java:289)
	at org.codehaus.plexus.classworlds.launcher.Launcher.launch(Launcher.java:229)
	at org.codehaus.plexus.classworlds.launcher.Launcher.mainWithExitCode(Launcher.java:415)
	at org.codehaus.plexus.classworlds.launcher.Launcher.main(Launcher.java:356)
[ERROR]   
[ERROR]   The project org.apache.maven.plugin.rresource.it.mrr41:child-1:[unknown-version] (F:\jenkins\jenkins-slave\workspace\ote-resources-plugin_master-FTEJEAA7J3RSA3RGNRQRTOLNK5IUQ7QP3AJQZXDE4RWB3DK3KFPQ\m\target\test-classes\run-only-at-execution-root\child1\pom.xml) has 1 error
[ERROR]     Non-resolvable parent POM for org.apache.maven.plugin.rresource.it.mrr41:parent:[unknown-version]: Could not find artifact org.apache.maven.plugin.rresource.it:it-parent:pom:1.6-SNAPSHOT in apache-snapshots (http://repository.apache.org/snapshots/) and 'parent.relativePath' points at wrong local POM @ org.apache.maven.plugin.rresource.it.mrr41:parent:[unknown-version], F:\jenkins\jenkins-slave\workspace\ote-resources-plugin_master-FTEJEAA7J3RSA3RGNRQRTOLNK5IUQ7QP3AJQZXDE4RWB3DK3KFPQ\m\target\test-classes\run-only-at-execution-root\pom.xml, line 24, column 11 -> [Help 2]
org.apache.maven.model.resolution.UnresolvableModelException: Could not find artifact org.apache.maven.plugin.rresource.it:it-parent:pom:1.6-SNAPSHOT in apache-snapshots (http://repository.apache.org/snapshots/)
	at org.apache.maven.project.ProjectModelResolver.resolveModel(ProjectModelResolver.java:197)
	at org.apache.maven.project.ProjectModelResolver.resolveModel(ProjectModelResolver.java:243)
	at org.apache.maven.model.building.DefaultModelBuilder.readParentExternally(DefaultModelBuilder.java:1051)
	at org.apache.maven.model.building.DefaultModelBuilder.readParent(DefaultModelBuilder.java:851)
	at org.apache.maven.model.building.DefaultModelBuilder.build(DefaultModelBuilder.java:331)
	at org.apache.maven.project.DefaultProjectBuilder.build(DefaultProjectBuilder.java:429)
	at org.apache.maven.project.DefaultProjectBuilder.build(DefaultProjectBuilder.java:398)
	at org.apache.maven.project.DefaultProjectBuilder.build(DefaultProjectBuilder.java:515)
	at org.apache.maven.project.DefaultProjectBuilder.build(DefaultProjectBuilder.java:398)
	at org.apache.maven.project.DefaultProjectBuilder.build(DefaultProjectBuilder.java:361)
	at org.apache.maven.graph.DefaultGraphBuilder.collectProjects(DefaultGraphBuilder.java:400)
	at org.apache.maven.graph.DefaultGraphBuilder.getProjectsForMavenReactor(DefaultGraphBuilder.java:391)
	at org.apache.maven.graph.DefaultGraphBuilder.build(DefaultGraphBuilder.java:78)
	at org.apache.maven.DefaultMaven.buildGraph(DefaultMaven.java:511)
	at org.apache.maven.DefaultMaven.doExecute(DefaultMaven.java:221)
	at org.apache.maven.DefaultMaven.doExecute(DefaultMaven.java:194)
	at org.apache.maven.DefaultMaven.execute(DefaultMaven.java:107)
	at org.apache.maven.cli.MavenCli.execute(MavenCli.java:993)
	at org.apache.maven.cli.MavenCli.doMain(MavenCli.java:345)
	at org.apache.maven.cli.MavenCli.main(MavenCli.java:191)
	at java.base/jdk.internal.reflect.NativeMethodAccessorImpl.invoke0(Native Method)
	at java.base/jdk.internal.reflect.NativeMethodAccessorImpl.invoke(NativeMethodAccessorImpl.java:62)
	at java.base/jdk.internal.reflect.DelegatingMethodAccessorImpl.invoke(DelegatingMethodAccessorImpl.java:43)
	at java.base/java.lang.reflect.Method.invoke(Method.java:564)
	at org.codehaus.plexus.classworlds.launcher.Launcher.launchEnhanced(Launcher.java:289)
	at org.codehaus.plexus.classworlds.launcher.Launcher.launch(Launcher.java:229)
	at org.codehaus.plexus.classworlds.launcher.Launcher.mainWithExitCode(Launcher.java:415)
	at org.codehaus.plexus.classworlds.launcher.Launcher.main(Launcher.java:356)
Caused by: org.eclipse.aether.resolution.ArtifactResolutionException: Could not find artifact org.apache.maven.plugin.rresource.it:it-parent:pom:1.6-SNAPSHOT in apache-snapshots (http://repository.apache.org/snapshots/)
	at org.eclipse.aether.internal.impl.DefaultArtifactResolver.resolve(DefaultArtifactResolver.java:453)
	at org.eclipse.aether.internal.impl.DefaultArtifactResolver.resolveArtifacts(DefaultArtifactResolver.java:255)
	at org.eclipse.aether.internal.impl.DefaultArtifactResolver.resolveArtifact(DefaultArtifactResolver.java:232)
	at org.eclipse.aether.internal.impl.DefaultRepositorySystem.resolveArtifact(DefaultRepositorySystem.java:303)
	at org.apache.maven.project.ProjectModelResolver.resolveModel(ProjectModelResolver.java:193)
	... 27 more
Caused by: org.eclipse.aether.transfer.ArtifactNotFoundException: Could not find artifact org.apache.maven.plugin.rresource.it:it-parent:pom:1.6-SNAPSHOT in apache-snapshots (http://repository.apache.org/snapshots/)
	at org.eclipse.aether.connector.basic.ArtifactTransportListener.transferFailed(ArtifactTransportListener.java:48)
	at org.eclipse.aether.connector.basic.BasicRepositoryConnector$TaskRunner.run(BasicRepositoryConnector.java:364)
	at org.eclipse.aether.util.concurrency.RunnableErrorForwarder$1.run(RunnableErrorForwarder.java:76)
	at org.eclipse.aether.connector.basic.BasicRepositoryConnector$DirectExecutor.execute(BasicRepositoryConnector.java:590)
	at org.eclipse.aether.connector.basic.BasicRepositoryConnector.get(BasicRepositoryConnector.java:258)
	at org.eclipse.aether.internal.impl.DefaultArtifactResolver.performDownloads(DefaultArtifactResolver.java:529)
	at org.eclipse.aether.internal.impl.DefaultArtifactResolver.resolve(DefaultArtifactResolver.java:430)
	... 31 more
[ERROR]   
[ERROR]   The project org.apache.maven.plugin.rresource.it.mrr41:child-2:[unknown-version] (F:\jenkins\jenkins-slave\workspace\ote-resources-plugin_master-FTEJEAA7J3RSA3RGNRQRTOLNK5IUQ7QP3AJQZXDE4RWB3DK3KFPQ\m\target\test-classes\run-only-at-execution-root\child2\pom.xml) has 1 error
[ERROR]     Non-resolvable parent POM for org.apache.maven.plugin.rresource.it.mrr41:parent:[unknown-version]: Failure to find org.apache.maven.plugin.rresource.it:it-parent:pom:1.6-SNAPSHOT in http://repository.apache.org/snapshots/ was cached in the local repository, resolution will not be reattempted until the update interval of apache-snapshots has elapsed or updates are forced and 'parent.relativePath' points at wrong local POM @ org.apache.maven.plugin.rresource.it.mrr41:parent:[unknown-version], F:\jenkins\jenkins-slave\workspace\ote-resources-plugin_master-FTEJEAA7J3RSA3RGNRQRTOLNK5IUQ7QP3AJQZXDE4RWB3DK3KFPQ\m\target\test-classes\run-only-at-execution-root\pom.xml, line 24, column 11 -> [Help 2]
org.apache.maven.model.resolution.UnresolvableModelException: Failure to find org.apache.maven.plugin.rresource.it:it-parent:pom:1.6-SNAPSHOT in http://repository.apache.org/snapshots/ was cached in the local repository, resolution will not be reattempted until the update interval of apache-snapshots has elapsed or updates are forced
	at org.apache.maven.project.ProjectModelResolver.resolveModel(ProjectModelResolver.java:197)
	at org.apache.maven.project.ProjectModelResolver.resolveModel(ProjectModelResolver.java:243)
	at org.apache.maven.model.building.DefaultModelBuilder.readParentExternally(DefaultModelBuilder.java:1051)
	at org.apache.maven.model.building.DefaultModelBuilder.readParent(DefaultModelBuilder.java:851)
	at org.apache.maven.model.building.DefaultModelBuilder.build(DefaultModelBuilder.java:331)
	at org.apache.maven.project.DefaultProjectBuilder.build(DefaultProjectBuilder.java:429)
	at org.apache.maven.project.DefaultProjectBuilder.build(DefaultProjectBuilder.java:398)
	at org.apache.maven.project.DefaultProjectBuilder.build(DefaultProjectBuilder.java:515)
	at org.apache.maven.project.DefaultProjectBuilder.build(DefaultProjectBuilder.java:398)
	at org.apache.maven.project.DefaultProjectBuilder.build(DefaultProjectBuilder.java:361)
	at org.apache.maven.graph.DefaultGraphBuilder.collectProjects(DefaultGraphBuilder.java:400)
	at org.apache.maven.graph.DefaultGraphBuilder.getProjectsForMavenReactor(DefaultGraphBuilder.java:391)
	at org.apache.maven.graph.DefaultGraphBuilder.build(DefaultGraphBuilder.java:78)
	at org.apache.maven.DefaultMaven.buildGraph(DefaultMaven.java:511)
	at org.apache.maven.DefaultMaven.doExecute(DefaultMaven.java:221)
	at org.apache.maven.DefaultMaven.doExecute(DefaultMaven.java:194)
	at org.apache.maven.DefaultMaven.execute(DefaultMaven.java:107)
	at org.apache.maven.cli.MavenCli.execute(MavenCli.java:993)
	at org.apache.maven.cli.MavenCli.doMain(MavenCli.java:345)
	at org.apache.maven.cli.MavenCli.main(MavenCli.java:191)
	at java.base/jdk.internal.reflect.NativeMethodAccessorImpl.invoke0(Native Method)
	at java.base/jdk.internal.reflect.NativeMethodAccessorImpl.invoke(NativeMethodAccessorImpl.java:62)
	at java.base/jdk.internal.reflect.DelegatingMethodAccessorImpl.invoke(DelegatingMethodAccessorImpl.java:43)
	at java.base/java.lang.reflect.Method.invoke(Method.java:564)
	at org.codehaus.plexus.classworlds.launcher.Launcher.launchEnhanced(Launcher.java:289)
	at org.codehaus.plexus.classworlds.launcher.Launcher.launch(Launcher.java:229)
	at org.codehaus.plexus.classworlds.launcher.Launcher.mainWithExitCode(Launcher.java:415)
	at org.codehaus.plexus.classworlds.launcher.Launcher.main(Launcher.java:356)
Caused by: org.eclipse.aether.resolution.ArtifactResolutionException: Failure to find org.apache.maven.plugin.rresource.it:it-parent:pom:1.6-SNAPSHOT in http://repository.apache.org/snapshots/ was cached in the local repository, resolution will not be reattempted until the update interval of apache-snapshots has elapsed or updates are forced
	at org.eclipse.aether.internal.impl.DefaultArtifactResolver.resolve(DefaultArtifactResolver.java:453)
	at org.eclipse.aether.internal.impl.DefaultArtifactResolver.resolveArtifacts(DefaultArtifactResolver.java:255)
	at org.eclipse.aether.internal.impl.DefaultArtifactResolver.resolveArtifact(DefaultArtifactResolver.java:232)
	at org.eclipse.aether.internal.impl.DefaultRepositorySystem.resolveArtifact(DefaultRepositorySystem.java:303)
	at org.apache.maven.project.ProjectModelResolver.resolveModel(ProjectModelResolver.java:193)
	... 27 more
Caused by: org.eclipse.aether.transfer.ArtifactNotFoundException: Failure to find org.apache.maven.plugin.rresource.it:it-parent:pom:1.6-SNAPSHOT in http://repository.apache.org/snapshots/ was cached in the local repository, resolution will not be reattempted until the update interval of apache-snapshots has elapsed or updates are forced
	at org.eclipse.aether.internal.impl.DefaultUpdateCheckManager.newException(DefaultUpdateCheckManager.java:240)
	at org.eclipse.aether.internal.impl.DefaultUpdateCheckManager.checkArtifact(DefaultUpdateCheckManager.java:192)
	at org.eclipse.aether.internal.impl.DefaultArtifactResolver.gatherDownloads(DefaultArtifactResolver.java:594)
	at org.eclipse.aether.internal.impl.DefaultArtifactResolver.performDownloads(DefaultArtifactResolver.java:512)
	at org.eclipse.aether.internal.impl.DefaultArtifactResolver.resolve(DefaultArtifactResolver.java:430)
	... 31 more
[ERROR] 
[ERROR] Re-run Maven using the -X switch to enable full debug logging.
[ERROR] 
[ERROR] For more information about the errors and possible solutions, please read the following articles:
[ERROR] [Help 1] http://cwiki.apache.org/confluence/display/MAVEN/ProjectBuildingException
[ERROR] [Help 2] http://cwiki.apache.org/confluence/display/MAVEN/UnresolvableModelException

	at org.apache.maven.plugin.resources.remote.it.IT_RunOnlyAtExecutionRoot.test(IT_RunOnlyAtExecutionRoot.java:60)


FAILED:  org.apache.maven.plugin.resources.remote.it.IT_RunOnlyAtExecutionRoot.test

Error Message:
Exit code was non-zero: 1; command line and log = 
F:\jenkins\tools\maven\apache-maven-3.5.0\bin\mvn -e --batch-mode -Dmaven.repo.local=f:\jenkins\jenkins-slave\workspace\ote-resources-plugin_master-FTEJEAA7J3RSA3RGNRQRTOLNK5IUQ7QP3AJQZXDE4RWB3DK3KFPQ\m\target/it-repo org.apache.maven.plugins:maven-clean-plugin:clean generate-resources
[INFO] [jenkins-event-spy] Generate F:\jenkins\jenkins-slave\workspace\ote-resources-plugin_master-FTEJEAA7J3RSA3RGNRQRTOLNK5IUQ7QP3AJQZXDE4RWB3DK3KFPQ@tmp\withMaven8d4af88d\maven-spy-20180309-222531-6299009207894420591326.log.tmp ...
[INFO] Error stacktraces are turned on.
[INFO] Scanning for projects...
[INFO] Downloading: http://repository.apache.org/snapshots/org/apache/maven/plugin/rresource/it/it-parent/1.6-SNAPSHOT/maven-metadata.xml
[INFO] Downloading: http://repository.apache.org/snapshots/org/apache/maven/plugin/rresource/it/it-parent/1.6-SNAPSHOT/it-parent-1.6-SNAPSHOT.pom
[ERROR] [ERROR] Some problems were encountered while processing the POMs:
[FATAL] Non-resolvable parent POM for org.apache.maven.plugin.rresource.it.mrr41:parent:[unknown-version]: Could not find artifact org.apache.maven.plugin.rresource.it:it-parent:pom:1.6-SNAPSHOT in apache-snapshots (http://repository.apache.org/snapshots/) and 'parent.relativePath' points at wrong local POM @ org.apache.maven.plugin.rresource.it.mrr41:parent:[unknown-version], F:\jenkins\jenkins-slave\workspace\ote-resources-plugin_master-FTEJEAA7J3RSA3RGNRQRTOLNK5IUQ7QP3AJQZXDE4RWB3DK3KFPQ\m\target\test-classes\run-only-at-execution-root\pom.xml, line 24, column 11
[FATAL] Non-resolvable parent POM for org.apache.maven.plugin.rresource.it.mrr41:parent:[unknown-version]: Failure to find org.apache.maven.plugin.rresource.it:it-parent:pom:1.6-SNAPSHOT in http://repository.apache.org/snapshots/ was cached in the local repository, resolution will not be reattempted until the update interval of apache-snapshots has elapsed or updates are forced and 'parent.relativePath' points at wrong local POM @ org.apache.maven.plugin.rresource.it.mrr41:parent:[unknown-version], F:\jenkins\jenkins-slave\workspace\ote-resources-plugin_master-FTEJEAA7J3RSA3RGNRQRTOLNK5IUQ7QP3AJQZXDE4RWB3DK3KFPQ\m\target\test-classes\run-only-at-execution-root\pom.xml, line 24, column 11
 @ 
[INFO] [jenkins-event-spy] Generated F:\jenkins\jenkins-slave\workspace\ote-resources-plugin_master-FTEJEAA7J3RSA3RGNRQRTOLNK5IUQ7QP3AJQZXDE4RWB3DK3KFPQ@tmp\withMaven8d4af88d\maven-spy-20180309-222531-6299009207894420591326.log
[ERROR] The build could not read 2 projects -> [Help 1]
org.apache.maven.project.ProjectBuildingException: Some problems were encountered while processing the POMs:
[FATAL] Non-resolvable parent POM for org.apache.maven.plugin.rresource.it.mrr41:parent:[unknown-version]: Could not find artifact org.apache.maven.plugin.rresource.it:it-parent:pom:1.6-SNAPSHOT in apache-snapshots (http://repository.apache.org/snapshots/) and 'parent.relativePath' points at wrong local POM @ org.apache.maven.plugin.rresource.it.mrr41:parent:[unknown-version], F:\jenkins\jenkins-slave\workspace\ote-resources-plugin_master-FTEJEAA7J3RSA3RGNRQRTOLNK5IUQ7QP3AJQZXDE4RWB3DK3KFPQ\m\target\test-classes\run-only-at-execution-root\pom.xml, line 24, column 11
[FATAL] Non-resolvable parent POM for org.apache.maven.plugin.rresource.it.mrr41:parent:[unknown-version]: Failure to find org.apache.maven.plugin.rresource.it:it-parent:pom:1.6-SNAPSHOT in http://repository.apache.org/snapshots/ was cached in the local repository, resolution will not be reattempted until the update interval of apache-snapshots has elapsed or updates are forced and 'parent.relativePath' points at wrong local POM @ org.apache.maven.plugin.rresource.it.mrr41:parent:[unknown-version], F:\jenkins\jenkins-slave\workspace\ote-resources-plugin_master-FTEJEAA7J3RSA3RGNRQRTOLNK5IUQ7QP3AJQZXDE4RWB3DK3KFPQ\m\target\test-classes\run-only-at-execution-root\pom.xml, line 24, column 11

 at org.apache.maven.project.DefaultProjectBuilder.build(DefaultProjectBuilder.java:382)
 at org.apache.maven.graph.DefaultGraphBuilder.collectProjects(DefaultGraphBuilder.java:400)
 at org.apache.maven.graph.DefaultGraphBuilder.getProjectsForMavenReactor(DefaultGraphBuilder.java:391)
 at org.apache.maven.graph.DefaultGraphBuilder.build(DefaultGraphBuilder.java:78)
 at org.apache.maven.DefaultMaven.buildGraph(DefaultMaven.java:511)
 at org.apache.maven.DefaultMaven.doExecute(DefaultMaven.java:221)
 at org.apache.maven.DefaultMaven.doExecute(DefaultMaven.java:194)
 at org.apache.maven.DefaultMaven.execute(DefaultMaven.java:107)
 at org.apache.maven.cli.MavenCli.execute(MavenCli.java:993)
 at org.apache.maven.cli.MavenCli.doMain(MavenCli.java:345)
 at org.apache.maven.cli.MavenCli.main(MavenCli.java:191)
 at sun.reflect.NativeMethodAccessorImpl.invoke0(Native Method)
 at sun.reflect.NativeMethodAccessorImpl.invoke(NativeMethodAccessorImpl.java:62)
 at sun.reflect.DelegatingMethodAccessorImpl.invoke(DelegatingMethodAccessorImpl.java:43)
 at java.lang.reflect.Method.invoke(Method.java:498)
 at org.codehaus.plexus.classworlds.launcher.Launcher.launchEnhanced(Launcher.java:289)
 at org.codehaus.plexus.classworlds.launcher.Launcher.launch(Launcher.java:229)
 at org.codehaus.plexus.classworlds.launcher.Launcher.mainWithExitCode(Launcher.java:415)
 at org.codehaus.plexus.classworlds.launcher.Launcher.main(Launcher.java:356)
[ERROR]   
[ERROR]   The project org.apache.maven.plugin.rresource.it.mrr41:child-1:[unknown-version] (F:\jenkins\jenkins-slave\workspace\ote-resources-plugin_master-FTEJEAA7J3RSA3RGNRQRTOLNK5IUQ7QP3AJQZXDE4RWB3DK3KFPQ\m\target\test-classes\run-only-at-execution-root\child1\pom.xml) has 1 error
[ERROR]     Non-resolvable parent POM for org.apache.maven.plugin.rresource.it.mrr41:parent:[unknown-version]: Could not find artifact org.apache.maven.plugin.rresource.it:it-parent:pom:1.6-SNAPSHOT in apache-snapshots (http://repository.apache.org/snapshots/) and 'parent.relativePath' points at wrong local POM @ org.apache.maven.plugin.rresource.it.mrr41:parent:[unknown-version], F:\jenkins\jenkins-slave\workspace\ote-resources-plugin_master-FTEJEAA7J3RSA3RGNRQRTOLNK5IUQ7QP3AJQZXDE4RWB3DK3KFPQ\m\target\test-classes\run-only-at-execution-root\pom.xml, line 24, column 11 -> [Help 2]
org.apache.maven.model.resolution.UnresolvableModelException: Could not find artifact org.apache.maven.plugin.rresource.it:it-parent:pom:1.6-SNAPSHOT in apache-snapshots (http://repository.apache.org/snapshots/)
 at org.apache.maven.project.ProjectModelResolver.resolveModel(ProjectModelResolver.java:197)
 at org.apache.maven.project.ProjectModelResolver.resolveModel(ProjectModelResolver.java:243)
 at org.apache.maven.model.building.DefaultModelBuilder.readParentExternally(DefaultModelBuilder.java:1051)
 at org.apache.maven.model.building.DefaultModelBuilder.readParent(DefaultModelBuilder.java:851)
 at org.apache.maven.model.building.DefaultModelBuilder.build(DefaultModelBuilder.java:331)
 at org.apache.maven.project.DefaultProjectBuilder.build(DefaultProjectBuilder.java:429)
 at org.apache.maven.project.DefaultProjectBuilder.build(DefaultProjectBuilder.java:398)
 at org.apache.maven.project.DefaultProjectBuilder.build(DefaultProjectBuilder.java:515)
 at org.apache.maven.project.DefaultProjectBuilder.build(DefaultProjectBuilder.java:398)
 at org.apache.maven.project.DefaultProjectBuilder.build(DefaultProjectBuilder.java:361)
 at org.apache.maven.graph.DefaultGraphBuilder.collectProjects(DefaultGraphBuilder.java:400)
 at org.apache.maven.graph.DefaultGraphBuilder.getProjectsForMavenReactor(DefaultGraphBuilder.java:391)
 at org.apache.maven.graph.DefaultGraphBuilder.build(DefaultGraphBuilder.java:78)
 at org.apache.maven.DefaultMaven.buildGraph(DefaultMaven.java:511)
 at org.apache.maven.DefaultMaven.doExecute(DefaultMaven.java:221)
 at org.apache.maven.DefaultMaven.doExecute(DefaultMaven.java:194)
 at org.apache.maven.DefaultMaven.execute(DefaultMaven.java:107)
 at org.apache.maven.cli.MavenCli.execute(MavenCli.java:993)
 at org.apache.maven.cli.MavenCli.doMain(MavenCli.java:345)
 at org.apache.maven.cli.MavenCli.main(MavenCli.java:191)
 at sun.reflect.NativeMethodAccessorImpl.invoke0(Native Method)
 at sun.reflect.NativeMethodAccessorImpl.invoke(NativeMethodAccessorImpl.java:62)
 at sun.reflect.DelegatingMethodAccessorImpl.invoke(DelegatingMethodAccessorImpl.java:43)
 at java.lang.reflect.Method.invoke(Method.java:498)
 at org.codehaus.plexus.classworlds.launcher.Launcher.launchEnhanced(Launcher.java:289)
 at org.codehaus.plexus.classworlds.launcher.Launcher.launch(Launcher.java:229)
 at org.codehaus.plexus.classworlds.launcher.Launcher.mainWithExitCode(Launcher.java:415)
 at org.codehaus.plexus.classworlds.launcher.Launcher.main(Launcher.java:356)
Caused by: org.eclipse.aether.resolution.ArtifactResolutionException: Could not find artifact org.apache.maven.plugin.rresource.it:it-parent:pom:1.6-SNAPSHOT in apache-snapshots (http://repository.apache.org/snapshots/)
 at org.eclipse.aether.internal.impl.DefaultArtifactResolver.resolve(DefaultArtifactResolver.java:453)
 at org.eclipse.aether.internal.impl.DefaultArtifactResolver.resolveArtifacts(DefaultArtifactResolver.java:255)
 at org.eclipse.aether.internal.impl.DefaultArtifactResolver.resolveArtifact(DefaultArtifactResolver.java:232)
 at org.eclipse.aether.internal.impl.DefaultRepositorySystem.resolveArtifact(DefaultRepositorySystem.java:303)
 at org.apache.maven.project.ProjectModelResolver.resolveModel(ProjectModelResolver.java:193)
 ... 27 more
Caused by: org.eclipse.aether.transfer.ArtifactNotFoundException: Could not find artifact org.apache.maven.plugin.rresource.it:it-parent:pom:1.6-SNAPSHOT in apache-snapshots (http://repository.apache.org/snapshots/)
 at org.eclipse.aether.connector.basic.ArtifactTransportListener.transferFailed(ArtifactTransportListener.java:48)
 at org.eclipse.aether.connector.basic.BasicRepositoryConnector$TaskRunner.run(BasicRepositoryConnector.java:364)
 at org.eclipse.aether.util.concurrency.RunnableErrorForwarder$1.run(RunnableErrorForwarder.java:76)
 at org.eclipse.aether.connector.basic.BasicRepositoryConnector$DirectExecutor.execute(BasicRepositoryConnector.java:590)
 at org.eclipse.aether.connector.basic.BasicRepositoryConnector.get(BasicRepositoryConnector.java:258)
 at org.eclipse.aether.internal.impl.DefaultArtifactResolver.performDownloads(DefaultArtifactResolver.java:529)
 at org.eclipse.aether.internal.impl.DefaultArtifactResolver.resolve(DefaultArtifactResolver.java:430)
 ... 31 more
[ERROR]   
[ERROR]   The project org.apache.maven.plugin.rresource.it.mrr41:child-2:[unknown-version] (F:\jenkins\jenkins-slave\workspace\ote-resources-plugin_master-FTEJEAA7J3RSA3RGNRQRTOLNK5IUQ7QP3AJQZXDE4RWB3DK3KFPQ\m\target\test-classes\run-only-at-execution-root\child2\pom.xml) has 1 error
[ERROR]     Non-resolvable parent POM for org.apache.maven.plugin.rresource.it.mrr41:parent:[unknown-version]: Failure to find org.apache.maven.plugin.rresource.it:it-parent:pom:1.6-SNAPSHOT in http://repository.apache.org/snapshots/ was cached in the local repository, resolution will not be reattempted until the update interval of apache-snapshots has elapsed or updates are forced and 'parent.relativePath' points at wrong local POM @ org.apache.maven.plugin.rresource.it.mrr41:parent:[unknown-version], F:\jenkins\jenkins-slave\workspace\ote-resources-plugin_master-FTEJEAA7J3RSA3RGNRQRTOLNK5IUQ7QP3AJQZXDE4RWB3DK3KFPQ\m\target\test-classes\run-only-at-execution-root\pom.xml, line 24, column 11 -> [Help 2]
org.apache.maven.model.resolution.UnresolvableModelException: Failure to find org.apache.maven.plugin.rresource.it:it-parent:pom:1.6-SNAPSHOT in http://repository.apache.org/snapshots/ was cached in the local repository, resolution will not be reattempted until the update interval of apache-snapshots has elapsed or updates are forced
 at org.apache.maven.project.ProjectModelResolver.resolveModel(ProjectModelResolver.java:197)
 at org.apache.maven.project.ProjectModelResolver.resolveModel(ProjectModelResolver.java:243)
 at org.apache.maven.model.building.DefaultModelBuilder.readParentExternally(DefaultModelBuilder.java:1051)
 at org.apache.maven.model.building.DefaultModelBuilder.readParent(DefaultModelBuilder.java:851)
 at org.apache.maven.model.building.DefaultModelBuilder.build(DefaultModelBuilder.java:331)
 at org.apache.maven.project.DefaultProjectBuilder.build(DefaultProjectBuilder.java:429)
 at org.apache.maven.project.DefaultProjectBuilder.build(DefaultProjectBuilder.java:398)
 at org.apache.maven.project.DefaultProjectBuilder.build(DefaultProjectBuilder.java:515)
 at org.apache.maven.project.DefaultProjectBuilder.build(DefaultProjectBuilder.java:398)
 at org.apache.maven.project.DefaultProjectBuilder.build(DefaultProjectBuilder.java:361)
 at org.apache.maven.graph.DefaultGraphBuilder.collectProjects(DefaultGraphBuilder.java:400)
 at org.apache.maven.graph.DefaultGraphBuilder.getProjectsForMavenReactor(DefaultGraphBuilder.java:391)
 at org.apache.maven.graph.DefaultGraphBuilder.build(DefaultGraphBuilder.java:78)
 at org.apache.maven.DefaultMaven.buildGraph(DefaultMaven.java:511)
 at org.apache.maven.DefaultMaven.doExecute(DefaultMaven.java:221)
 at org.apache.maven.DefaultMaven.doExecute(DefaultMaven.java:194)
 at org.apache.maven.DefaultMaven.execute(DefaultMaven.java:107)
 at org.apache.maven.cli.MavenCli.execute(MavenCli.java:993)
 at org.apache.maven.cli.MavenCli.doMain(MavenCli.java:345)
 at org.apache.maven.cli.MavenCli.main(MavenCli.java:191)
 at sun.reflect.NativeMethodAccessorImpl.invoke0(Native Method)
 at sun.reflect.NativeMethodAccessorImpl.invoke(NativeMethodAccessorImpl.java:62)
 at sun.reflect.DelegatingMethodAccessorImpl.invoke(DelegatingMethodAccessorImpl.java:43)
 at java.lang.reflect.Method.invoke(Method.java:498)
 at org.codehaus.plexus.classworlds.launcher.Launcher.launchEnhanced(Launcher.java:289)
 at org.codehaus.plexus.classworlds.launcher.Launcher.launch(Launcher.java:229)
 at org.codehaus.plexus.classworlds.launcher.Launcher.mainWithExitCode(Launcher.java:415)
 at org.codehaus.plexus.classworlds.launcher.Launcher.main(Launcher.java:356)
Caused by: org.eclipse.aether.resolution.ArtifactResolutionException: Failure to find org.apache.maven.plugin.rresource.it:it-parent:pom:1.6-SNAPSHOT in http://repository.apache.org/snapshots/ was cached in the local repository, resolution will not be reattempted until the update interval of apache-snapshots has elapsed or updates are forced
 at org.eclipse.aether.internal.impl.DefaultArtifactResolver.resolve(DefaultArtifactResolver.java:453)
 at org.eclipse.aether.internal.impl.DefaultArtifactResolver.resolveArtifacts(DefaultArtifactResolver.java:255)
 at org.eclipse.aether.internal.impl.DefaultArtifactResolver.resolveArtifact(DefaultArtifactResolver.java:232)
 at org.eclipse.aether.internal.impl.DefaultRepositorySystem.resolveArtifact(DefaultRepositorySystem.java:303)
 at org.apache.maven.project.ProjectModelResolver.resolveModel(ProjectModelResolver.java:193)
 ... 27 more
Caused by: org.eclipse.aether.transfer.ArtifactNotFoundException: Failure to find org.apache.maven.plugin.rresource.it:it-parent:pom:1.6-SNAPSHOT in http://repository.apache.org/snapshots/ was cached in the local repository, resolution will not be reattempted until the update interval of apache-snapshots has elapsed or updates are forced
 at org.eclipse.aether.internal.impl.DefaultUpdateCheckManager.newException(DefaultUpdateCheckManager.java:240)
 at org.eclipse.aether.internal.impl.DefaultUpdateCheckManager.checkArtifact(DefaultUpdateCheckManager.java:192)
 at org.eclipse.aether.internal.impl.DefaultArtifactResolver.gatherDownloads(DefaultArtifactResolver.java:594)
 at org.eclipse.aether.internal.impl.DefaultArtifactResolver.performDownloads(DefaultArtifactResolver.java:512)
 at org.eclipse.aether.internal.impl.DefaultArtifactResolver.resolve(DefaultArtifactResolver.java:430)
 ... 31 more
[ERROR] 
[ERROR] Re-run Maven using the -X switch to enable full debug logging.
[ERROR] 
[ERROR] For more information about the errors and possible solutions, please read the following articles:
[ERROR] [Help 1] http://cwiki.apache.org/confluence/display/MAVEN/ProjectBuildingException
[ERROR] [Help 2] http://cwiki.apache.org/confluence/display/MAVEN/UnresolvableModelException
Picked up JAVA_TOOL_OPTIONS: -Dmaven.ext.class.path="f:\jenkins\jenkins-slave\workspace\ote-resources-plugin_master-FTEJEAA7J3RSA3RGNRQRTOLNK5IUQ7QP3AJQZXDE4RWB3DK3KFPQ@tmp\withMaven8d4af88d\pipeline-maven-spy.jar" -Dorg.jenkinsci.plugins.pipeline.maven.reportsFolder="f:\jenkins\jenkins-slave\workspace\ote-resources-plugin_master-FTEJEAA7J3RSA3RGNRQRTOLNK5IUQ7QP3AJQZXDE4RWB3DK3KFPQ@tmp\withMaven8d4af88d" 


Stack Trace:
org.apache.maven.it.VerificationException: 
Exit code was non-zero: 1; command line and log = 
F:\jenkins\tools\maven\apache-maven-3.5.0\bin\mvn -e --batch-mode -Dmaven.repo.local=f:\jenkins\jenkins-slave\workspace\ote-resources-plugin_master-FTEJEAA7J3RSA3RGNRQRTOLNK5IUQ7QP3AJQZXDE4RWB3DK3KFPQ\m\target/it-repo org.apache.maven.plugins:maven-clean-plugin:clean generate-resources
[INFO] [jenkins-event-spy] Generate F:\jenkins\jenkins-slave\workspace\ote-resources-plugin_master-FTEJEAA7J3RSA3RGNRQRTOLNK5IUQ7QP3AJQZXDE4RWB3DK3KFPQ@tmp\withMaven8d4af88d\maven-spy-20180309-222531-6299009207894420591326.log.tmp ...
[INFO] Error stacktraces are turned on.
[INFO] Scanning for projects...
[INFO] Downloading: http://repository.apache.org/snapshots/org/apache/maven/plugin/rresource/it/it-parent/1.6-SNAPSHOT/maven-metadata.xml
[INFO] Downloading: http://repository.apache.org/snapshots/org/apache/maven/plugin/rresource/it/it-parent/1.6-SNAPSHOT/it-parent-1.6-SNAPSHOT.pom
[ERROR] [ERROR] Some problems were encountered while processing the POMs:
[FATAL] Non-resolvable parent POM for org.apache.maven.plugin.rresource.it.mrr41:parent:[unknown-version]: Could not find artifact org.apache.maven.plugin.rresource.it:it-parent:pom:1.6-SNAPSHOT in apache-snapshots (http://repository.apache.org/snapshots/) and 'parent.relativePath' points at wrong local POM @ org.apache.maven.plugin.rresource.it.mrr41:parent:[unknown-version], F:\jenkins\jenkins-slave\workspace\ote-resources-plugin_master-FTEJEAA7J3RSA3RGNRQRTOLNK5IUQ7QP3AJQZXDE4RWB3DK3KFPQ\m\target\test-classes\run-only-at-execution-root\pom.xml, line 24, column 11
[FATAL] Non-resolvable parent POM for org.apache.maven.plugin.rresource.it.mrr41:parent:[unknown-version]: Failure to find org.apache.maven.plugin.rresource.it:it-parent:pom:1.6-SNAPSHOT in http://repository.apache.org/snapshots/ was cached in the local repository, resolution will not be reattempted until the update interval of apache-snapshots has elapsed or updates are forced and 'parent.relativePath' points at wrong local POM @ org.apache.maven.plugin.rresource.it.mrr41:parent:[unknown-version], F:\jenkins\jenkins-slave\workspace\ote-resources-plugin_master-FTEJEAA7J3RSA3RGNRQRTOLNK5IUQ7QP3AJQZXDE4RWB3DK3KFPQ\m\target\test-classes\run-only-at-execution-root\pom.xml, line 24, column 11
 @ 
[INFO] [jenkins-event-spy] Generated F:\jenkins\jenkins-slave\workspace\ote-resources-plugin_master-FTEJEAA7J3RSA3RGNRQRTOLNK5IUQ7QP3AJQZXDE4RWB3DK3KFPQ@tmp\withMaven8d4af88d\maven-spy-20180309-222531-6299009207894420591326.log
[ERROR] The build could not read 2 projects -> [Help 1]
org.apache.maven.project.ProjectBuildingException: Some problems were encountered while processing the POMs:
[FATAL] Non-resolvable parent POM for org.apache.maven.plugin.rresource.it.mrr41:parent:[unknown-version]: Could not find artifact org.apache.maven.plugin.rresource.it:it-parent:pom:1.6-SNAPSHOT in apache-snapshots (http://repository.apache.org/snapshots/) and 'parent.relativePath' points at wrong local POM @ org.apache.maven.plugin.rresource.it.mrr41:parent:[unknown-version], F:\jenkins\jenkins-slave\workspace\ote-resources-plugin_master-FTEJEAA7J3RSA3RGNRQRTOLNK5IUQ7QP3AJQZXDE4RWB3DK3KFPQ\m\target\test-classes\run-only-at-execution-root\pom.xml, line 24, column 11
[FATAL] Non-resolvable parent POM for org.apache.maven.plugin.rresource.it.mrr41:parent:[unknown-version]: Failure to find org.apache.maven.plugin.rresource.it:it-parent:pom:1.6-SNAPSHOT in http://repository.apache.org/snapshots/ was cached in the local repository, resolution will not be reattempted until the update interval of apache-snapshots has elapsed or updates are forced and 'parent.relativePath' points at wrong local POM @ org.apache.maven.plugin.rresource.it.mrr41:parent:[unknown-version], F:\jenkins\jenkins-slave\workspace\ote-resources-plugin_master-FTEJEAA7J3RSA3RGNRQRTOLNK5IUQ7QP3AJQZXDE4RWB3DK3KFPQ\m\target\test-classes\run-only-at-execution-root\pom.xml, line 24, column 11

	at org.apache.maven.project.DefaultProjectBuilder.build(DefaultProjectBuilder.java:382)
	at org.apache.maven.graph.DefaultGraphBuilder.collectProjects(DefaultGraphBuilder.java:400)
	at org.apache.maven.graph.DefaultGraphBuilder.getProjectsForMavenReactor(DefaultGraphBuilder.java:391)
	at org.apache.maven.graph.DefaultGraphBuilder.build(DefaultGraphBuilder.java:78)
	at org.apache.maven.DefaultMaven.buildGraph(DefaultMaven.java:511)
	at org.apache.maven.DefaultMaven.doExecute(DefaultMaven.java:221)
	at org.apache.maven.DefaultMaven.doExecute(DefaultMaven.java:194)
	at org.apache.maven.DefaultMaven.execute(DefaultMaven.java:107)
	at org.apache.maven.cli.MavenCli.execute(MavenCli.java:993)
	at org.apache.maven.cli.MavenCli.doMain(MavenCli.java:345)
	at org.apache.maven.cli.MavenCli.main(MavenCli.java:191)
	at sun.reflect.NativeMethodAccessorImpl.invoke0(Native Method)
	at sun.reflect.NativeMethodAccessorImpl.invoke(NativeMethodAccessorImpl.java:62)
	at sun.reflect.DelegatingMethodAccessorImpl.invoke(DelegatingMethodAccessorImpl.java:43)
	at java.lang.reflect.Method.invoke(Method.java:498)
	at org.codehaus.plexus.classworlds.launcher.Launcher.launchEnhanced(Launcher.java:289)
	at org.codehaus.plexus.classworlds.launcher.Launcher.launch(Launcher.java:229)
	at org.codehaus.plexus.classworlds.launcher.Launcher.mainWithExitCode(Launcher.java:415)
	at org.codehaus.plexus.classworlds.launcher.Launcher.main(Launcher.java:356)
[ERROR]   
[ERROR]   The project org.apache.maven.plugin.rresource.it.mrr41:child-1:[unknown-version] (F:\jenkins\jenkins-slave\workspace\ote-resources-plugin_master-FTEJEAA7J3RSA3RGNRQRTOLNK5IUQ7QP3AJQZXDE4RWB3DK3KFPQ\m\target\test-classes\run-only-at-execution-root\child1\pom.xml) has 1 error
[ERROR]     Non-resolvable parent POM for org.apache.maven.plugin.rresource.it.mrr41:parent:[unknown-version]: Could not find artifact org.apache.maven.plugin.rresource.it:it-parent:pom:1.6-SNAPSHOT in apache-snapshots (http://repository.apache.org/snapshots/) and 'parent.relativePath' points at wrong local POM @ org.apache.maven.plugin.rresource.it.mrr41:parent:[unknown-version], F:\jenkins\jenkins-slave\workspace\ote-resources-plugin_master-FTEJEAA7J3RSA3RGNRQRTOLNK5IUQ7QP3AJQZXDE4RWB3DK3KFPQ\m\target\test-classes\run-only-at-execution-root\pom.xml, line 24, column 11 -> [Help 2]
org.apache.maven.model.resolution.UnresolvableModelException: Could not find artifact org.apache.maven.plugin.rresource.it:it-parent:pom:1.6-SNAPSHOT in apache-snapshots (http://repository.apache.org/snapshots/)
	at org.apache.maven.project.ProjectModelResolver.resolveModel(ProjectModelResolver.java:197)
	at org.apache.maven.project.ProjectModelResolver.resolveModel(ProjectModelResolver.java:243)
	at org.apache.maven.model.building.DefaultModelBuilder.readParentExternally(DefaultModelBuilder.java:1051)
	at org.apache.maven.model.building.DefaultModelBuilder.readParent(DefaultModelBuilder.java:851)
	at org.apache.maven.model.building.DefaultModelBuilder.build(DefaultModelBuilder.java:331)
	at org.apache.maven.project.DefaultProjectBuilder.build(DefaultProjectBuilder.java:429)
	at org.apache.maven.project.DefaultProjectBuilder.build(DefaultProjectBuilder.java:398)
	at org.apache.maven.project.DefaultProjectBuilder.build(DefaultProjectBuilder.java:515)
	at org.apache.maven.project.DefaultProjectBuilder.build(DefaultProjectBuilder.java:398)
	at org.apache.maven.project.DefaultProjectBuilder.build(DefaultProjectBuilder.java:361)
	at org.apache.maven.graph.DefaultGraphBuilder.collectProjects(DefaultGraphBuilder.java:400)
	at org.apache.maven.graph.DefaultGraphBuilder.getProjectsForMavenReactor(DefaultGraphBuilder.java:391)
	at org.apache.maven.graph.DefaultGraphBuilder.build(DefaultGraphBuilder.java:78)
	at org.apache.maven.DefaultMaven.buildGraph(DefaultMaven.java:511)
	at org.apache.maven.DefaultMaven.doExecute(DefaultMaven.java:221)
	at org.apache.maven.DefaultMaven.doExecute(DefaultMaven.java:194)
	at org.apache.maven.DefaultMaven.execute(DefaultMaven.java:107)
	at org.apache.maven.cli.MavenCli.execute(MavenCli.java:993)
	at org.apache.maven.cli.MavenCli.doMain(MavenCli.java:345)
	at org.apache.maven.cli.MavenCli.main(MavenCli.java:191)
	at sun.reflect.NativeMethodAccessorImpl.invoke0(Native Method)
	at sun.reflect.NativeMethodAccessorImpl.invoke(NativeMethodAccessorImpl.java:62)
	at sun.reflect.DelegatingMethodAccessorImpl.invoke(DelegatingMethodAccessorImpl.java:43)
	at java.lang.reflect.Method.invoke(Method.java:498)
	at org.codehaus.plexus.classworlds.launcher.Launcher.launchEnhanced(Launcher.java:289)
	at org.codehaus.plexus.classworlds.launcher.Launcher.launch(Launcher.java:229)
	at org.codehaus.plexus.classworlds.launcher.Launcher.mainWithExitCode(Launcher.java:415)
	at org.codehaus.plexus.classworlds.launcher.Launcher.main(Launcher.java:356)
Caused by: org.eclipse.aether.resolution.ArtifactResolutionException: Could not find artifact org.apache.maven.plugin.rresource.it:it-parent:pom:1.6-SNAPSHOT in apache-snapshots (http://repository.apache.org/snapshots/)
	at org.eclipse.aether.internal.impl.DefaultArtifactResolver.resolve(DefaultArtifactResolver.java:453)
	at org.eclipse.aether.internal.impl.DefaultArtifactResolver.resolveArtifacts(DefaultArtifactResolver.java:255)
	at org.eclipse.aether.internal.impl.DefaultArtifactResolver.resolveArtifact(DefaultArtifactResolver.java:232)
	at org.eclipse.aether.internal.impl.DefaultRepositorySystem.resolveArtifact(DefaultRepositorySystem.java:303)
	at org.apache.maven.project.ProjectModelResolver.resolveModel(ProjectModelResolver.java:193)
	... 27 more
Caused by: org.eclipse.aether.transfer.ArtifactNotFoundException: Could not find artifact org.apache.maven.plugin.rresource.it:it-parent:pom:1.6-SNAPSHOT in apache-snapshots (http://repository.apache.org/snapshots/)
	at org.eclipse.aether.connector.basic.ArtifactTransportListener.transferFailed(ArtifactTransportListener.java:48)
	at org.eclipse.aether.connector.basic.BasicRepositoryConnector$TaskRunner.run(BasicRepositoryConnector.java:364)
	at org.eclipse.aether.util.concurrency.RunnableErrorForwarder$1.run(RunnableErrorForwarder.java:76)
	at org.eclipse.aether.connector.basic.BasicRepositoryConnector$DirectExecutor.execute(BasicRepositoryConnector.java:590)
	at org.eclipse.aether.connector.basic.BasicRepositoryConnector.get(BasicRepositoryConnector.java:258)
	at org.eclipse.aether.internal.impl.DefaultArtifactResolver.performDownloads(DefaultArtifactResolver.java:529)
	at org.eclipse.aether.internal.impl.DefaultArtifactResolver.resolve(DefaultArtifactResolver.java:430)
	... 31 more
[ERROR]   
[ERROR]   The project org.apache.maven.plugin.rresource.it.mrr41:child-2:[unknown-version] (F:\jenkins\jenkins-slave\workspace\ote-resources-plugin_master-FTEJEAA7J3RSA3RGNRQRTOLNK5IUQ7QP3AJQZXDE4RWB3DK3KFPQ\m\target\test-classes\run-only-at-execution-root\child2\pom.xml) has 1 error
[ERROR]     Non-resolvable parent POM for org.apache.maven.plugin.rresource.it.mrr41:parent:[unknown-version]: Failure to find org.apache.maven.plugin.rresource.it:it-parent:pom:1.6-SNAPSHOT in http://repository.apache.org/snapshots/ was cached in the local repository, resolution will not be reattempted until the update interval of apache-snapshots has elapsed or updates are forced and 'parent.relativePath' points at wrong local POM @ org.apache.maven.plugin.rresource.it.mrr41:parent:[unknown-version], F:\jenkins\jenkins-slave\workspace\ote-resources-plugin_master-FTEJEAA7J3RSA3RGNRQRTOLNK5IUQ7QP3AJQZXDE4RWB3DK3KFPQ\m\target\test-classes\run-only-at-execution-root\pom.xml, line 24, column 11 -> [Help 2]
org.apache.maven.model.resolution.UnresolvableModelException: Failure to find org.apache.maven.plugin.rresource.it:it-parent:pom:1.6-SNAPSHOT in http://repository.apache.org/snapshots/ was cached in the local repository, resolution will not be reattempted until the update interval of apache-snapshots has elapsed or updates are forced
	at org.apache.maven.project.ProjectModelResolver.resolveModel(ProjectModelResolver.java:197)
	at org.apache.maven.project.ProjectModelResolver.resolveModel(ProjectModelResolver.java:243)
	at org.apache.maven.model.building.DefaultModelBuilder.readParentExternally(DefaultModelBuilder.java:1051)
	at org.apache.maven.model.building.DefaultModelBuilder.readParent(DefaultModelBuilder.java:851)
	at org.apache.maven.model.building.DefaultModelBuilder.build(DefaultModelBuilder.java:331)
	at org.apache.maven.project.DefaultProjectBuilder.build(DefaultProjectBuilder.java:429)
	at org.apache.maven.project.DefaultProjectBuilder.build(DefaultProjectBuilder.java:398)
	at org.apache.maven.project.DefaultProjectBuilder.build(DefaultProjectBuilder.java:515)
	at org.apache.maven.project.DefaultProjectBuilder.build(DefaultProjectBuilder.java:398)
	at org.apache.maven.project.DefaultProjectBuilder.build(DefaultProjectBuilder.java:361)
	at org.apache.maven.graph.DefaultGraphBuilder.collectProjects(DefaultGraphBuilder.java:400)
	at org.apache.maven.graph.DefaultGraphBuilder.getProjectsForMavenReactor(DefaultGraphBuilder.java:391)
	at org.apache.maven.graph.DefaultGraphBuilder.build(DefaultGraphBuilder.java:78)
	at org.apache.maven.DefaultMaven.buildGraph(DefaultMaven.java:511)
	at org.apache.maven.DefaultMaven.doExecute(DefaultMaven.java:221)
	at org.apache.maven.DefaultMaven.doExecute(DefaultMaven.java:194)
	at org.apache.maven.DefaultMaven.execute(DefaultMaven.java:107)
	at org.apache.maven.cli.MavenCli.execute(MavenCli.java:993)
	at org.apache.maven.cli.MavenCli.doMain(MavenCli.java:345)
	at org.apache.maven.cli.MavenCli.main(MavenCli.java:191)
	at sun.reflect.NativeMethodAccessorImpl.invoke0(Native Method)
	at sun.reflect.NativeMethodAccessorImpl.invoke(NativeMethodAccessorImpl.java:62)
	at sun.reflect.DelegatingMethodAccessorImpl.invoke(DelegatingMethodAccessorImpl.java:43)
	at java.lang.reflect.Method.invoke(Method.java:498)
	at org.codehaus.plexus.classworlds.launcher.Launcher.launchEnhanced(Launcher.java:289)
	at org.codehaus.plexus.classworlds.launcher.Launcher.launch(Launcher.java:229)
	at org.codehaus.plexus.classworlds.launcher.Launcher.mainWithExitCode(Launcher.java:415)
	at org.codehaus.plexus.classworlds.launcher.Launcher.main(Launcher.java:356)
Caused by: org.eclipse.aether.resolution.ArtifactResolutionException: Failure to find org.apache.maven.plugin.rresource.it:it-parent:pom:1.6-SNAPSHOT in http://repository.apache.org/snapshots/ was cached in the local repository, resolution will not be reattempted until the update interval of apache-snapshots has elapsed or updates are forced
	at org.eclipse.aether.internal.impl.DefaultArtifactResolver.resolve(DefaultArtifactResolver.java:453)
	at org.eclipse.aether.internal.impl.DefaultArtifactResolver.resolveArtifacts(DefaultArtifactResolver.java:255)
	at org.eclipse.aether.internal.impl.DefaultArtifactResolver.resolveArtifact(DefaultArtifactResolver.java:232)
	at org.eclipse.aether.internal.impl.DefaultRepositorySystem.resolveArtifact(DefaultRepositorySystem.java:303)
	at org.apache.maven.project.ProjectModelResolver.resolveModel(ProjectModelResolver.java:193)
	... 27 more
Caused by: org.eclipse.aether.transfer.ArtifactNotFoundException: Failure to find org.apache.maven.plugin.rresource.it:it-parent:pom:1.6-SNAPSHOT in http://repository.apache.org/snapshots/ was cached in the local repository, resolution will not be reattempted until the update interval of apache-snapshots has elapsed or updates are forced
	at org.eclipse.aether.internal.impl.DefaultUpdateCheckManager.newException(DefaultUpdateCheckManager.java:240)
	at org.eclipse.aether.internal.impl.DefaultUpdateCheckManager.checkArtifact(DefaultUpdateCheckManager.java:192)
	at org.eclipse.aether.internal.impl.DefaultArtifactResolver.gatherDownloads(DefaultArtifactResolver.java:594)
	at org.eclipse.aether.internal.impl.DefaultArtifactResolver.performDownloads(DefaultArtifactResolver.java:512)
	at org.eclipse.aether.internal.impl.DefaultArtifactResolver.resolve(DefaultArtifactResolver.java:430)
	... 31 more
[ERROR] 
[ERROR] Re-run Maven using the -X switch to enable full debug logging.
[ERROR] 
[ERROR] For more information about the errors and possible solutions, please read the following articles:
[ERROR] [Help 1] http://cwiki.apache.org/confluence/display/MAVEN/ProjectBuildingException
[ERROR] [Help 2] http://cwiki.apache.org/confluence/display/MAVEN/UnresolvableModelException
Picked up JAVA_TOOL_OPTIONS: -Dmaven.ext.class.path="f:\jenkins\jenkins-slave\workspace\ote-resources-plugin_master-FTEJEAA7J3RSA3RGNRQRTOLNK5IUQ7QP3AJQZXDE4RWB3DK3KFPQ@tmp\withMaven8d4af88d\pipeline-maven-spy.jar" -Dorg.jenkinsci.plugins.pipeline.maven.reportsFolder="f:\jenkins\jenkins-slave\workspace\ote-resources-plugin_master-FTEJEAA7J3RSA3RGNRQRTOLNK5IUQ7QP3AJQZXDE4RWB3DK3KFPQ@tmp\withMaven8d4af88d" 

	at org.apache.maven.plugin.resources.remote.it.IT_RunOnlyAtExecutionRoot.test(IT_RunOnlyAtExecutionRoot.java:60)




Build log:
[...truncated 1.68 MB...]
[linux-jdk9] [INFO] 
[linux-jdk9] [INFO] ------------------------------------------------------------------------
[linux-jdk9] [INFO] Building resources 1
[linux-jdk9] [INFO] ------------------------------------------------------------------------
[linux-jdk9] [INFO] 
[linux-jdk9] [INFO] --- maven-clean-plugin:2.5:clean (default-cli) @ resources ---
[linux-jdk9] [INFO] 
[linux-jdk9] [INFO] --- maven-install-plugin:2.4:install (default-install) @ resources ---
[linux-jdk9] [INFO] Installing /home/jenkins/jenkins-slave/workspace/ote-resources-plugin_master-FTEJEAA7J3RSA3RGNRQRTOLNK5IUQ7QP3AJQZXDE4RWB3DK3KFPQ/m/target/test-classes/supplemental-artifact/resource-projects/pom.xml to /home/jenkins/jenkins-slave/workspace/ote-resources-plugin_master-FTEJEAA7J3RSA3RGNRQRTOLNK5IUQ7QP3AJQZXDE4RWB3DK3KFPQ/m/target/it-repo/org/apache/maven/plugin/rresource/it/mrr43/resources/1/resources-1.pom
[linux-jdk9] [INFO] 
[linux-jdk9] [INFO] --- maven-deploy-plugin:2.7:deploy (default-deploy) @ resources ---
[linux-jdk9] [INFO] Uploading to it-remote: file:/home/jenkins/jenkins-slave/workspace/ote-resources-plugin_master-FTEJEAA7J3RSA3RGNRQRTOLNK5IUQ7QP3AJQZXDE4RWB3DK3KFPQ/m/target/remote-repo/org/apache/maven/plugin/rresource/it/mrr43/resources/1/resources-1.pom
[linux-jdk9] [INFO] Uploaded to it-remote: file:/home/jenkins/jenkins-slave/workspace/ote-resources-plugin_master-FTEJEAA7J3RSA3RGNRQRTOLNK5IUQ7QP3AJQZXDE4RWB3DK3KFPQ/m/target/remote-repo/org/apache/maven/plugin/rresource/it/mrr43/resources/1/resources-1.pom (1.6 kB at 80 kB/s)
[linux-jdk9] [INFO] Downloading from it-remote: file:/home/jenkins/jenkins-slave/workspace/ote-resources-plugin_master-FTEJEAA7J3RSA3RGNRQRTOLNK5IUQ7QP3AJQZXDE4RWB3DK3KFPQ/m/target/remote-repo/org/apache/maven/plugin/rresource/it/mrr43/resources/maven-metadata.xml
[linux-jdk9] [INFO] Uploading to it-remote: file:/home/jenkins/jenkins-slave/workspace/ote-resources-plugin_master-FTEJEAA7J3RSA3RGNRQRTOLNK5IUQ7QP3AJQZXDE4RWB3DK3KFPQ/m/target/remote-repo/org/apache/maven/plugin/rresource/it/mrr43/resources/maven-metadata.xml
[linux-jdk9] [INFO] Uploaded to it-remote: file:/home/jenkins/jenkins-slave/workspace/ote-resources-plugin_master-FTEJEAA7J3RSA3RGNRQRTOLNK5IUQ7QP3AJQZXDE4RWB3DK3KFPQ/m/target/remote-repo/org/apache/maven/plugin/rresource/it/mrr43/resources/maven-metadata.xml (323 B at 323 kB/s)
[linux-jdk9] [INFO] 
[linux-jdk9] [INFO] ------------------------------------------------------------------------
[linux-jdk9] [INFO] Building supplemental-models 1
[linux-jdk9] [INFO] ------------------------------------------------------------------------
[linux-jdk9] [INFO] 
[linux-jdk9] [INFO] --- maven-clean-plugin:2.5:clean (default-cli) @ supplemental-models ---
[linux-jdk9] [INFO] 
[linux-jdk9] [INFO] --- maven-resources-plugin:2.6:resources (default-resources) @ supplemental-models ---
[linux-jdk9] [WARNING] Using platform encoding (ISO-8859-1 actually) to copy filtered resources, i.e. build is platform dependent!
[linux-jdk9] [INFO] Copying 1 resource
[linux-jdk9] [INFO] 
[linux-jdk9] [INFO] --- maven-compiler-plugin:3.1:compile (default-compile) @ supplemental-models ---
[linux-jdk9] [INFO] No sources to compile
[linux-jdk9] [INFO] 
[linux-jdk9] [INFO] --- maven-resources-plugin:2.6:testResources (default-testResources) @ supplemental-models ---
[linux-jdk9] [WARNING] Using platform encoding (ISO-8859-1 actually) to copy filtered resources, i.e. build is platform dependent!
[linux-jdk9] [INFO] skip non existing resourceDirectory /home/jenkins/jenkins-slave/workspace/ote-resources-plugin_master-FTEJEAA7J3RSA3RGNRQRTOLNK5IUQ7QP3AJQZXDE4RWB3DK3KFPQ/m/target/test-classes/supplemental-artifact/resource-projects/supplemental-models/src/test/resources
[linux-jdk9] [INFO] 
[linux-jdk9] [INFO] --- maven-compiler-plugin:3.1:testCompile (default-testCompile) @ supplemental-models ---
[linux-jdk9] [INFO] No sources to compile
[linux-jdk9] [INFO] 
[linux-jdk9] [INFO] --- maven-surefire-plugin:2.12.4:test (default-test) @ supplemental-models ---
[linux-jdk9] [INFO] No tests to run.
[linux-jdk9] [INFO] 
[linux-jdk9] [INFO] --- maven-jar-plugin:2.4:jar (default-jar) @ supplemental-models ---
[linux-jdk9] [INFO] Building jar: /home/jenkins/jenkins-slave/workspace/ote-resources-plugin_master-FTEJEAA7J3RSA3RGNRQRTOLNK5IUQ7QP3AJQZXDE4RWB3DK3KFPQ/m/target/test-classes/supplemental-artifact/resource-projects/supplemental-models/target/supplemental-models-1.jar
[linux-jdk9] [INFO] 
[linux-jdk9] [INFO] --- maven-install-plugin:2.4:install (default-install) @ supplemental-models ---
[linux-jdk9] [INFO] Installing /home/jenkins/jenkins-slave/workspace/ote-resources-plugin_master-FTEJEAA7J3RSA3RGNRQRTOLNK5IUQ7QP3AJQZXDE4RWB3DK3KFPQ/m/target/test-classes/supplemental-artifact/resource-projects/supplemental-models/target/supplemental-models-1.jar to /home/jenkins/jenkins-slave/workspace/ote-resources-plugin_master-FTEJEAA7J3RSA3RGNRQRTOLNK5IUQ7QP3AJQZXDE4RWB3DK3KFPQ/m/target/it-repo/org/apache/maven/plugin/rresource/it/mrr43/supplemental-models/1/supplemental-models-1.jar
[linux-jdk9] [INFO] Installing /home/jenkins/jenkins-slave/workspace/ote-resources-plugin_master-FTEJEAA7J3RSA3RGNRQRTOLNK5IUQ7QP3AJQZXDE4RWB3DK3KFPQ/m/target/test-classes/supplemental-artifact/resource-projects/supplemental-models/pom.xml to /home/jenkins/jenkins-slave/workspace/ote-resources-plugin_master-FTEJEAA7J3RSA3RGNRQRTOLNK5IUQ7QP3AJQZXDE4RWB3DK3KFPQ/m/target/it-repo/org/apache/maven/plugin/rresource/it/mrr43/supplemental-models/1/supplemental-models-1.pom
[linux-jdk9] [INFO] 
[linux-jdk9] [INFO] --- maven-deploy-plugin:2.7:deploy (default-deploy) @ supplemental-models ---
[linux-jdk9] [INFO] Uploading to it-remote: file:/home/jenkins/jenkins-slave/workspace/ote-resources-plugin_master-FTEJEAA7J3RSA3RGNRQRTOLNK5IUQ7QP3AJQZXDE4RWB3DK3KFPQ/m/target/remote-repo/org/apache/maven/plugin/rresource/it/mrr43/supplemental-models/1/supplemental-models-1.jar
[linux-jdk9] [INFO] Uploaded to it-remote: file:/home/jenkins/jenkins-slave/workspace/ote-resources-plugin_master-FTEJEAA7J3RSA3RGNRQRTOLNK5IUQ7QP3AJQZXDE4RWB3DK3KFPQ/m/target/remote-repo/org/apache/maven/plugin/rresource/it/mrr43/supplemental-models/1/supplemental-models-1.jar (3.0 kB at 1.5 MB/s)
[linux-jdk9] [INFO] Uploading to it-remote: file:/home/jenkins/jenkins-slave/workspace/ote-resources-plugin_master-FTEJEAA7J3RSA3RGNRQRTOLNK5IUQ7QP3AJQZXDE4RWB3DK3KFPQ/m/target/remote-repo/org/apache/maven/plugin/rresource/it/mrr43/supplemental-models/1/supplemental-models-1.pom
[linux-jdk9] [INFO] Uploaded to it-remote: file:/home/jenkins/jenkins-slave/workspace/ote-resources-plugin_master-FTEJEAA7J3RSA3RGNRQRTOLNK5IUQ7QP3AJQZXDE4RWB3DK3KFPQ/m/target/remote-repo/org/apache/maven/plugin/rresource/it/mrr43/supplemental-models/1/supplemental-models-1.pom (1.3 kB at 1.3 MB/s)
[linux-jdk9] [INFO] Downloading from it-remote: file:/home/jenkins/jenkins-slave/workspace/ote-resources-plugin_master-FTEJEAA7J3RSA3RGNRQRTOLNK5IUQ7QP3AJQZXDE4RWB3DK3KFPQ/m/target/remote-repo/org/apache/maven/plugin/rresource/it/mrr43/supplemental-models/maven-metadata.xml
[linux-jdk9] [INFO] Uploading to it-remote: file:/home/jenkins/jenkins-slave/workspace/ote-resources-plugin_master-FTEJEAA7J3RSA3RGNRQRTOLNK5IUQ7QP3AJQZXDE4RWB3DK3KFPQ/m/target/remote-repo/org/apache/maven/plugin/rresource/it/mrr43/supplemental-models/maven-metadata.xml
[linux-jdk9] [INFO] Uploaded to it-remote: file:/home/jenkins/jenkins-slave/workspace/ote-resources-plugin_master-FTEJEAA7J3RSA3RGNRQRTOLNK5IUQ7QP3AJQZXDE4RWB3DK3KFPQ/m/target/remote-repo/org/apache/maven/plugin/rresource/it/mrr43/supplemental-models/maven-metadata.xml (333 B at 333 kB/s)
[linux-jdk9] [INFO] 
[linux-jdk9] [INFO] ------------------------------------------------------------------------
[linux-jdk9] [INFO] Building deficient-dep 1
[linux-jdk9] [INFO] ------------------------------------------------------------------------
[linux-jdk9] [INFO] 
[linux-jdk9] [INFO] --- maven-clean-plugin:2.5:clean (default-cli) @ deficient-dep ---
[linux-jdk9] [INFO] 
[linux-jdk9] [INFO] --- maven-resources-plugin:2.6:resources (default-resources) @ deficient-dep ---
[linux-jdk9] [WARNING] Using platform encoding (ISO-8859-1 actually) to copy filtered resources, i.e. build is platform dependent!
[linux-jdk9] [INFO] skip non existing resourceDirectory /home/jenkins/jenkins-slave/workspace/ote-resources-plugin_master-FTEJEAA7J3RSA3RGNRQRTOLNK5IUQ7QP3AJQZXDE4RWB3DK3KFPQ/m/target/test-classes/supplemental-artifact/resource-projects/deficient-dep/src/main/resources
[linux-jdk9] [INFO] 
[linux-jdk9] [INFO] --- maven-compiler-plugin:3.1:compile (default-compile) @ deficient-dep ---
[linux-jdk9] [INFO] Changes detected - recompiling the module!
[linux-jdk9] [WARNING] File encoding has not been set, using platform encoding ISO-8859-1, i.e. build is platform dependent!
[linux-jdk9] [INFO] Compiling 1 source file to /home/jenkins/jenkins-slave/workspace/ote-resources-plugin_master-FTEJEAA7J3RSA3RGNRQRTOLNK5IUQ7QP3AJQZXDE4RWB3DK3KFPQ/m/target/test-classes/supplemental-artifact/resource-projects/deficient-dep/target/classes
[linux-jdk9] [INFO] -------------------------------------------------------------
[linux-jdk9] [ERROR] COMPILATION ERROR : 
[linux-jdk9] [INFO] -------------------------------------------------------------
[linux-jdk9] [ERROR] Source option 1.5 is no longer supported. Use 1.6 or later.
[linux-jdk9] [ERROR] Target option 1.5 is no longer supported. Use 1.6 or later.
[linux-jdk9] [INFO] 2 errors 
[linux-jdk9] [INFO] -------------------------------------------------------------
[linux-jdk9] [INFO] ------------------------------------------------------------------------
[linux-jdk9] [INFO] Reactor Summary:
[linux-jdk9] [INFO] 
[linux-jdk9] [INFO] resources .......................................... SUCCESS [  0.539 s]
[linux-jdk9] [INFO] supplemental-models ................................ SUCCESS [  0.738 s]
[linux-jdk9] [INFO] deficient-dep ...................................... FAILURE [  0.345 s]
[linux-jdk9] [INFO] ------------------------------------------------------------------------
[linux-jdk9] [INFO] BUILD FAILURE
[linux-jdk9] [INFO] ------------------------------------------------------------------------
[linux-jdk9] [INFO] Total time: 1.826 s
[linux-jdk9] [INFO] Finished at: 2018-03-09T22:46:52Z
[linux-jdk9] [INFO] Final Memory: 14M/52M
[linux-jdk9] [INFO] ------------------------------------------------------------------------
[linux-jdk9] [INFO] [jenkins-event-spy] Generated /home/jenkins/jenkins-slave/workspace/ote-resources-plugin_master-FTEJEAA7J3RSA3RGNRQRTOLNK5IUQ7QP3AJQZXDE4RWB3DK3KFPQ@tmp/withMaven326361b0/maven-spy-20180309-224650-5592166231343142205754.log
[linux-jdk9] [ERROR] Failed to execute goal org.apache.maven.plugins:maven-compiler-plugin:3.1:compile (default-compile) on project deficient-dep: Compilation failure: Compilation failure: 
[linux-jdk9] [ERROR] Source option 1.5 is no longer supported. Use 1.6 or later.
[linux-jdk9] [ERROR] Target option 1.5 is no longer supported. Use 1.6 or later.
[linux-jdk9] [ERROR] -> [Help 1]
[linux-jdk9] org.apache.maven.lifecycle.LifecycleExecutionException: Failed to execute goal org.apache.maven.plugins:maven-compiler-plugin:3.1:compile (default-compile) on project deficient-dep: Compilation failure
[linux-jdk9]     at org.apache.maven.lifecycle.internal.MojoExecutor.execute (MojoExecutor.java:213)
[linux-jdk9]     at org.apache.maven.lifecycle.internal.MojoExecutor.execute (MojoExecutor.java:154)
[linux-jdk9]     at org.apache.maven.lifecycle.internal.MojoExecutor.execute (MojoExecutor.java:146)
[linux-jdk9]     at org.apache.maven.lifecycle.internal.LifecycleModuleBuilder.buildProject (LifecycleModuleBuilder.java:117)
[linux-jdk9]     at org.apache.maven.lifecycle.internal.LifecycleModuleBuilder.buildProject (LifecycleModuleBuilder.java:81)
[linux-jdk9]     at org.apache.maven.lifecycle.internal.builder.singlethreaded.SingleThreadedBuilder.build (SingleThreadedBuilder.java:51)
[linux-jdk9]     at org.apache.maven.lifecycle.internal.LifecycleStarter.execute (LifecycleStarter.java:128)
[linux-jdk9]     at org.apache.maven.DefaultMaven.doExecute (DefaultMaven.java:309)
[linux-jdk9]     at org.apache.maven.DefaultMaven.doExecute (DefaultMaven.java:194)
[linux-jdk9]     at org.apache.maven.DefaultMaven.execute (DefaultMaven.java:107)
[linux-jdk9]     at org.apache.maven.cli.MavenCli.execute (MavenCli.java:955)
[linux-jdk9]     at org.apache.maven.cli.MavenCli.doMain (MavenCli.java:290)
[linux-jdk9]     at org.apache.maven.cli.MavenCli.main (MavenCli.java:194)
[linux-jdk9]     at jdk.internal.reflect.NativeMethodAccessorImpl.invoke0 (Native Method)
[linux-jdk9]     at jdk.internal.reflect.NativeMethodAccessorImpl.invoke (NativeMethodAccessorImpl.java:62)
[linux-jdk9]     at jdk.internal.reflect.DelegatingMethodAccessorImpl.invoke (DelegatingMethodAccessorImpl.java:43)
[linux-jdk9]     at java.lang.reflect.Method.invoke (Method.java:564)
[linux-jdk9]     at org.codehaus.plexus.classworlds.launcher.Launcher.launchEnhanced (Launcher.java:289)
[linux-jdk9]     at org.codehaus.plexus.classworlds.launcher.Launcher.launch (Launcher.java:229)
[linux-jdk9]     at org.codehaus.plexus.classworlds.launcher.Launcher.mainWithExitCode (Launcher.java:415)
[linux-jdk9]     at org.codehaus.plexus.classworlds.launcher.Launcher.main (Launcher.java:356)
[linux-jdk9] Caused by: org.apache.maven.plugin.compiler.CompilationFailureException: Compilation failure
[linux-jdk9]     at org.apache.maven.plugin.compiler.AbstractCompilerMojo.execute (AbstractCompilerMojo.java:858)
[linux-jdk9]     at org.apache.maven.plugin.compiler.CompilerMojo.execute (CompilerMojo.java:129)
[linux-jdk9]     at org.apache.maven.plugin.DefaultBuildPluginManager.executeMojo (DefaultBuildPluginManager.java:134)
[linux-jdk9]     at org.apache.maven.lifecycle.internal.MojoExecutor.execute (MojoExecutor.java:208)
[linux-jdk9]     at org.apache.maven.lifecycle.internal.MojoExecutor.execute (MojoExecutor.java:154)
[linux-jdk9]     at org.apache.maven.lifecycle.internal.MojoExecutor.execute (MojoExecutor.java:146)
[linux-jdk9]     at org.apache.maven.lifecycle.internal.LifecycleModuleBuilder.buildProject (LifecycleModuleBuilder.java:117)
[linux-jdk9]     at org.apache.maven.lifecycle.internal.LifecycleModuleBuilder.buildProject (LifecycleModuleBuilder.java:81)
[linux-jdk9]     at org.apache.maven.lifecycle.internal.builder.singlethreaded.SingleThreadedBuilder.build (SingleThreadedBuilder.java:51)
[linux-jdk9]     at org.apache.maven.lifecycle.internal.LifecycleStarter.execute (LifecycleStarter.java:128)
[linux-jdk9]     at org.apache.maven.DefaultMaven.doExecute (DefaultMaven.java:309)
[linux-jdk9]     at org.apache.maven.DefaultMaven.doExecute (DefaultMaven.java:194)
[linux-jdk9]     at org.apache.maven.DefaultMaven.execute (DefaultMaven.java:107)
[linux-jdk9]     at org.apache.maven.cli.MavenCli.execute (MavenCli.java:955)
[linux-jdk9]     at org.apache.maven.cli.MavenCli.doMain (MavenCli.java:290)
[linux-jdk9]     at org.apache.maven.cli.MavenCli.main (MavenCli.java:194)
[linux-jdk9]     at jdk.internal.reflect.NativeMethodAccessorImpl.invoke0 (Native Method)
[linux-jdk9]     at jdk.internal.reflect.NativeMethodAccessorImpl.invoke (NativeMethodAccessorImpl.java:62)
[linux-jdk9]     at jdk.internal.reflect.DelegatingMethodAccessorImpl.invoke (DelegatingMethodAccessorImpl.java:43)
[linux-jdk9]     at java.lang.reflect.Method.invoke (Method.java:564)
[linux-jdk9]     at org.codehaus.plexus.classworlds.launcher.Launcher.launchEnhanced (Launcher.java:289)
[linux-jdk9]     at org.codehaus.plexus.classworlds.launcher.Launcher.launch (Launcher.java:229)
[linux-jdk9]     at org.codehaus.plexus.classworlds.launcher.Launcher.mainWithExitCode (Launcher.java:415)
[linux-jdk9]     at org.codehaus.plexus.classworlds.launcher.Launcher.main (Launcher.java:356)
[linux-jdk9] [ERROR] 
[linux-jdk9] [ERROR] Re-run Maven using the -X switch to enable full debug logging.
[linux-jdk9] [ERROR] 
[linux-jdk9] [ERROR] For more information about the errors and possible solutions, please read the following articles:
[linux-jdk9] [ERROR] [Help 1] http://cwiki.apache.org/confluence/display/MAVEN/MojoFailureException
[linux-jdk9] [ERROR] 
[linux-jdk9] [ERROR] After correcting the problems, you can resume the build with the command
[linux-jdk9] [ERROR]   mvn <goals> -rf :deficient-dep
[linux-jdk9] 
[linux-jdk9] 	at org.apache.maven.plugin.resources.remote.it.IT_SupplementalArtifact.test(IT_SupplementalArtifact.java:50)
[linux-jdk9] 
[linux-jdk9] Running org.apache.maven.plugin.resources.remote.it.IT_GenerateFromOverride
[linux-jdk9] Tests run: 1, Failures: 0, Errors: 0, Skipped: 0, Time elapsed: 3.931 sec - in org.apache.maven.plugin.resources.remote.it.IT_GenerateFromOverride
[linux-jdk9] Running org.apache.maven.plugin.resources.remote.it.IT_RunOnlyAtExecutionRoot
[linux-jdk9] Tests run: 1, Failures: 0, Errors: 0, Skipped: 0, Time elapsed: 6.398 sec - in org.apache.maven.plugin.resources.remote.it.IT_RunOnlyAtExecutionRoot
[linux-jdk9] Running org.apache.maven.plugin.resources.remote.it.IT_GenerateFromBundle
[linux-jdk9] Tests run: 1, Failures: 0, Errors: 0, Skipped: 0, Time elapsed: 2.888 sec - in org.apache.maven.plugin.resources.remote.it.IT_GenerateFromBundle
[linux-jdk9] Running org.apache.maven.plugin.resources.remote.it.IT_GenerateFromBundleWithTypeAndClassifier
[linux-jdk9] Tests run: 1, Failures: 0, Errors: 0, Skipped: 0, Time elapsed: 3.005 sec - in org.apache.maven.plugin.resources.remote.it.IT_GenerateFromBundleWithTypeAndClassifier
[linux-jdk9] Running org.apache.maven.plugin.resources.remote.it.IT_GetDependencyProjects
[linux-jdk9] Tests run: 1, Failures: 0, Errors: 0, Skipped: 0, Time elapsed: 6.643 sec - in org.apache.maven.plugin.resources.remote.it.IT_GetDependencyProjects
[linux-jdk9] Running org.apache.maven.plugin.resources.remote.it.IT_CustomFilterDelimiter
[linux-jdk9] Tests run: 1, Failures: 0, Errors: 0, Skipped: 0, Time elapsed: 2.698 sec - in org.apache.maven.plugin.resources.remote.it.IT_CustomFilterDelimiter
[linux-jdk9] Running org.apache.maven.plugin.resources.remote.it.IT_FilterLocalOverride
[linux-jdk9] Tests run: 1, Failures: 0, Errors: 0, Skipped: 0, Time elapsed: 2.782 sec - in org.apache.maven.plugin.resources.remote.it.IT_FilterLocalOverride
[linux-jdk9] Running org.apache.maven.plugin.resources.remote.it.IT_BadDependencyPoms
[linux-jdk9] Tests run: 1, Failures: 0, Errors: 0, Skipped: 0, Time elapsed: 3.767 sec - in org.apache.maven.plugin.resources.remote.it.IT_BadDependencyPoms
[linux-jdk9] 
[linux-jdk9] Results :
[linux-jdk9] 
[linux-jdk9] Tests in error: 
[linux-jdk9]   IT_SupplementalArtifact.test:50 � Verification Exit code was non-zero: 1; comm...
[linux-jdk9] 
[linux-jdk9] Tests run: 9, Failures: 0, Errors: 1, Skipped: 0
[linux-jdk9] 
[linux-jdk9] [INFO] 
[linux-jdk9] [INFO] --- maven-invoker-plugin:2.0.0:integration-test (integration-test) @ maven-remote-resources-plugin ---
[linux-jdk9] [INFO] Building: maven-remote-resources-test/pom.xml
[linux-jdk9] [INFO] ..SUCCESS (6.8 s)
[linux-jdk9] [INFO] 
[linux-jdk9] [INFO] --- maven-checkstyle-plugin:2.15:check (checkstyle-check) @ maven-remote-resources-plugin ---
[linux-jdk9] [INFO] 
[linux-jdk9] [INFO] --- maven-failsafe-plugin:2.19.1:verify (integration-tests) @ maven-remote-resources-plugin ---
[linux-jdk9] [ERROR] There are test failures.
[linux-jdk9] 
[linux-jdk9] Please refer to /home/jenkins/jenkins-slave/workspace/ote-resources-plugin_master-FTEJEAA7J3RSA3RGNRQRTOLNK5IUQ7QP3AJQZXDE4RWB3DK3KFPQ/m/target/failsafe-reports for the individual test results.
[linux-jdk9] [INFO] 
[linux-jdk9] [INFO] --- maven-invoker-plugin:2.0.0:verify (integration-test) @ maven-remote-resources-plugin ---
[linux-jdk9] [INFO] -------------------------------------------------
[linux-jdk9] [INFO] Build Summary:
[linux-jdk9] [INFO]   Passed: 1, Failed: 0, Errors: 0, Skipped: 0
[linux-jdk9] [INFO] -------------------------------------------------
[linux-jdk9] [INFO] ------------------------------------------------------------------------
[linux-jdk9] [INFO] BUILD SUCCESS
[linux-jdk9] [INFO] ------------------------------------------------------------------------
[linux-jdk9] [INFO] Total time: 01:05 min
[linux-jdk9] [INFO] Finished at: 2018-03-09T22:47:33Z
[linux-jdk9] [INFO] Final Memory: 42M/140M
[linux-jdk9] [INFO] ------------------------------------------------------------------------
[linux-jdk9] [INFO] [jenkins-event-spy] Generated /home/jenkins/jenkins-slave/workspace/ote-resources-plugin_master-FTEJEAA7J3RSA3RGNRQRTOLNK5IUQ7QP3AJQZXDE4RWB3DK3KFPQ@tmp/withMaven326361b0/maven-spy-20180309-224627-40110998968870926429269.log
[Pipeline] [linux-jdk9] }
[Pipeline] [linux-jdk9] // dir
[Pipeline] [linux-jdk9] }
[linux-jdk9] [withMaven] junitPublisher - Archive test results for Maven artifact org.apache.maven.plugins:maven-remote-resources-plugin:1.6-SNAPSHOT generated by maven-surefire-plugin:test (default-test): m/target/surefire-reports/*.xml
[linux-jdk9] [withMaven] junitPublisher - Jenkins JUnit Attachments Plugin not found, can't publish test attachments.Recording test results
[linux-jdk9] [withMaven] junitPublisher - Archive test results for Maven artifact org.apache.maven.plugins:maven-remote-resources-plugin:1.6-SNAPSHOT generated by maven-failsafe-plugin:integration-test (integration-tests): m/target/failsafe-reports/*.xml
[linux-jdk9] [withMaven] junitPublisher - Jenkins JUnit Attachments Plugin not found, can't publish test attachments.Recording test results
[linux-jdk9] [withMaven] junitPublisher - Archive test results for Maven artifact org.apache.maven.plugin.rresource.it:resource-bundle-with-template:1.6-SNAPSHOT generated by maven-surefire-plugin:test (default-test): m/target/test-classes/bootstrap/resource-bundle-with-template/target/surefire-reports/*.xml
[linux-jdk9] [withMaven] junitPublisher - Jenkins JUnit Attachments Plugin not found, can't publish test attachments.Recording test results
[linux-jdk9] None of the test reports contained any result
[linux-jdk9] [withMaven] junitPublisher - Archive test results for Maven artifact org.apache.maven.plugin.rresource.it:resource-bundle-with-org-processing:1.6-SNAPSHOT generated by maven-surefire-plugin:test (default-test): m/target/test-classes/bootstrap/resource-bundle-with-org-processing/target/surefire-reports/*.xml
[linux-jdk9] [withMaven] junitPublisher - Jenkins JUnit Attachments Plugin not found, can't publish test attachments.Recording test results
[linux-jdk9] None of the test reports contained any result
[linux-jdk9] [withMaven] junitPublisher - Archive test results for Maven artifact org.apache.maven.plugin.rresource.it:resource-bundle-with-type-and-classifier:1.6-SNAPSHOT generated by maven-surefire-plugin:test (default-test): m/target/test-classes/bootstrap/resource-bundle-with-type-and-classifier/target/surefire-reports/*.xml
[linux-jdk9] [withMaven] junitPublisher - Jenkins JUnit Attachments Plugin not found, can't publish test attachments.Recording test results
[linux-jdk9] None of the test reports contained any result
[linux-jdk9] [withMaven] junitPublisher - Archive test results for Maven artifact org.apache.maven.plugin.rresource.it.mrr43:supplemental-models:1 generated by maven-surefire-plugin:test (default-test): m/target/test-classes/supplemental-artifact/resource-projects/supplemental-models/target/surefire-reports/*.xml
[linux-jdk9] [withMaven] junitPublisher - Jenkins JUnit Attachments Plugin not found, can't publish test attachments.Recording test results
[linux-jdk9] None of the test reports contained any result
[linux-jdk9] [withMaven] junitPublisher - Archive test results for Maven artifact org.apache.maven.plugin.rresource.it.mrr41:release:1.0 generated by maven-surefire-plugin:test (default-test): m/target/test-classes/run-only-at-execution-root/resource-projects/release/target/surefire-reports/*.xml
[linux-jdk9] [withMaven] junitPublisher - Jenkins JUnit Attachments Plugin not found, can't publish test attachments.Recording test results
[linux-jdk9] None of the test reports contained any result
[linux-jdk9] [withMaven] junitPublisher - Archive test results for Maven artifact org.apache.maven.plugin.rresource.it.mrr41:snapshot:1.0-SNAPSHOT generated by maven-surefire-plugin:test (default-test): m/target/test-classes/run-only-at-execution-root/resource-projects/snapshot/target/surefire-reports/*.xml
[linux-jdk9] [withMaven] junitPublisher - Jenkins JUnit Attachments Plugin not found, can't publish test attachments.Recording test results
[linux-jdk9] None of the test reports contained any result
[linux-jdk9] [withMaven] junitPublisher - Archive test results for Maven artifact org.apache.maven.plugin.rresource.it.gdp:release:1.0 generated by maven-surefire-plugin:test (default-test): m/target/test-classes/get-dependency-projects/release/target/surefire-reports/*.xml
[linux-jdk9] [withMaven] junitPublisher - Jenkins JUnit Attachments Plugin not found, can't publish test attachments.Recording test results
[linux-jdk9] None of the test reports contained any result
[linux-jdk9] [withMaven] junitPublisher - Archive test results for Maven artifact org.apache.maven.plugin.rresource.it.gdp:snapshot:1.0-SNAPSHOT generated by maven-surefire-plugin:test (default-test): m/target/test-classes/get-dependency-projects/snapshot/target/surefire-reports/*.xml
[linux-jdk9] [withMaven] junitPublisher - Jenkins JUnit Attachments Plugin not found, can't publish test attachments.Recording test results
[linux-jdk9] None of the test reports contained any result
[linux-jdk9] [withMaven] junitPublisher - Archive test results for Maven artifact org.apache.maven:maven-remote-resources-test:1.0-SNAPSHOT generated by maven-surefire-plugin:test (default-test): m/target/it/maven-remote-resources-test/target/surefire-reports/*.xml
[linux-jdk9] [withMaven] junitPublisher - Jenkins JUnit Attachments Plugin not found, can't publish test attachments.Recording test results
[linux-jdk9] None of the test reports contained any result
[Pipeline] [linux-jdk9] // withMaven
[Pipeline] [linux-jdk9] }
[Pipeline] [linux-jdk9] // stage
[Pipeline] [linux-jdk9] }
[Pipeline] [linux-jdk9] // node
[Pipeline] [linux-jdk9] }
[Pipeline] // parallel
[Pipeline] stage
[Pipeline] { (Notifications)
[Pipeline] echo
Build result: UNSTABLE
[Pipeline] jiraIssueSelector
[Pipeline] emailext
Mime
  • Unnamed multipart/mixed (inline, None, 0 bytes)
View raw message