maven-notifications mailing list archives

Site index · List index
Message view « Date » · « Thread »
Top « Date » · « Thread »
From Apache Jenkins Server <jenk...@builds.apache.org>
Subject Build unstable in Jenkins: Maven TLP » maven-release » master #36
Date Sun, 04 Mar 2018 19:27:59 GMT
See https://builds.apache.org/job/maven-box/job/maven-release/job/master/36/

Changes:

* Pull up commonBasedir
* Move AbstractReleasePhase to maven-release-api
* releaseDescriptor.getOriginalScmInfo( projectId ) is checked twice, so 1
* Switch to Paths, which are more reliable and powerful compared to Files
* More Path replacements
* Pull up commonBasedir
* Move AbstractReleasePhase to maven-release-api
* releaseDescriptor.getOriginalScmInfo( projectId ) is checked twice, so 1
* Switch to Paths, which are more reliable and powerful compared to Files
* More Path replacements
* Pull up commonBasedir
* Move AbstractReleasePhase to maven-release-api
* releaseDescriptor.getOriginalScmInfo( projectId ) is checked twice, so 1
* Switch to Paths, which are more reliable and powerful compared to Files
* More Path replacements
* Pull up commonBasedir
* Move AbstractReleasePhase to maven-release-api
* releaseDescriptor.getOriginalScmInfo( projectId ) is checked twice, so 1
* Switch to Paths, which are more reliable and powerful compared to Files
* More Path replacements
* Pull up commonBasedir
* Move AbstractReleasePhase to maven-release-api
* releaseDescriptor.getOriginalScmInfo( projectId ) is checked twice, so 1
* Switch to Paths, which are more reliable and powerful compared to Files
* More Path replacements
* Pull up commonBasedir
* Move AbstractReleasePhase to maven-release-api
* releaseDescriptor.getOriginalScmInfo( projectId ) is checked twice, so 1
* Switch to Paths, which are more reliable and powerful compared to Files
* More Path replacements

12 tests failed.
FAILED:  org.apache.maven.shared.release.util.ReleaseUtilTest.testGetCommonBasedirOfRegularMultiModuleWindowsPath

Error Message:
null

Stack Trace:
java.lang.NullPointerException
	at org.apache.maven.shared.release.util.ReleaseUtilTest.testGetCommonBasedirOfRegularMultiModuleWindowsPath(ReleaseUtilTest.java:148)


FAILED:  org.apache.maven.shared.release.util.ReleaseUtilTest.testGetCommonBasedirUppercaseLowerCaseWindows

Error Message:
null

Stack Trace:
java.lang.NullPointerException
	at org.apache.maven.shared.release.util.ReleaseUtilTest.testGetCommonBasedirUppercaseLowerCaseWindows(ReleaseUtilTest.java:93)


FAILED:  org.apache.maven.shared.release.util.ReleaseUtilTest.testGetCommonBasedirOfFlatMultiModuleSimilarArtifactIdsWindows

Error Message:
null

Stack Trace:
java.lang.NullPointerException
	at org.apache.maven.shared.release.util.ReleaseUtilTest.testGetCommonBasedirOfFlatMultiModuleSimilarArtifactIdsWindows(ReleaseUtilTest.java:115)


FAILED:  org.apache.maven.shared.release.util.ReleaseUtilTest.testGetCommonBasedirOfFlatMultiModuleWindows

Error Message:
null

Stack Trace:
java.lang.NullPointerException
	at org.apache.maven.shared.release.util.ReleaseUtilTest.testGetCommonBasedirOfFlatMultiModuleWindows(ReleaseUtilTest.java:82)


FAILED:  org.apache.maven.shared.release.util.ReleaseUtilTest.testGetCommonBasedirOfRegularMultiModuleWindowsPath

Error Message:
null

Stack Trace:
java.lang.NullPointerException
	at org.apache.maven.shared.release.util.ReleaseUtilTest.testGetCommonBasedirOfRegularMultiModuleWindowsPath(ReleaseUtilTest.java:147)


FAILED:  org.apache.maven.shared.release.util.ReleaseUtilTest.testGetCommonBasedirUppercaseLowerCaseWindows

Error Message:
null

Stack Trace:
java.lang.NullPointerException
	at org.apache.maven.shared.release.util.ReleaseUtilTest.testGetCommonBasedirUppercaseLowerCaseWindows(ReleaseUtilTest.java:92)


FAILED:  org.apache.maven.shared.release.util.ReleaseUtilTest.testGetCommonBasedirOfFlatMultiModuleSimilarArtifactIdsWindows

Error Message:
null

Stack Trace:
java.lang.NullPointerException
	at org.apache.maven.shared.release.util.ReleaseUtilTest.testGetCommonBasedirOfFlatMultiModuleSimilarArtifactIdsWindows(ReleaseUtilTest.java:114)


FAILED:  org.apache.maven.shared.release.util.ReleaseUtilTest.testGetCommonBasedirOfFlatMultiModuleWindows

Error Message:
null

Stack Trace:
java.lang.NullPointerException
	at org.apache.maven.shared.release.util.ReleaseUtilTest.testGetCommonBasedirOfFlatMultiModuleWindows(ReleaseUtilTest.java:81)


FAILED:  org.apache.maven.shared.release.util.ReleaseUtilTest.testGetCommonBasedirOfRegularMultiModuleWindowsPath

Error Message:
null

Stack Trace:
java.lang.NullPointerException
	at org.apache.maven.shared.release.util.ReleaseUtilTest.testGetCommonBasedirOfRegularMultiModuleWindowsPath(ReleaseUtilTest.java:148)


FAILED:  org.apache.maven.shared.release.util.ReleaseUtilTest.testGetCommonBasedirUppercaseLowerCaseWindows

Error Message:
null

Stack Trace:
java.lang.NullPointerException
	at org.apache.maven.shared.release.util.ReleaseUtilTest.testGetCommonBasedirUppercaseLowerCaseWindows(ReleaseUtilTest.java:93)


FAILED:  org.apache.maven.shared.release.util.ReleaseUtilTest.testGetCommonBasedirOfFlatMultiModuleSimilarArtifactIdsWindows

Error Message:
null

Stack Trace:
java.lang.NullPointerException
	at org.apache.maven.shared.release.util.ReleaseUtilTest.testGetCommonBasedirOfFlatMultiModuleSimilarArtifactIdsWindows(ReleaseUtilTest.java:115)


FAILED:  org.apache.maven.shared.release.util.ReleaseUtilTest.testGetCommonBasedirOfFlatMultiModuleWindows

Error Message:
null

Stack Trace:
java.lang.NullPointerException
	at org.apache.maven.shared.release.util.ReleaseUtilTest.testGetCommonBasedirOfFlatMultiModuleWindows(ReleaseUtilTest.java:82)




Build log:
[...truncated 2.79 MB...]
[windows-jdk7] [INFO] ..SUCCESS (6.3 s)
[windows-jdk7] [INFO] Building: projects\update-versions\MRELEASE-976\pom.xml
[windows-jdk7] [INFO] run script verify.groovy
[windows-jdk7] [INFO] ..SUCCESS (6.2 s)
[windows-jdk7] [INFO] -------------------------------------------------
[windows-jdk7] [INFO] Build Summary:
[windows-jdk7] [INFO]   Passed: 4, Failed: 0, Errors: 0, Skipped: 0
[windows-jdk7] [INFO] -------------------------------------------------
[windows-jdk7] [INFO] 
[windows-jdk7] [INFO] --- maven-checkstyle-plugin:2.15:check (checkstyle-check) @ maven-release-plugin
---
[windows-jdk7] [INFO] 
[windows-jdk7] [INFO] ------------------------------------------------------------------------
[windows-jdk7] [INFO] Building Maven Release Odd-Even Policy 3.0.0-SNAPSHOT
[windows-jdk7] [INFO] ------------------------------------------------------------------------
[windows-jdk7] [INFO] 
[windows-jdk7] [INFO] --- maven-clean-plugin:2.5:clean (default-clean) @ maven-release-oddeven-policy
---
[windows-jdk7] [INFO] 
[windows-jdk7] [INFO] --- maven-enforcer-plugin:1.3.1:enforce (enforce-bytecode-version) @
maven-release-oddeven-policy ---
[windows-jdk7] [INFO] 
[windows-jdk7] [INFO] --- maven-enforcer-plugin:1.3.1:enforce (ban-known-bad-maven-versions)
@ maven-release-oddeven-policy ---
[windows-jdk7] [INFO] 
[windows-jdk7] [INFO] --- apache-rat-plugin:0.11:check (rat-check) @ maven-release-oddeven-policy
---
[windows-jdk7] [INFO] 51 implicit excludes (use -debug for more details).
[windows-jdk7] [INFO] Exclude: .repository
[windows-jdk7] [INFO] Exclude: Jenkinsfile
[windows-jdk7] [INFO] Exclude: DEPENDENCIES
[windows-jdk7] [INFO] 4 resources included (use -debug for more details)
[windows-jdk7] [INFO] Rat check: Summary of files. Unapproved: 0 unknown: 0 generated: 0 approved:
4 licence.
[windows-jdk7] [INFO] 
[windows-jdk7] [INFO] --- maven-remote-resources-plugin:1.5:process (default) @ maven-release-oddeven-policy
---
[windows-jdk7] [INFO] 
[windows-jdk7] [INFO] --- maven-resources-plugin:2.7:resources (default-resources) @ maven-release-oddeven-policy
---
[windows-jdk7] [INFO] Using 'UTF-8' encoding to copy filtered resources.
[windows-jdk7] [INFO] skip non existing resourceDirectory F:\jenkins\jenkins-slave\workspace\en-box_maven-release_master-OCKGULQBCZ67VBKJ7HF6E7KZUCKX7ZC6FX64GH66OHP7A4VAQBIQ\m\maven-release-policies\maven-release-oddeven-policy\src\main\resources
[windows-jdk7] [INFO] Copying 3 resources
[windows-jdk7] [INFO] 
[windows-jdk7] [INFO] --- maven-compiler-plugin:3.2:compile (default-compile) @ maven-release-oddeven-policy
---
[windows-jdk7] [INFO] Changes detected - recompiling the module!
[windows-jdk7] [INFO] Compiling 2 source files to F:\jenkins\jenkins-slave\workspace\en-box_maven-release_master-OCKGULQBCZ67VBKJ7HF6E7KZUCKX7ZC6FX64GH66OHP7A4VAQBIQ\m\maven-release-policies\maven-release-oddeven-policy\target\classes
[windows-jdk7] [INFO] 
[windows-jdk7] [INFO] --- plexus-component-metadata:1.7.1:generate-metadata (process-classes)
@ maven-release-oddeven-policy ---
[windows-jdk7] [INFO] Discovered 1 component descriptors(s)
[windows-jdk7] [INFO] 
[windows-jdk7] [INFO] --- maven-resources-plugin:2.7:testResources (default-testResources)
@ maven-release-oddeven-policy ---
[windows-jdk7] [INFO] Using 'UTF-8' encoding to copy filtered resources.
[windows-jdk7] [INFO] skip non existing resourceDirectory F:\jenkins\jenkins-slave\workspace\en-box_maven-release_master-OCKGULQBCZ67VBKJ7HF6E7KZUCKX7ZC6FX64GH66OHP7A4VAQBIQ\m\maven-release-policies\maven-release-oddeven-policy\src\test\resources
[windows-jdk7] [INFO] Copying 3 resources
[windows-jdk7] [INFO] 
[windows-jdk7] [INFO] --- maven-compiler-plugin:3.2:testCompile (default-testCompile) @ maven-release-oddeven-policy
---
[windows-jdk7] [INFO] Changes detected - recompiling the module!
[windows-jdk7] [INFO] Compiling 1 source file to F:\jenkins\jenkins-slave\workspace\en-box_maven-release_master-OCKGULQBCZ67VBKJ7HF6E7KZUCKX7ZC6FX64GH66OHP7A4VAQBIQ\m\maven-release-policies\maven-release-oddeven-policy\target\test-classes
[windows-jdk7] [INFO] 
[windows-jdk7] [INFO] --- maven-surefire-plugin:2.20.1:test (default-test) @ maven-release-oddeven-policy
---
[windows-jdk7] [INFO] 
[windows-jdk7] [INFO] -------------------------------------------------------
[windows-jdk7] [INFO]  T E S T S
[windows-jdk7] [INFO] -------------------------------------------------------
[windows-jdk7] [INFO] Running org.apache.maven.shared.release.policy.oddeven.OddEvenVersionPolicyTestCase
[windows-jdk7] [INFO] Tests run: 3, Failures: 0, Errors: 0, Skipped: 0, Time elapsed: 0.144
s - in org.apache.maven.shared.release.policy.oddeven.OddEvenVersionPolicyTestCase
[windows-jdk7] [INFO] 
[windows-jdk7] [INFO] Results:
[windows-jdk7] [INFO] 
[windows-jdk7] [INFO] Tests run: 3, Failures: 0, Errors: 0, Skipped: 0
[windows-jdk7] [INFO] 
[windows-jdk7] [INFO] 
[windows-jdk7] [INFO] --- maven-jar-plugin:2.5:jar (default-jar) @ maven-release-oddeven-policy
---
[windows-jdk7] [INFO] Building jar: F:\jenkins\jenkins-slave\workspace\en-box_maven-release_master-OCKGULQBCZ67VBKJ7HF6E7KZUCKX7ZC6FX64GH66OHP7A4VAQBIQ\m\maven-release-policies\maven-release-oddeven-policy\target\maven-release-oddeven-policy-3.0.0-SNAPSHOT.jar
[windows-jdk7] [INFO] 
[windows-jdk7] [INFO] --- maven-site-plugin:3.4:attach-descriptor (attach-descriptor) @ maven-release-oddeven-policy
---
[windows-jdk7] [INFO] 
[windows-jdk7] [INFO] --- maven-checkstyle-plugin:2.15:check (checkstyle-check) @ maven-release-oddeven-policy
---
[windows-jdk7] [INFO] 
[windows-jdk7] [INFO] ------------------------------------------------------------------------
[windows-jdk7] [INFO] Building Maven Release SemVer Policy 3.0.0-SNAPSHOT
[windows-jdk7] [INFO] ------------------------------------------------------------------------
[windows-jdk7] [INFO] Downloading: https://repo.maven.apache.org/maven2/org/semver/api/0.9.33/api-0.9.33.pom
[windows-jdk7] [INFO] Downloaded: https://repo.maven.apache.org/maven2/org/semver/api/0.9.33/api-0.9.33.pom
(2.8 kB at 258 kB/s)
[windows-jdk7] [INFO] Downloading: https://repo.maven.apache.org/maven2/org/semver/parent/0.9.33/parent-0.9.33.pom
[windows-jdk7] [INFO] Downloaded: https://repo.maven.apache.org/maven2/org/semver/parent/0.9.33/parent-0.9.33.pom
(1.3 kB at 180 kB/s)
[windows-jdk7] [INFO] Downloading: https://repo.maven.apache.org/maven2/com/github/jeluard/oss-parent/9/oss-parent-9.pom
[windows-jdk7] [INFO] Downloaded: https://repo.maven.apache.org/maven2/com/github/jeluard/oss-parent/9/oss-parent-9.pom
(12 kB at 1.1 MB/s)
[windows-jdk7] [INFO] Downloading: https://repo.maven.apache.org/maven2/com/google/code/findbugs/jsr305/2.0.0/jsr305-2.0.0.pom
[windows-jdk7] [INFO] Downloaded: https://repo.maven.apache.org/maven2/com/google/code/findbugs/jsr305/2.0.0/jsr305-2.0.0.pom
(965 B at 96 kB/s)
[windows-jdk7] [INFO] Downloading: https://repo.maven.apache.org/maven2/org/ow2/asm/asm/5.0.3/asm-5.0.3.pom
[windows-jdk7] [INFO] Downloaded: https://repo.maven.apache.org/maven2/org/ow2/asm/asm/5.0.3/asm-5.0.3.pom
(1.9 kB at 215 kB/s)
[windows-jdk7] [INFO] Downloading: https://repo.maven.apache.org/maven2/org/ow2/asm/asm-parent/5.0.3/asm-parent-5.0.3.pom
[windows-jdk7] [INFO] Downloaded: https://repo.maven.apache.org/maven2/org/ow2/asm/asm-parent/5.0.3/asm-parent-5.0.3.pom
(5.5 kB at 500 kB/s)
[windows-jdk7] [INFO] Downloading: https://repo.maven.apache.org/maven2/org/ow2/asm/asm-commons/5.0.3/asm-commons-5.0.3.pom
[windows-jdk7] [INFO] Downloaded: https://repo.maven.apache.org/maven2/org/ow2/asm/asm-commons/5.0.3/asm-commons-5.0.3.pom
(2.1 kB at 209 kB/s)
[windows-jdk7] [INFO] Downloading: https://repo.maven.apache.org/maven2/org/ow2/asm/asm-tree/5.0.3/asm-tree-5.0.3.pom
[windows-jdk7] [INFO] Downloaded: https://repo.maven.apache.org/maven2/org/ow2/asm/asm-tree/5.0.3/asm-tree-5.0.3.pom
(2.1 kB at 298 kB/s)
[windows-jdk7] [INFO] Downloading: https://repo.maven.apache.org/maven2/commons-lang/commons-lang/1.0/commons-lang-1.0.pom
[windows-jdk7] [INFO] Downloaded: https://repo.maven.apache.org/maven2/commons-lang/commons-lang/1.0/commons-lang-1.0.pom
(2.5 kB at 351 kB/s)
[windows-jdk7] [INFO] Downloading: https://repo.maven.apache.org/maven2/de/tototec/de.tototec.cmdoption/0.2.0/de.tototec.cmdoption-0.2.0.pom
[windows-jdk7] [INFO] Downloaded: https://repo.maven.apache.org/maven2/de/tototec/de.tototec.cmdoption/0.2.0/de.tototec.cmdoption-0.2.0.pom
(956 B at 120 kB/s)
[windows-jdk7] [INFO] Downloading: https://repo.maven.apache.org/maven2/org/semver/api/0.9.33/api-0.9.33.jar
[windows-jdk7] [INFO] Downloading: https://repo.maven.apache.org/maven2/com/google/code/findbugs/jsr305/2.0.0/jsr305-2.0.0.jar
[windows-jdk7] [INFO] Downloading: https://repo.maven.apache.org/maven2/org/ow2/asm/asm-tree/5.0.3/asm-tree-5.0.3.jar
[windows-jdk7] [INFO] Downloading: https://repo.maven.apache.org/maven2/org/ow2/asm/asm/5.0.3/asm-5.0.3.jar
[windows-jdk7] [INFO] Downloading: https://repo.maven.apache.org/maven2/org/ow2/asm/asm-commons/5.0.3/asm-commons-5.0.3.jar
[windows-jdk7] [INFO] Downloaded: https://repo.maven.apache.org/maven2/org/ow2/asm/asm-tree/5.0.3/asm-tree-5.0.3.jar
(29 kB at 1.5 MB/s)
[windows-jdk7] [INFO] Downloading: https://repo.maven.apache.org/maven2/commons-lang/commons-lang/1.0/commons-lang-1.0.jar
[windows-jdk7] [INFO] Downloaded: https://repo.maven.apache.org/maven2/org/ow2/asm/asm-commons/5.0.3/asm-commons-5.0.3.jar
(42 kB at 1.8 MB/s)
[windows-jdk7] [INFO] Downloading: https://repo.maven.apache.org/maven2/de/tototec/de.tototec.cmdoption/0.2.0/de.tototec.cmdoption-0.2.0.jar
[windows-jdk7] [INFO] Downloaded: https://repo.maven.apache.org/maven2/com/google/code/findbugs/jsr305/2.0.0/jsr305-2.0.0.jar
(32 kB at 1.3 MB/s)
[windows-jdk7] [INFO] Downloaded: https://repo.maven.apache.org/maven2/org/semver/api/0.9.33/api-0.9.33.jar
(64 kB at 2.7 MB/s)
[windows-jdk7] [INFO] Downloaded: https://repo.maven.apache.org/maven2/org/ow2/asm/asm/5.0.3/asm-5.0.3.jar
(53 kB at 2.1 MB/s)
[windows-jdk7] [INFO] Downloaded: https://repo.maven.apache.org/maven2/de/tototec/de.tototec.cmdoption/0.2.0/de.tototec.cmdoption-0.2.0.jar
(42 kB at 1.2 MB/s)
[windows-jdk7] [INFO] Downloaded: https://repo.maven.apache.org/maven2/commons-lang/commons-lang/1.0/commons-lang-1.0.jar
(64 kB at 1.8 MB/s)
[windows-jdk7] [INFO] 
[windows-jdk7] [INFO] --- maven-clean-plugin:2.5:clean (default-clean) @ maven-release-semver-policy
---
[windows-jdk7] [INFO] 
[windows-jdk7] [INFO] --- maven-enforcer-plugin:1.3.1:enforce (enforce-bytecode-version) @
maven-release-semver-policy ---
[windows-jdk7] [INFO] 
[windows-jdk7] [INFO] --- maven-enforcer-plugin:1.3.1:enforce (ban-known-bad-maven-versions)
@ maven-release-semver-policy ---
[windows-jdk7] [INFO] 
[windows-jdk7] [INFO] --- apache-rat-plugin:0.11:check (rat-check) @ maven-release-semver-policy
---
[windows-jdk7] [INFO] 51 implicit excludes (use -debug for more details).
[windows-jdk7] [INFO] Exclude: .repository
[windows-jdk7] [INFO] Exclude: Jenkinsfile
[windows-jdk7] [INFO] Exclude: DEPENDENCIES
[windows-jdk7] [INFO] 3 resources included (use -debug for more details)
[windows-jdk7] [INFO] Rat check: Summary of files. Unapproved: 0 unknown: 0 generated: 0 approved:
3 licence.
[windows-jdk7] [INFO] 
[windows-jdk7] [INFO] --- maven-remote-resources-plugin:1.5:process (default) @ maven-release-semver-policy
---
[windows-jdk7] [INFO] 
[windows-jdk7] [INFO] --- maven-resources-plugin:2.7:resources (default-resources) @ maven-release-semver-policy
---
[windows-jdk7] [INFO] Using 'UTF-8' encoding to copy filtered resources.
[windows-jdk7] [INFO] skip non existing resourceDirectory F:\jenkins\jenkins-slave\workspace\en-box_maven-release_master-OCKGULQBCZ67VBKJ7HF6E7KZUCKX7ZC6FX64GH66OHP7A4VAQBIQ\m\maven-release-policies\maven-release-semver-policy\src\main\resources
[windows-jdk7] [INFO] Copying 3 resources
[windows-jdk7] [INFO] 
[windows-jdk7] [INFO] --- maven-compiler-plugin:3.2:compile (default-compile) @ maven-release-semver-policy
---
[windows-jdk7] [INFO] Changes detected - recompiling the module!
[windows-jdk7] [INFO] Compiling 1 source file to F:\jenkins\jenkins-slave\workspace\en-box_maven-release_master-OCKGULQBCZ67VBKJ7HF6E7KZUCKX7ZC6FX64GH66OHP7A4VAQBIQ\m\maven-release-policies\maven-release-semver-policy\target\classes
[windows-jdk7] [INFO] 
[windows-jdk7] [INFO] --- plexus-component-metadata:1.7.1:generate-metadata (process-classes)
@ maven-release-semver-policy ---
[windows-jdk7] [INFO] Discovered 1 component descriptors(s)
[windows-jdk7] [INFO] 
[windows-jdk7] [INFO] --- maven-resources-plugin:2.7:testResources (default-testResources)
@ maven-release-semver-policy ---
[windows-jdk7] [INFO] Using 'UTF-8' encoding to copy filtered resources.
[windows-jdk7] [INFO] skip non existing resourceDirectory F:\jenkins\jenkins-slave\workspace\en-box_maven-release_master-OCKGULQBCZ67VBKJ7HF6E7KZUCKX7ZC6FX64GH66OHP7A4VAQBIQ\m\maven-release-policies\maven-release-semver-policy\src\test\resources
[windows-jdk7] [INFO] Copying 3 resources
[windows-jdk7] [INFO] 
[windows-jdk7] [INFO] --- maven-compiler-plugin:3.2:testCompile (default-testCompile) @ maven-release-semver-policy
---
[windows-jdk7] [INFO] Changes detected - recompiling the module!
[windows-jdk7] [INFO] Compiling 1 source file to F:\jenkins\jenkins-slave\workspace\en-box_maven-release_master-OCKGULQBCZ67VBKJ7HF6E7KZUCKX7ZC6FX64GH66OHP7A4VAQBIQ\m\maven-release-policies\maven-release-semver-policy\target\test-classes
[windows-jdk7] [INFO] 
[windows-jdk7] [INFO] --- maven-surefire-plugin:2.20.1:test (default-test) @ maven-release-semver-policy
---
[windows-jdk7] [INFO] 
[windows-jdk7] [INFO] -------------------------------------------------------
[windows-jdk7] [INFO]  T E S T S
[windows-jdk7] [INFO] -------------------------------------------------------
[windows-jdk7] [INFO] Running org.apache.maven.shared.release.policy.semver.SemVerVersionPolicyTest
[windows-jdk7] [INFO] Tests run: 2, Failures: 0, Errors: 0, Skipped: 0, Time elapsed: 0.131
s - in org.apache.maven.shared.release.policy.semver.SemVerVersionPolicyTest
[windows-jdk7] [INFO] 
[windows-jdk7] [INFO] Results:
[windows-jdk7] [INFO] 
[windows-jdk7] [INFO] Tests run: 2, Failures: 0, Errors: 0, Skipped: 0
[windows-jdk7] [INFO] 
[windows-jdk7] [INFO] 
[windows-jdk7] [INFO] --- maven-jar-plugin:2.5:jar (default-jar) @ maven-release-semver-policy
---
[windows-jdk7] [INFO] Building jar: F:\jenkins\jenkins-slave\workspace\en-box_maven-release_master-OCKGULQBCZ67VBKJ7HF6E7KZUCKX7ZC6FX64GH66OHP7A4VAQBIQ\m\maven-release-policies\maven-release-semver-policy\target\maven-release-semver-policy-3.0.0-SNAPSHOT.jar
[windows-jdk7] [INFO] 
[windows-jdk7] [INFO] --- maven-site-plugin:3.4:attach-descriptor (attach-descriptor) @ maven-release-semver-policy
---
[windows-jdk7] [INFO] 
[windows-jdk7] [INFO] --- maven-checkstyle-plugin:2.15:check (checkstyle-check) @ maven-release-semver-policy
---
[windows-jdk7] [INFO] ------------------------------------------------------------------------
[windows-jdk7] [INFO] Reactor Summary:
[windows-jdk7] [INFO] 
[windows-jdk7] [INFO] Maven Release ...................................... SUCCESS [ 13.592
s]
[windows-jdk7] [INFO] Maven Release APIs ................................. SUCCESS [  5.358
s]
[windows-jdk7] [INFO] Maven Release Manager .............................. SUCCESS [02:10
min]
[windows-jdk7] [INFO] Maven Release Plugin ............................... SUCCESS [06:56
min]
[windows-jdk7] [INFO] Maven Release Odd-Even Policy ...................... SUCCESS [  2.028
s]
[windows-jdk7] [INFO] Maven Release SemVer Policy ........................ SUCCESS [  4.808
s]
[windows-jdk7] [INFO] ------------------------------------------------------------------------
[windows-jdk7] [INFO] BUILD SUCCESS
[windows-jdk7] [INFO] ------------------------------------------------------------------------
[windows-jdk7] [INFO] Total time: 09:35 min
[windows-jdk7] [INFO] Finished at: 2018-03-04T19:27:54Z
[windows-jdk7] [INFO] Final Memory: 76M/1033M
[windows-jdk7] [INFO] ------------------------------------------------------------------------
[windows-jdk7] [INFO] [jenkins-event-spy] Generated F:\jenkins\jenkins-slave\workspace\en-box_maven-release_master-OCKGULQBCZ67VBKJ7HF6E7KZUCKX7ZC6FX64GH66OHP7A4VAQBIQ@tmp\withMaven2269f6b2\maven-spy-20180304-191818-8876264958932824045311.log
[windows-jdk7] Picked up JAVA_TOOL_OPTIONS: -Dmaven.ext.class.path="f:\jenkins\jenkins-slave\workspace\en-box_maven-release_master-OCKGULQBCZ67VBKJ7HF6E7KZUCKX7ZC6FX64GH66OHP7A4VAQBIQ@tmp\withMaven2269f6b2\pipeline-maven-spy.jar"
-Dorg.jenkinsci.plugins.pipeline.maven.reportsFolder="f:\jenkins\jenkins-slave\workspace\en-box_maven-release_master-OCKGULQBCZ67VBKJ7HF6E7KZUCKX7ZC6FX64GH66OHP7A4VAQBIQ@tmp\withMaven2269f6b2"

[Pipeline] [windows-jdk7] }
[Pipeline] [windows-jdk7] // dir
[Pipeline] [windows-jdk7] }
[windows-jdk7] ERROR: [withMaven] WARNING Exception executing Maven reporter 'Invoker Publisher'
/ org.jenkinsci.plugins.pipeline.maven.publishers.InvokerRunsPublisher. Please report a bug
associated for the component 'pipeline-maven-plugin' at https://issues.jenkins-ci.org 
[windows-jdk7] java.lang.IllegalArgumentException: Cannot relativize 'src/it' relatively to
'f:\jenkins\jenkins-slave\workspace\en-box_maven-release_master-OCKGULQBCZ67VBKJ7HF6E7KZUCKX7ZC6FX64GH66OHP7A4VAQBIQ'
[windows-jdk7] 	at org.jenkinsci.plugins.pipeline.maven.util.XmlUtils.getPathInWorkspace(XmlUtils.java:396)
[windows-jdk7] 	at org.jenkinsci.plugins.pipeline.maven.publishers.InvokerRunsPublisher.expandAndRelativize(InvokerRunsPublisher.java:179)
[windows-jdk7] 	at org.jenkinsci.plugins.pipeline.maven.publishers.InvokerRunsPublisher.executeReporter(InvokerRunsPublisher.java:127)
[windows-jdk7] 	at org.jenkinsci.plugins.pipeline.maven.publishers.InvokerRunsPublisher.process(InvokerRunsPublisher.java:104)
[windows-jdk7] 	at org.jenkinsci.plugins.pipeline.maven.MavenSpyLogProcessor.processMavenSpyLogs(MavenSpyLogProcessor.java:114)
[windows-jdk7] 	at org.jenkinsci.plugins.pipeline.maven.WithMavenStepExecution$WorkspaceCleanupCallback.finished(WithMavenStepExecution.java:1015)
[windows-jdk7] 	at org.jenkinsci.plugins.workflow.steps.BodyExecutionCallback$TailCall.onSuccess(BodyExecutionCallback.java:114)
[windows-jdk7] 	at org.jenkinsci.plugins.workflow.cps.CpsBodyExecution$SuccessAdapter.receive(CpsBodyExecution.java:368)
[windows-jdk7] 	at com.cloudbees.groovy.cps.Outcome.resumeFrom(Outcome.java:73)
[windows-jdk7] 	at com.cloudbees.groovy.cps.Continuable$1.call(Continuable.java:166)
[windows-jdk7] 	at com.cloudbees.groovy.cps.Continuable$1.call(Continuable.java:163)
[windows-jdk7] 	at org.codehaus.groovy.runtime.GroovyCategorySupport$ThreadCategoryInfo.use(GroovyCategorySupport.java:122)
[windows-jdk7] 	at org.codehaus.groovy.runtime.GroovyCategorySupport.use(GroovyCategorySupport.java:261)
[windows-jdk7] 	at com.cloudbees.groovy.cps.Continuable.run0(Continuable.java:163)
[windows-jdk7] 	at org.jenkinsci.plugins.workflow.cps.SandboxContinuable.access$001(SandboxContinuable.java:19)
[windows-jdk7] 	at org.jenkinsci.plugins.workflow.cps.SandboxContinuable$1.call(SandboxContinuable.java:35)
[windows-jdk7] 	at org.jenkinsci.plugins.workflow.cps.SandboxContinuable$1.call(SandboxContinuable.java:32)
[windows-jdk7] 	at org.jenkinsci.plugins.scriptsecurity.sandbox.groovy.GroovySandbox.runInSandbox(GroovySandbox.java:108)
[windows-jdk7] 	at org.jenkinsci.plugins.workflow.cps.SandboxContinuable.run0(SandboxContinuable.java:32)
[windows-jdk7] 	at org.jenkinsci.plugins.workflow.cps.CpsThread.runNextChunk(CpsThread.java:174)
[windows-jdk7] 	at org.jenkinsci.plugins.workflow.cps.CpsThreadGroup.run(CpsThreadGroup.java:331)
[windows-jdk7] 	at org.jenkinsci.plugins.workflow.cps.CpsThreadGroup.access$200(CpsThreadGroup.java:82)
[windows-jdk7] 	at org.jenkinsci.plugins.workflow.cps.CpsThreadGroup$2.call(CpsThreadGroup.java:243)
[windows-jdk7] 	at org.jenkinsci.plugins.workflow.cps.CpsThreadGroup$2.call(CpsThreadGroup.java:231)
[windows-jdk7] 	at org.jenkinsci.plugins.workflow.cps.CpsVmExecutorService$2.call(CpsVmExecutorService.java:64)
[windows-jdk7] 	at java.util.concurrent.FutureTask.run(FutureTask.java:266)
[windows-jdk7] 	at hudson.remoting.SingleLaneExecutorService$1.run(SingleLaneExecutorService.java:112)
[windows-jdk7] 	at jenkins.util.ContextResettingExecutorService$1.run(ContextResettingExecutorService.java:28)
[windows-jdk7] 	at java.util.concurrent.Executors$RunnableAdapter.call(Executors.java:511)
[windows-jdk7] 	at java.util.concurrent.FutureTask.run(FutureTask.java:266)
[windows-jdk7] 	at java.util.concurrent.ThreadPoolExecutor.runWorker(ThreadPoolExecutor.java:1149)
[windows-jdk7] 	at java.util.concurrent.ThreadPoolExecutor$Worker.run(ThreadPoolExecutor.java:624)
[windows-jdk7] 	at java.lang.Thread.run(Thread.java:748)
[windows-jdk7] [withMaven] junitPublisher - Archive test results for Maven artifact org.apache.maven.release:maven-release-api:3.0.0-SNAPSHOT
generated by maven-surefire-plugin:test (default-test): m\maven-release-api\target\surefire-reports\*.xml
[windows-jdk7] [withMaven] junitPublisher - Jenkins JUnit Attachments Plugin not found, can't
publish test attachments.Recording test results
[windows-jdk7] None of the test reports contained any result
[windows-jdk7] [withMaven] junitPublisher - Archive test results for Maven artifact org.apache.maven.release:maven-release-manager:3.0.0-SNAPSHOT
generated by maven-surefire-plugin:test (default-test): m\maven-release-manager\target\surefire-reports\*.xml
[windows-jdk7] [withMaven] junitPublisher - Jenkins JUnit Attachments Plugin not found, can't
publish test attachments.Recording test results
[windows-jdk7] [withMaven] junitPublisher - Archive test results for Maven artifact org.apache.maven.plugins:maven-release-plugin:3.0.0-SNAPSHOT
generated by maven-surefire-plugin:test (default-test): m\maven-release-plugin\target\surefire-reports\*.xml
[windows-jdk7] [withMaven] junitPublisher - Jenkins JUnit Attachments Plugin not found, can't
publish test attachments.Recording test results
[windows-jdk7] [withMaven] junitPublisher - Archive test results for Maven artifact org.apache.maven.release:maven-release-oddeven-policy:3.0.0-SNAPSHOT
generated by maven-surefire-plugin:test (default-test): m\maven-release-policies\maven-release-oddeven-policy\target\surefire-reports\*.xml
[windows-jdk7] [withMaven] junitPublisher - Jenkins JUnit Attachments Plugin not found, can't
publish test attachments.Recording test results
[windows-jdk7] [withMaven] junitPublisher - Archive test results for Maven artifact org.apache.maven.release:maven-release-semver-policy:3.0.0-SNAPSHOT
generated by maven-surefire-plugin:test (default-test): m\maven-release-policies\maven-release-semver-policy\target\surefire-reports\*.xml
[windows-jdk7] [withMaven] junitPublisher - Jenkins JUnit Attachments Plugin not found, can't
publish test attachments.Recording test results
[windows-jdk7] [withMaven] junitPublisher - Archive test results for Maven artifact org.apache.maven.release:maven-release-manager:3.0.0-SNAPSHOT
generated by maven-failsafe-plugin:integration-test (default): m\maven-release-manager\target\failsafe-reports\*.xml
[windows-jdk7] [withMaven] junitPublisher - Jenkins JUnit Attachments Plugin not found, can't
publish test attachments.Recording test results
[windows-jdk7] [withMaven] One or multiple Maven executions have been ignored by the Jenkins
Pipeline Maven Plugin because they have been interrupted before completion (1). See Pipeline
Maven Plugin FAQ for more details.
[Pipeline] [windows-jdk7] // withMaven
[Pipeline] [windows-jdk7] }
[Pipeline] [windows-jdk7] // stage
[Pipeline] [windows-jdk7] }
[Pipeline] [windows-jdk7] // node
[Pipeline] [windows-jdk7] }
[Pipeline] // parallel
[Pipeline] stage
[Pipeline] { (Notifications)
[Pipeline] echo
Build result: UNSTABLE
[Pipeline] jiraIssueSelector
[Pipeline] emailext
Mime
  • Unnamed multipart/mixed (inline, None, 0 bytes)
View raw message