maven-notifications mailing list archives

Site index · List index
Message view « Date » · « Thread »
Top « Date » · « Thread »
From Apache Jenkins Server <jenk...@builds.apache.org>
Subject Build failed in Jenkins: Maven TLP » maven-ear-plugin » MEAR-256 #1
Date Sun, 04 Mar 2018 11:58:27 GMT
See https://builds.apache.org/job/maven-box/job/maven-ear-plugin/job/MEAR-256/1/

No changes.

No tests ran.

Build log:
[...truncated 1.15 MB...]
[windows-jdk9] [INFO] Downloaded: https://repo.maven.apache.org/maven2/org/ow2/asm/asm-parent/6.0_BETA/asm-parent-6.0_BETA.pom
(5.5 kB at 916 kB/s)
[windows-jdk9] [INFO] Downloading: https://repo.maven.apache.org/maven2/com/thoughtworks/qdox/qdox/2.0-M7/qdox-2.0-M7.pom
[windows-jdk9] [INFO] Downloaded: https://repo.maven.apache.org/maven2/com/thoughtworks/qdox/qdox/2.0-M7/qdox-2.0-M7.pom
(16 kB at 2.3 MB/s)
[windows-jdk9] [INFO] Downloading: https://repo.maven.apache.org/maven2/org/codehaus/plexus/plexus-compiler-api/2.8.2/plexus-compiler-api-2.8.2.pom
[windows-jdk9] [INFO] Downloaded: https://repo.maven.apache.org/maven2/org/codehaus/plexus/plexus-compiler-api/2.8.2/plexus-compiler-api-2.8.2.pom
(867 B at 144 kB/s)
[windows-jdk9] [INFO] Downloading: https://repo.maven.apache.org/maven2/org/codehaus/plexus/plexus-compiler/2.8.2/plexus-compiler-2.8.2.pom
[windows-jdk9] [INFO] Downloaded: https://repo.maven.apache.org/maven2/org/codehaus/plexus/plexus-compiler/2.8.2/plexus-compiler-2.8.2.pom
(4.9 kB at 610 kB/s)
[windows-jdk9] [INFO] Downloading: https://repo.maven.apache.org/maven2/org/codehaus/plexus/plexus-components/4.0/plexus-components-4.0.pom
[windows-jdk9] [INFO] Downloaded: https://repo.maven.apache.org/maven2/org/codehaus/plexus/plexus-components/4.0/plexus-components-4.0.pom
(2.7 kB at 295 kB/s)
[windows-jdk9] [INFO] Downloading: https://repo.maven.apache.org/maven2/org/codehaus/plexus/plexus-compiler-manager/2.8.2/plexus-compiler-manager-2.8.2.pom
[windows-jdk9] [INFO] Downloaded: https://repo.maven.apache.org/maven2/org/codehaus/plexus/plexus-compiler-manager/2.8.2/plexus-compiler-manager-2.8.2.pom
(692 B at 115 kB/s)
[windows-jdk9] [INFO] Downloading: https://repo.maven.apache.org/maven2/org/codehaus/plexus/plexus-compiler-javac/2.8.2/plexus-compiler-javac-2.8.2.pom
[windows-jdk9] [INFO] Downloaded: https://repo.maven.apache.org/maven2/org/codehaus/plexus/plexus-compiler-javac/2.8.2/plexus-compiler-javac-2.8.2.pom
(771 B at 110 kB/s)
[windows-jdk9] [INFO] Downloading: https://repo.maven.apache.org/maven2/org/codehaus/plexus/plexus-compilers/2.8.2/plexus-compilers-2.8.2.pom
[windows-jdk9] [INFO] Downloaded: https://repo.maven.apache.org/maven2/org/codehaus/plexus/plexus-compilers/2.8.2/plexus-compilers-2.8.2.pom
(1.3 kB at 268 kB/s)
[windows-jdk9] [INFO] Downloading: https://repo.maven.apache.org/maven2/org/codehaus/plexus/plexus-interpolation/1.14/plexus-interpolation-1.14.jar
[windows-jdk9] [INFO] Downloading: https://repo.maven.apache.org/maven2/org/apache/maven/shared/maven-shared-utils/3.1.0/maven-shared-utils-3.1.0.jar
[windows-jdk9] [INFO] Downloading: https://repo.maven.apache.org/maven2/org/apache/maven/shared/maven-shared-incremental/1.1/maven-shared-incremental-1.1.jar
[windows-jdk9] [INFO] Downloading: https://repo.maven.apache.org/maven2/org/codehaus/plexus/plexus-java/0.9.2/plexus-java-0.9.2.jar
[windows-jdk9] [INFO] Downloading: https://repo.maven.apache.org/maven2/org/ow2/asm/asm/6.0_BETA/asm-6.0_BETA.jar
[windows-jdk9] [INFO] Downloaded: https://repo.maven.apache.org/maven2/org/codehaus/plexus/plexus-java/0.9.2/plexus-java-0.9.2.jar
(31 kB at 129 kB/s)
[windows-jdk9] [INFO] Downloading: https://repo.maven.apache.org/maven2/com/thoughtworks/qdox/qdox/2.0-M7/qdox-2.0-M7.jar
[windows-jdk9] [INFO] Downloaded: https://repo.maven.apache.org/maven2/org/ow2/asm/asm/6.0_BETA/asm-6.0_BETA.jar
(56 kB at 234 kB/s)
[windows-jdk9] [INFO] Downloading: https://repo.maven.apache.org/maven2/org/codehaus/plexus/plexus-compiler-api/2.8.2/plexus-compiler-api-2.8.2.jar
[windows-jdk9] [INFO] Downloaded: https://repo.maven.apache.org/maven2/org/apache/maven/shared/maven-shared-incremental/1.1/maven-shared-incremental-1.1.jar
(14 kB at 55 kB/s)
[windows-jdk9] [INFO] Downloading: https://repo.maven.apache.org/maven2/org/codehaus/plexus/plexus-compiler-manager/2.8.2/plexus-compiler-manager-2.8.2.jar
[windows-jdk9] [INFO] Downloaded: https://repo.maven.apache.org/maven2/org/codehaus/plexus/plexus-interpolation/1.14/plexus-interpolation-1.14.jar
(61 kB at 246 kB/s)
[windows-jdk9] [INFO] Downloading: https://repo.maven.apache.org/maven2/org/codehaus/plexus/plexus-compiler-javac/2.8.2/plexus-compiler-javac-2.8.2.jar
[windows-jdk9] [INFO] Downloaded: https://repo.maven.apache.org/maven2/org/apache/maven/shared/maven-shared-utils/3.1.0/maven-shared-utils-3.1.0.jar
(164 kB at 650 kB/s)
[windows-jdk9] [INFO] Downloaded: https://repo.maven.apache.org/maven2/org/codehaus/plexus/plexus-compiler-api/2.8.2/plexus-compiler-api-2.8.2.jar
(26 kB at 104 kB/s)
[windows-jdk9] [INFO] Downloaded: https://repo.maven.apache.org/maven2/org/codehaus/plexus/plexus-compiler-manager/2.8.2/plexus-compiler-manager-2.8.2.jar
(4.7 kB at 18 kB/s)
[windows-jdk9] [INFO] Downloaded: https://repo.maven.apache.org/maven2/org/codehaus/plexus/plexus-compiler-javac/2.8.2/plexus-compiler-javac-2.8.2.jar
(20 kB at 78 kB/s)
[windows-jdk9] [INFO] Downloaded: https://repo.maven.apache.org/maven2/com/thoughtworks/qdox/qdox/2.0-M7/qdox-2.0-M7.jar
(315 kB at 1.1 MB/s)
[windows-jdk9] [INFO] Changes detected - recompiling the module!
[windows-jdk9] [INFO] Compiling 37 source files to f:\jenkins\jenkins-slave\workspace\x_maven-ear-plugin_MEAR-256-OJTFSP2V4YHLF5UCDSCAJ6MZCYV4QNCOVOUVXS7CQTIJD5GJFGEA\m\target\classes
[windows-jdk8] [INFO] Changes detected - recompiling the module!
[windows-jdk8] [INFO] Compiling 37 source files to f:\jenkins\jenkins-slave\workspace\x_maven-ear-plugin_MEAR-256-OJTFSP2V4YHLF5UCDSCAJ6MZCYV4QNCOVOUVXS7CQTIJD5GJFGEA\m\target\classes
[windows-jdk7] [INFO] Downloaded: https://repo.maven.apache.org/maven2/org/codehaus/plexus/plexus-compiler-javac/2.8.2/plexus-compiler-javac-2.8.2.jar
(20 kB at 44 kB/s)
[windows-jdk7] [INFO] Changes detected - recompiling the module!
[windows-jdk7] [INFO] Compiling 37 source files to f:\jenkins\jenkins-slave\workspace\x_maven-ear-plugin_MEAR-256-OJTFSP2V4YHLF5UCDSCAJ6MZCYV4QNCOVOUVXS7CQTIJD5GJFGEA@2\m\target\classes
[windows-jdk8] [INFO] 
[windows-jdk8] [INFO] --- maven-plugin-plugin:3.5.1:descriptor (default-descriptor) @ maven-ear-plugin
---
[windows-jdk8] [INFO] Using 'UTF-8' encoding to read mojo source files.
[windows-jdk8] [INFO] java-javadoc mojo extractor found 0 mojo descriptor.
[windows-jdk7] [INFO] 
[windows-jdk7] [INFO] --- maven-plugin-plugin:3.5.1:descriptor (default-descriptor) @ maven-ear-plugin
---
[windows-jdk7] [INFO] Using 'UTF-8' encoding to read mojo source files.
[windows-jdk7] [INFO] java-annotations mojo extractor found 3 mojo descriptors.
[windows-jdk9] [INFO] 
[windows-jdk9] [INFO] --- maven-plugin-plugin:3.5.1:descriptor (default-descriptor) @ maven-ear-plugin
---
[windows-jdk9] [INFO] Using 'UTF-8' encoding to read mojo source files.
[windows-jdk8] [INFO] java-annotations mojo extractor found 3 mojo descriptors.
[windows-jdk8] [INFO] 
[windows-jdk8] [INFO] --- maven-resources-plugin:3.0.2:testResources (default-testResources)
@ maven-ear-plugin ---
[windows-jdk8] [INFO] Using 'UTF-8' encoding to copy filtered resources.
[windows-jdk8] [INFO] Copying 87 resources
[windows-jdk8] [INFO] Copying 148 resources
[windows-jdk8] [INFO] Copying 1 resource
[windows-jdk8] [INFO] Copying 3 resources
[windows-jdk8] [INFO] 
[windows-jdk8] [INFO] --- maven-compiler-plugin:3.7.0:testCompile (default-testCompile) @
maven-ear-plugin ---
[windows-jdk8] [INFO] Changes detected - recompiling the module!
[windows-jdk8] [INFO] Compiling 13 source files to f:\jenkins\jenkins-slave\workspace\x_maven-ear-plugin_MEAR-256-OJTFSP2V4YHLF5UCDSCAJ6MZCYV4QNCOVOUVXS7CQTIJD5GJFGEA\m\target\test-classes
[windows-jdk7] [INFO] java-javadoc mojo extractor found 0 mojo descriptor.
[windows-jdk7] [INFO] 
[windows-jdk7] [INFO] --- maven-resources-plugin:3.0.2:testResources (default-testResources)
@ maven-ear-plugin ---
[windows-jdk7] [INFO] Using 'UTF-8' encoding to copy filtered resources.
[windows-jdk7] [INFO] Copying 87 resources
[windows-jdk7] [INFO] Copying 148 resources
[windows-jdk9] [INFO] java-javadoc mojo extractor found 0 mojo descriptor.
[windows-jdk9] [INFO] java-annotations mojo extractor found 3 mojo descriptors.
[windows-jdk9] [INFO] 
[windows-jdk9] [INFO] --- maven-resources-plugin:3.0.2:testResources (default-testResources)
@ maven-ear-plugin ---
[windows-jdk9] [INFO] Using 'UTF-8' encoding to copy filtered resources.
[windows-jdk9] [INFO] Copying 87 resources
[windows-jdk8] [INFO] /f:/jenkins/jenkins-slave/workspace/x_maven-ear-plugin_MEAR-256-OJTFSP2V4YHLF5UCDSCAJ6MZCYV4QNCOVOUVXS7CQTIJD5GJFGEA/m/src/test/java/org/apache/maven/plugins/ear/stub/ArtifactTestStub.java:
f:\jenkins\jenkins-slave\workspace\x_maven-ear-plugin_MEAR-256-OJTFSP2V4YHLF5UCDSCAJ6MZCYV4QNCOVOUVXS7CQTIJD5GJFGEA\m\src\test\java\org\apache\maven\plugins\ear\stub\ArtifactTestStub.java
uses or overrides a deprecated API.
[windows-jdk8] [INFO] /f:/jenkins/jenkins-slave/workspace/x_maven-ear-plugin_MEAR-256-OJTFSP2V4YHLF5UCDSCAJ6MZCYV4QNCOVOUVXS7CQTIJD5GJFGEA/m/src/test/java/org/apache/maven/plugins/ear/stub/ArtifactTestStub.java:
Recompile with -Xlint:deprecation for details.
[windows-jdk8] [INFO] -------------------------------------------------------------
[windows-jdk8] [ERROR] COMPILATION ERROR : 
[windows-jdk8] [INFO] -------------------------------------------------------------
[windows-jdk8] [ERROR] /f:/jenkins/jenkins-slave/workspace/x_maven-ear-plugin_MEAR-256-OJTFSP2V4YHLF5UCDSCAJ6MZCYV4QNCOVOUVXS7CQTIJD5GJFGEA/m/src/test/java/org/apache/maven/plugins/ear/it/AbstractEarPluginIT.java:[91,17]
localRepo has private access in org.apache.maven.it.Verifier
[windows-jdk8] [INFO] 1 error
[windows-jdk8] [INFO] -------------------------------------------------------------
[windows-jdk8] [INFO] ------------------------------------------------------------------------
[windows-jdk8] [INFO] BUILD FAILURE
[windows-jdk8] [INFO] ------------------------------------------------------------------------
[windows-jdk8] [INFO] Total time: 29.707 s
[windows-jdk8] [INFO] Finished at: 2018-03-04T11:58:12Z
[windows-jdk8] [INFO] Final Memory: 42M/773M
[windows-jdk8] [INFO] ------------------------------------------------------------------------
[windows-jdk8] [INFO] [jenkins-event-spy] Generated F:\jenkins\jenkins-slave\workspace\x_maven-ear-plugin_MEAR-256-OJTFSP2V4YHLF5UCDSCAJ6MZCYV4QNCOVOUVXS7CQTIJD5GJFGEA@tmp\withMavenec0954a7\maven-spy-20180304-115743-466619022116334261825.log
[windows-jdk8] [ERROR] Failed to execute goal org.apache.maven.plugins:maven-compiler-plugin:3.7.0:testCompile
(default-testCompile) on project maven-ear-plugin: Compilation failure
[windows-jdk8] [ERROR] /f:/jenkins/jenkins-slave/workspace/x_maven-ear-plugin_MEAR-256-OJTFSP2V4YHLF5UCDSCAJ6MZCYV4QNCOVOUVXS7CQTIJD5GJFGEA/m/src/test/java/org/apache/maven/plugins/ear/it/AbstractEarPluginIT.java:[91,17]
localRepo has private access in org.apache.maven.it.Verifier
[windows-jdk8] [ERROR] -> [Help 1]
[windows-jdk8] [ERROR] 
[windows-jdk8] [ERROR] To see the full stack trace of the errors, re-run Maven with the -e
switch.
[windows-jdk8] [ERROR] Re-run Maven using the -X switch to enable full debug logging.
[windows-jdk8] [ERROR] 
[windows-jdk8] [ERROR] For more information about the errors and possible solutions, please
read the following articles:
[windows-jdk8] [ERROR] [Help 1] http://cwiki.apache.org/confluence/display/MAVEN/MojoFailureException
[windows-jdk8] Picked up JAVA_TOOL_OPTIONS: -Dmaven.ext.class.path="f:\jenkins\jenkins-slave\workspace\x_maven-ear-plugin_MEAR-256-OJTFSP2V4YHLF5UCDSCAJ6MZCYV4QNCOVOUVXS7CQTIJD5GJFGEA@tmp\withMavenec0954a7\pipeline-maven-spy.jar"
-Dorg.jenkinsci.plugins.pipeline.maven.reportsFolder="f:\jenkins\jenkins-slave\workspace\x_maven-ear-plugin_MEAR-256-OJTFSP2V4YHLF5UCDSCAJ6MZCYV4QNCOVOUVXS7CQTIJD5GJFGEA@tmp\withMavenec0954a7"

[windows-jdk7] [INFO] Copying 1 resource
[windows-jdk7] [INFO] Copying 3 resources
[windows-jdk7] [INFO] 
[windows-jdk7] [INFO] --- maven-compiler-plugin:3.7.0:testCompile (default-testCompile) @
maven-ear-plugin ---
[windows-jdk7] [INFO] Changes detected - recompiling the module!
[windows-jdk7] [INFO] Compiling 13 source files to f:\jenkins\jenkins-slave\workspace\x_maven-ear-plugin_MEAR-256-OJTFSP2V4YHLF5UCDSCAJ6MZCYV4QNCOVOUVXS7CQTIJD5GJFGEA@2\m\target\test-classes
[windows-jdk7] [INFO] /f:/jenkins/jenkins-slave/workspace/x_maven-ear-plugin_MEAR-256-OJTFSP2V4YHLF5UCDSCAJ6MZCYV4QNCOVOUVXS7CQTIJD5GJFGEA@2/m/src/test/java/org/apache/maven/plugins/ear/stub/ArtifactTestStub.java:
f:\jenkins\jenkins-slave\workspace\x_maven-ear-plugin_MEAR-256-OJTFSP2V4YHLF5UCDSCAJ6MZCYV4QNCOVOUVXS7CQTIJD5GJFGEA@2\m\src\test\java\org\apache\maven\plugins\ear\stub\ArtifactTestStub.java
uses or overrides a deprecated API.
[windows-jdk7] [INFO] /f:/jenkins/jenkins-slave/workspace/x_maven-ear-plugin_MEAR-256-OJTFSP2V4YHLF5UCDSCAJ6MZCYV4QNCOVOUVXS7CQTIJD5GJFGEA@2/m/src/test/java/org/apache/maven/plugins/ear/stub/ArtifactTestStub.java:
Recompile with -Xlint:deprecation for details.
[windows-jdk7] [INFO] -------------------------------------------------------------
[windows-jdk7] [ERROR] COMPILATION ERROR : 
[windows-jdk7] [INFO] -------------------------------------------------------------
[windows-jdk7] [ERROR] /f:/jenkins/jenkins-slave/workspace/x_maven-ear-plugin_MEAR-256-OJTFSP2V4YHLF5UCDSCAJ6MZCYV4QNCOVOUVXS7CQTIJD5GJFGEA@2/m/src/test/java/org/apache/maven/plugins/ear/it/AbstractEarPluginIT.java:[91,17]
localRepo has private access in org.apache.maven.it.Verifier
[windows-jdk7] [INFO] 1 error
[windows-jdk7] [INFO] -------------------------------------------------------------
[windows-jdk7] [INFO] ------------------------------------------------------------------------
[windows-jdk7] [INFO] BUILD FAILURE
[windows-jdk7] [INFO] ------------------------------------------------------------------------
[windows-jdk7] [INFO] Total time: 28.516 s
[windows-jdk7] [INFO] Finished at: 2018-03-04T11:58:12Z
[windows-jdk7] [INFO] Final Memory: 57M/714M
[windows-jdk7] [INFO] ------------------------------------------------------------------------
[windows-jdk7] [INFO] [jenkins-event-spy] Generated F:\jenkins\jenkins-slave\workspace\x_maven-ear-plugin_MEAR-256-OJTFSP2V4YHLF5UCDSCAJ6MZCYV4QNCOVOUVXS7CQTIJD5GJFGEA@2@tmp\withMaven77f18b0e\maven-spy-20180304-115743-9693280860283345806718.log
[windows-jdk7] [ERROR] Failed to execute goal org.apache.maven.plugins:maven-compiler-plugin:3.7.0:testCompile
(default-testCompile) on project maven-ear-plugin: Compilation failure
[windows-jdk7] [ERROR] /f:/jenkins/jenkins-slave/workspace/x_maven-ear-plugin_MEAR-256-OJTFSP2V4YHLF5UCDSCAJ6MZCYV4QNCOVOUVXS7CQTIJD5GJFGEA@2/m/src/test/java/org/apache/maven/plugins/ear/it/AbstractEarPluginIT.java:[91,17]
localRepo has private access in org.apache.maven.it.Verifier
[windows-jdk7] [ERROR] -> [Help 1]
[windows-jdk7] [ERROR] 
[windows-jdk7] [ERROR] To see the full stack trace of the errors, re-run Maven with the -e
switch.
[windows-jdk7] [ERROR] Re-run Maven using the -X switch to enable full debug logging.
[windows-jdk7] [ERROR] 
[windows-jdk7] [ERROR] For more information about the errors and possible solutions, please
read the following articles:
[windows-jdk7] [ERROR] [Help 1] http://cwiki.apache.org/confluence/display/MAVEN/MojoFailureException
[windows-jdk7] Picked up JAVA_TOOL_OPTIONS: -Dmaven.ext.class.path="f:\jenkins\jenkins-slave\workspace\x_maven-ear-plugin_MEAR-256-OJTFSP2V4YHLF5UCDSCAJ6MZCYV4QNCOVOUVXS7CQTIJD5GJFGEA@2@tmp\withMaven77f18b0e\pipeline-maven-spy.jar"
-Dorg.jenkinsci.plugins.pipeline.maven.reportsFolder="f:\jenkins\jenkins-slave\workspace\x_maven-ear-plugin_MEAR-256-OJTFSP2V4YHLF5UCDSCAJ6MZCYV4QNCOVOUVXS7CQTIJD5GJFGEA@2@tmp\withMaven77f18b0e"

[windows-jdk9] [INFO] Copying 148 resources
[windows-jdk9] [INFO] Copying 1 resource
[windows-jdk9] [INFO] Copying 3 resources
[windows-jdk9] [INFO] 
[windows-jdk9] [INFO] --- maven-compiler-plugin:3.7.0:testCompile (default-testCompile) @
maven-ear-plugin ---
[windows-jdk9] [INFO] Changes detected - recompiling the module!
[windows-jdk9] [INFO] Compiling 13 source files to f:\jenkins\jenkins-slave\workspace\x_maven-ear-plugin_MEAR-256-OJTFSP2V4YHLF5UCDSCAJ6MZCYV4QNCOVOUVXS7CQTIJD5GJFGEA\m\target\test-classes
[windows-jdk9] [INFO] /F:/jenkins/jenkins-slave/workspace/x_maven-ear-plugin_MEAR-256-OJTFSP2V4YHLF5UCDSCAJ6MZCYV4QNCOVOUVXS7CQTIJD5GJFGEA/m/src/test/java/org/apache/maven/plugins/ear/stub/ArtifactTestStub.java:
f:\jenkins\jenkins-slave\workspace\x_maven-ear-plugin_MEAR-256-OJTFSP2V4YHLF5UCDSCAJ6MZCYV4QNCOVOUVXS7CQTIJD5GJFGEA\m\src\test\java\org\apache\maven\plugins\ear\stub\ArtifactTestStub.java
uses or overrides a deprecated API.
[windows-jdk9] [INFO] /F:/jenkins/jenkins-slave/workspace/x_maven-ear-plugin_MEAR-256-OJTFSP2V4YHLF5UCDSCAJ6MZCYV4QNCOVOUVXS7CQTIJD5GJFGEA/m/src/test/java/org/apache/maven/plugins/ear/stub/ArtifactTestStub.java:
Recompile with -Xlint:deprecation for details.
[windows-jdk9] [INFO] -------------------------------------------------------------
[windows-jdk9] [ERROR] COMPILATION ERROR : 
[windows-jdk9] [INFO] -------------------------------------------------------------
[windows-jdk9] [ERROR] /F:/jenkins/jenkins-slave/workspace/x_maven-ear-plugin_MEAR-256-OJTFSP2V4YHLF5UCDSCAJ6MZCYV4QNCOVOUVXS7CQTIJD5GJFGEA/m/src/test/java/org/apache/maven/plugins/ear/it/AbstractEarPluginIT.java:[91,17]
localRepo has private access in org.apache.maven.it.Verifier
[windows-jdk9] [INFO] 1 error
[windows-jdk9] [INFO] -------------------------------------------------------------
[windows-jdk9] [INFO] ------------------------------------------------------------------------
[windows-jdk9] [INFO] BUILD FAILURE
[windows-jdk9] [INFO] ------------------------------------------------------------------------
[windows-jdk9] [INFO] Total time: 18.923 s
[windows-jdk9] [INFO] Finished at: 2018-03-04T11:58:13Z
[windows-jdk9] [INFO] Final Memory: 34M/115M
[windows-jdk9] [INFO] ------------------------------------------------------------------------
[windows-jdk9] [INFO] [jenkins-event-spy] Generated F:\jenkins\jenkins-slave\workspace\x_maven-ear-plugin_MEAR-256-OJTFSP2V4YHLF5UCDSCAJ6MZCYV4QNCOVOUVXS7CQTIJD5GJFGEA@tmp\withMavenbec80e0e\maven-spy-20180304-115754-3243746234966107754656.log
[windows-jdk9] [ERROR] Failed to execute goal org.apache.maven.plugins:maven-compiler-plugin:3.7.0:testCompile
(default-testCompile) on project maven-ear-plugin: Compilation failure
[windows-jdk9] [ERROR] /F:/jenkins/jenkins-slave/workspace/x_maven-ear-plugin_MEAR-256-OJTFSP2V4YHLF5UCDSCAJ6MZCYV4QNCOVOUVXS7CQTIJD5GJFGEA/m/src/test/java/org/apache/maven/plugins/ear/it/AbstractEarPluginIT.java:[91,17]
localRepo has private access in org.apache.maven.it.Verifier
[windows-jdk9] [ERROR] -> [Help 1]
[windows-jdk9] [ERROR] 
[windows-jdk9] [ERROR] To see the full stack trace of the errors, re-run Maven with the -e
switch.
[windows-jdk9] [ERROR] Re-run Maven using the -X switch to enable full debug logging.
[windows-jdk9] [ERROR] 
[windows-jdk9] [ERROR] For more information about the errors and possible solutions, please
read the following articles:
[windows-jdk9] [ERROR] [Help 1] http://cwiki.apache.org/confluence/display/MAVEN/MojoFailureException
[Pipeline] [linux-jdk8] }
[Pipeline] [linux-jdk8] // withMaven
[Pipeline] [windows-jdk8] }
[Pipeline] [windows-jdk7] }
[Pipeline] [linux-jdk8] echo
[linux-jdk8] [FAIL FAST] This is the first failure and likely root cause
[Pipeline] [linux-jdk8] }
[Pipeline] [linux-jdk7] }
[Pipeline] [linux-jdk9] }
[Pipeline] [windows-jdk9] }
[Pipeline] [windows-jdk8] // dir
[Pipeline] [windows-jdk7] // dir
[Pipeline] [linux-jdk8] // stage
[Pipeline] [linux-jdk7] // dir
[Pipeline] [linux-jdk9] // dir
[Pipeline] [windows-jdk9] // dir
[Pipeline] [linux-jdk8] }
[Pipeline] [windows-jdk8] }
[Pipeline] [windows-jdk7] }
[Pipeline] [linux-jdk7] }
[linux-jdk7] [Fast Archiver] No prior successful build to compare, so performing full copy
of artifacts
[linux-jdk7] [withMaven] openTasksPublisher - Scan Tasks for Maven artifact org.apache.maven.plugins:maven-ear-plugin:3.0.0-SNAPSHOT
in source directory m/src/main/java
[linux-jdk7] [TASKS] Scanning folder '/home/jenkins/jenkins-slave/workspace/x_maven-ear-plugin_MEAR-256-OJTFSP2V4YHLF5UCDSCAJ6MZCYV4QNCOVOUVXS7CQTIJD5GJFGEA'
for files matching the pattern 'm/src/main/java/**/*' - excludes: null
[linux-jdk7] [TASKS] Found 36 files to scan for tasks
[linux-jdk7] [TASKS] Found 9 open tasks.
[linux-jdk7] Skipping warnings blame since pipelines do not have an SCM link.%n
[Pipeline] [linux-jdk9] }
[Pipeline] [windows-jdk9] }
[Pipeline] [linux-jdk8] // node
[Pipeline] [windows-jdk8] // withMaven
[Pipeline] [windows-jdk7] // withMaven
[Pipeline] [linux-jdk7] // withMaven
[Pipeline] [linux-jdk9] // withMaven
[Pipeline] [windows-jdk9] // withMaven
[Pipeline] [linux-jdk8] }
[linux-jdk8] Failed in branch linux-jdk8
[Pipeline] [windows-jdk8] echo
[windows-jdk8] [FAIL FAST] linux-jdk8 had first failure, ignoring script returned exit code
1
[Pipeline] [windows-jdk8] }
[Pipeline] [windows-jdk7] echo
[windows-jdk7] [FAIL FAST] linux-jdk8 had first failure, ignoring script returned exit code
1
[Pipeline] [windows-jdk7] }
[Pipeline] [linux-jdk7] echo
[linux-jdk7] [FAIL FAST] linux-jdk8 had first failure, ignoring script returned exit code
1
[Pipeline] [linux-jdk7] }
[Pipeline] [linux-jdk9] echo
[linux-jdk9] [FAIL FAST] linux-jdk8 had first failure, ignoring script returned exit code
1
[Pipeline] [linux-jdk9] }
[Pipeline] [windows-jdk9] echo
[windows-jdk9] [FAIL FAST] linux-jdk8 had first failure, ignoring script returned exit code
1
[Pipeline] [windows-jdk9] }
[Pipeline] [windows-jdk8] // stage
[Pipeline] [windows-jdk7] // stage
[Pipeline] [linux-jdk7] // stage
[Pipeline] [linux-jdk9] // stage
[Pipeline] [windows-jdk9] // stage
[Pipeline] [linux-jdk7] }
[Pipeline] [linux-jdk9] }
[Pipeline] [windows-jdk8] }
[Pipeline] [windows-jdk7] }
[Pipeline] [windows-jdk9] }
[Pipeline] [linux-jdk7] // node
[Pipeline] [linux-jdk9] // node
[Pipeline] [windows-jdk8] // node
[Pipeline] [windows-jdk7] // node
[Pipeline] [windows-jdk9] // node
[Pipeline] [linux-jdk7] }
[Pipeline] [linux-jdk9] }
[Pipeline] [windows-jdk7] }
[Pipeline] [windows-jdk8] }
[Pipeline] [windows-jdk9] }
[Pipeline] // parallel
[Pipeline] echo
***** FAST FAILURE *****

Fast failure triggered by linux-jdk8

***** FAST FAILURE *****
[Pipeline] stage
[Pipeline] { (Notifications)
[Pipeline] echo
Build result: FAILURE
[Pipeline] jiraIssueSelector
[Pipeline] emailext
Mime
  • Unnamed multipart/mixed (inline, None, 0 bytes)
View raw message