maven-notifications mailing list archives

Site index · List index
Message view « Date » · « Thread »
Top « Date » · « Thread »
From Apache Jenkins Server <jenk...@builds.apache.org>
Subject Build unstable in Jenkins: Maven TLP » maven-remote-resources-plugin » master #3
Date Sat, 03 Mar 2018 17:42:03 GMT
See https://builds.apache.org/job/maven-box/job/maven-remote-resources-plugin/job/master/3/

No changes.

5 tests failed.
FAILED:  org.apache.maven.plugin.resources.remote.it.IT_RunOnlyAtExecutionRoot.test

Error Message:
Exit code was non-zero: 1; command line and log = 
F:\jenkins\tools\maven\apache-maven-3.5.0\bin\mvn -e --batch-mode -Dmaven.repo.local=f:\jenkins\jenkins-slave\workspace\ote-resources-plugin_master-FTEJEAA7J3RSA3RGNRQRTOLNK5IUQ7QP3AJQZXDE4RWB3DK3KFPQ@2\m\target/it-repo org.apache.maven.plugins:maven-clean-plugin:clean generate-resources
Picked up JAVA_TOOL_OPTIONS: -Dmaven.ext.class.path="f:\jenkins\jenkins-slave\workspace\ote-resources-plugin_master-FTEJEAA7J3RSA3RGNRQRTOLNK5IUQ7QP3AJQZXDE4RWB3DK3KFPQ@2@tmp\withMavend8ba7d91\pipeline-maven-spy.jar" -Dorg.jenkinsci.plugins.pipeline.maven.reportsFolder="f:\jenkins\jenkins-slave\workspace\ote-resources-plugin_master-FTEJEAA7J3RSA3RGNRQRTOLNK5IUQ7QP3AJQZXDE4RWB3DK3KFPQ@2@tmp\withMavend8ba7d91" 
[INFO] [jenkins-event-spy] Generate F:\jenkins\jenkins-slave\workspace\ote-resources-plugin_master-FTEJEAA7J3RSA3RGNRQRTOLNK5IUQ7QP3AJQZXDE4RWB3DK3KFPQ@2@tmp\withMavend8ba7d91\maven-spy-20180303-174018-3887484889226421212125.log.tmp ...
[INFO] Error stacktraces are turned on.
[INFO] Scanning for projects...
[INFO] Downloading: http://repository.apache.org/snapshots/org/apache/maven/plugin/rresource/it/it-parent/1.6-SNAPSHOT/maven-metadata.xml
[INFO] Downloading: http://repository.apache.org/snapshots/org/apache/maven/plugin/rresource/it/it-parent/1.6-SNAPSHOT/it-parent-1.6-SNAPSHOT.pom
[ERROR] [ERROR] Some problems were encountered while processing the POMs:
[FATAL] Non-resolvable parent POM for org.apache.maven.plugin.rresource.it.mrr41:parent:[unknown-version]: Could not find artifact org.apache.maven.plugin.rresource.it:it-parent:pom:1.6-SNAPSHOT in apache-snapshots (http://repository.apache.org/snapshots/) and 'parent.relativePath' points at wrong local POM @ org.apache.maven.plugin.rresource.it.mrr41:parent:[unknown-version], F:\jenkins\jenkins-slave\workspace\ote-resources-plugin_master-FTEJEAA7J3RSA3RGNRQRTOLNK5IUQ7QP3AJQZXDE4RWB3DK3KFPQ@2\m\target\test-classes\run-only-at-execution-root\pom.xml, line 24, column 11
[FATAL] Non-resolvable parent POM for org.apache.maven.plugin.rresource.it.mrr41:parent:[unknown-version]: Failure to find org.apache.maven.plugin.rresource.it:it-parent:pom:1.6-SNAPSHOT in http://repository.apache.org/snapshots/ was cached in the local repository, resolution will not be reattempted until the update interval of apache-snapshots has elapsed or updates are forced and 'parent.relativePath' points at wrong local POM @ org.apache.maven.plugin.rresource.it.mrr41:parent:[unknown-version], F:\jenkins\jenkins-slave\workspace\ote-resources-plugin_master-FTEJEAA7J3RSA3RGNRQRTOLNK5IUQ7QP3AJQZXDE4RWB3DK3KFPQ@2\m\target\test-classes\run-only-at-execution-root\pom.xml, line 24, column 11
 @ 
[INFO] [jenkins-event-spy] Generated F:\jenkins\jenkins-slave\workspace\ote-resources-plugin_master-FTEJEAA7J3RSA3RGNRQRTOLNK5IUQ7QP3AJQZXDE4RWB3DK3KFPQ@2@tmp\withMavend8ba7d91\maven-spy-20180303-174018-3887484889226421212125.log
[ERROR] The build could not read 2 projects -> [Help 1]
org.apache.maven.project.ProjectBuildingException: Some problems were encountered while processing the POMs:
[FATAL] Non-resolvable parent POM for org.apache.maven.plugin.rresource.it.mrr41:parent:[unknown-version]: Could not find artifact org.apache.maven.plugin.rresource.it:it-parent:pom:1.6-SNAPSHOT in apache-snapshots (http://repository.apache.org/snapshots/) and 'parent.relativePath' points at wrong local POM @ org.apache.maven.plugin.rresource.it.mrr41:parent:[unknown-version], F:\jenkins\jenkins-slave\workspace\ote-resources-plugin_master-FTEJEAA7J3RSA3RGNRQRTOLNK5IUQ7QP3AJQZXDE4RWB3DK3KFPQ@2\m\target\test-classes\run-only-at-execution-root\pom.xml, line 24, column 11
[FATAL] Non-resolvable parent POM for org.apache.maven.plugin.rresource.it.mrr41:parent:[unknown-version]: Failure to find org.apache.maven.plugin.rresource.it:it-parent:pom:1.6-SNAPSHOT in http://repository.apache.org/snapshots/ was cached in the local repository, resolution will not be reattempted until the update interval of apache-snapshots has elapsed or updates are forced and 'parent.relativePath' points at wrong local POM @ org.apache.maven.plugin.rresource.it.mrr41:parent:[unknown-version], F:\jenkins\jenkins-slave\workspace\ote-resources-plugin_master-FTEJEAA7J3RSA3RGNRQRTOLNK5IUQ7QP3AJQZXDE4RWB3DK3KFPQ@2\m\target\test-classes\run-only-at-execution-root\pom.xml, line 24, column 11

 at org.apache.maven.project.DefaultProjectBuilder.build(DefaultProjectBuilder.java:382)
 at org.apache.maven.graph.DefaultGraphBuilder.collectProjects(DefaultGraphBuilder.java:400)
 at org.apache.maven.graph.DefaultGraphBuilder.getProjectsForMavenReactor(DefaultGraphBuilder.java:391)
 at org.apache.maven.graph.DefaultGraphBuilder.build(DefaultGraphBuilder.java:78)
 at org.apache.maven.DefaultMaven.buildGraph(DefaultMaven.java:511)
 at org.apache.maven.DefaultMaven.doExecute(DefaultMaven.java:221)
 at org.apache.maven.DefaultMaven.doExecute(DefaultMaven.java:194)
 at org.apache.maven.DefaultMaven.execute(DefaultMaven.java:107)
 at org.apache.maven.cli.MavenCli.execute(MavenCli.java:993)
 at org.apache.maven.cli.MavenCli.doMain(MavenCli.java:345)
 at org.apache.maven.cli.MavenCli.main(MavenCli.java:191)
 at java.base/jdk.internal.reflect.NativeMethodAccessorImpl.invoke0(Native Method)
 at java.base/jdk.internal.reflect.NativeMethodAccessorImpl.invoke(NativeMethodAccessorImpl.java:62)
 at java.base/jdk.internal.reflect.DelegatingMethodAccessorImpl.invoke(DelegatingMethodAccessorImpl.java:43)
 at java.base/java.lang.reflect.Method.invoke(Method.java:564)
 at org.codehaus.plexus.classworlds.launcher.Launcher.launchEnhanced(Launcher.java:289)
 at org.codehaus.plexus.classworlds.launcher.Launcher.launch(Launcher.java:229)
 at org.codehaus.plexus.classworlds.launcher.Launcher.mainWithExitCode(Launcher.java:415)
 at org.codehaus.plexus.classworlds.launcher.Launcher.main(Launcher.java:356)
[ERROR]   
[ERROR]   The project org.apache.maven.plugin.rresource.it.mrr41:child-1:[unknown-version] (F:\jenkins\jenkins-slave\workspace\ote-resources-plugin_master-FTEJEAA7J3RSA3RGNRQRTOLNK5IUQ7QP3AJQZXDE4RWB3DK3KFPQ@2\m\target\test-classes\run-only-at-execution-root\child1\pom.xml) has 1 error
[ERROR]     Non-resolvable parent POM for org.apache.maven.plugin.rresource.it.mrr41:parent:[unknown-version]: Could not find artifact org.apache.maven.plugin.rresource.it:it-parent:pom:1.6-SNAPSHOT in apache-snapshots (http://repository.apache.org/snapshots/) and 'parent.relativePath' points at wrong local POM @ org.apache.maven.plugin.rresource.it.mrr41:parent:[unknown-version], F:\jenkins\jenkins-slave\workspace\ote-resources-plugin_master-FTEJEAA7J3RSA3RGNRQRTOLNK5IUQ7QP3AJQZXDE4RWB3DK3KFPQ@2\m\target\test-classes\run-only-at-execution-root\pom.xml, line 24, column 11 -> [Help 2]
org.apache.maven.model.resolution.UnresolvableModelException: Could not find artifact org.apache.maven.plugin.rresource.it:it-parent:pom:1.6-SNAPSHOT in apache-snapshots (http://repository.apache.org/snapshots/)
 at org.apache.maven.project.ProjectModelResolver.resolveModel(ProjectModelResolver.java:197)
 at org.apache.maven.project.ProjectModelResolver.resolveModel(ProjectModelResolver.java:243)
 at org.apache.maven.model.building.DefaultModelBuilder.readParentExternally(DefaultModelBuilder.java:1051)
 at org.apache.maven.model.building.DefaultModelBuilder.readParent(DefaultModelBuilder.java:851)
 at org.apache.maven.model.building.DefaultModelBuilder.build(DefaultModelBuilder.java:331)
 at org.apache.maven.project.DefaultProjectBuilder.build(DefaultProjectBuilder.java:429)
 at org.apache.maven.project.DefaultProjectBuilder.build(DefaultProjectBuilder.java:398)
 at org.apache.maven.project.DefaultProjectBuilder.build(DefaultProjectBuilder.java:515)
 at org.apache.maven.project.DefaultProjectBuilder.build(DefaultProjectBuilder.java:398)
 at org.apache.maven.project.DefaultProjectBuilder.build(DefaultProjectBuilder.java:361)
 at org.apache.maven.graph.DefaultGraphBuilder.collectProjects(DefaultGraphBuilder.java:400)
 at org.apache.maven.graph.DefaultGraphBuilder.getProjectsForMavenReactor(DefaultGraphBuilder.java:391)
 at org.apache.maven.graph.DefaultGraphBuilder.build(DefaultGraphBuilder.java:78)
 at org.apache.maven.DefaultMaven.buildGraph(DefaultMaven.java:511)
 at org.apache.maven.DefaultMaven.doExecute(DefaultMaven.java:221)
 at org.apache.maven.DefaultMaven.doExecute(DefaultMaven.java:194)
 at org.apache.maven.DefaultMaven.execute(DefaultMaven.java:107)
 at org.apache.maven.cli.MavenCli.execute(MavenCli.java:993)
 at org.apache.maven.cli.MavenCli.doMain(MavenCli.java:345)
 at org.apache.maven.cli.MavenCli.main(MavenCli.java:191)
 at java.base/jdk.internal.reflect.NativeMethodAccessorImpl.invoke0(Native Method)
 at java.base/jdk.internal.reflect.NativeMethodAccessorImpl.invoke(NativeMethodAccessorImpl.java:62)
 at java.base/jdk.internal.reflect.DelegatingMethodAccessorImpl.invoke(DelegatingMethodAccessorImpl.java:43)
 at java.base/java.lang.reflect.Method.invoke(Method.java:564)
 at org.codehaus.plexus.classworlds.launcher.Launcher.launchEnhanced(Launcher.java:289)
 at org.codehaus.plexus.classworlds.launcher.Launcher.launch(Launcher.java:229)
 at org.codehaus.plexus.classworlds.launcher.Launcher.mainWithExitCode(Launcher.java:415)
 at org.codehaus.plexus.classworlds.launcher.Launcher.main(Launcher.java:356)
Caused by: org.eclipse.aether.resolution.ArtifactResolutionException: Could not find artifact org.apache.maven.plugin.rresource.it:it-parent:pom:1.6-SNAPSHOT in apache-snapshots (http://repository.apache.org/snapshots/)
 at org.eclipse.aether.internal.impl.DefaultArtifactResolver.resolve(DefaultArtifactResolver.java:453)
 at org.eclipse.aether.internal.impl.DefaultArtifactResolver.resolveArtifacts(DefaultArtifactResolver.java:255)
 at org.eclipse.aether.internal.impl.DefaultArtifactResolver.resolveArtifact(DefaultArtifactResolver.java:232)
 at org.eclipse.aether.internal.impl.DefaultRepositorySystem.resolveArtifact(DefaultRepositorySystem.java:303)
 at org.apache.maven.project.ProjectModelResolver.resolveModel(ProjectModelResolver.java:193)
 ... 27 more
Caused by: org.eclipse.aether.transfer.ArtifactNotFoundException: Could not find artifact org.apache.maven.plugin.rresource.it:it-parent:pom:1.6-SNAPSHOT in apache-snapshots (http://repository.apache.org/snapshots/)
 at org.eclipse.aether.connector.basic.ArtifactTransportListener.transferFailed(ArtifactTransportListener.java:48)
 at org.eclipse.aether.connector.basic.BasicRepositoryConnector$TaskRunner.run(BasicRepositoryConnector.java:364)
 at org.eclipse.aether.util.concurrency.RunnableErrorForwarder$1.run(RunnableErrorForwarder.java:76)
 at org.eclipse.aether.connector.basic.BasicRepositoryConnector$DirectExecutor.execute(BasicRepositoryConnector.java:590)
 at org.eclipse.aether.connector.basic.BasicRepositoryConnector.get(BasicRepositoryConnector.java:258)
 at org.eclipse.aether.internal.impl.DefaultArtifactResolver.performDownloads(DefaultArtifactResolver.java:529)
 at org.eclipse.aether.internal.impl.DefaultArtifactResolver.resolve(DefaultArtifactResolver.java:430)
 ... 31 more
[ERROR]   
[ERROR]   The project org.apache.maven.plugin.rresource.it.mrr41:child-2:[unknown-version] (F:\jenkins\jenkins-slave\workspace\ote-resources-plugin_master-FTEJEAA7J3RSA3RGNRQRTOLNK5IUQ7QP3AJQZXDE4RWB3DK3KFPQ@2\m\target\test-classes\run-only-at-execution-root\child2\pom.xml) has 1 error
[ERROR]     Non-resolvable parent POM for org.apache.maven.plugin.rresource.it.mrr41:parent:[unknown-version]: Failure to find org.apache.maven.plugin.rresource.it:it-parent:pom:1.6-SNAPSHOT in http://repository.apache.org/snapshots/ was cached in the local repository, resolution will not be reattempted until the update interval of apache-snapshots has elapsed or updates are forced and 'parent.relativePath' points at wrong local POM @ org.apache.maven.plugin.rresource.it.mrr41:parent:[unknown-version], F:\jenkins\jenkins-slave\workspace\ote-resources-plugin_master-FTEJEAA7J3RSA3RGNRQRTOLNK5IUQ7QP3AJQZXDE4RWB3DK3KFPQ@2\m\target\test-classes\run-only-at-execution-root\pom.xml, line 24, column 11 -> [Help 2]
org.apache.maven.model.resolution.UnresolvableModelException: Failure to find org.apache.maven.plugin.rresource.it:it-parent:pom:1.6-SNAPSHOT in http://repository.apache.org/snapshots/ was cached in the local repository, resolution will not be reattempted until the update interval of apache-snapshots has elapsed or updates are forced
 at org.apache.maven.project.ProjectModelResolver.resolveModel(ProjectModelResolver.java:197)
 at org.apache.maven.project.ProjectModelResolver.resolveModel(ProjectModelResolver.java:243)
 at org.apache.maven.model.building.DefaultModelBuilder.readParentExternally(DefaultModelBuilder.java:1051)
 at org.apache.maven.model.building.DefaultModelBuilder.readParent(DefaultModelBuilder.java:851)
 at org.apache.maven.model.building.DefaultModelBuilder.build(DefaultModelBuilder.java:331)
 at org.apache.maven.project.DefaultProjectBuilder.build(DefaultProjectBuilder.java:429)
 at org.apache.maven.project.DefaultProjectBuilder.build(DefaultProjectBuilder.java:398)
 at org.apache.maven.project.DefaultProjectBuilder.build(DefaultProjectBuilder.java:515)
 at org.apache.maven.project.DefaultProjectBuilder.build(DefaultProjectBuilder.java:398)
 at org.apache.maven.project.DefaultProjectBuilder.build(DefaultProjectBuilder.java:361)
 at org.apache.maven.graph.DefaultGraphBuilder.collectProjects(DefaultGraphBuilder.java:400)
 at org.apache.maven.graph.DefaultGraphBuilder.getProjectsForMavenReactor(DefaultGraphBuilder.java:391)
 at org.apache.maven.graph.DefaultGraphBuilder.build(DefaultGraphBuilder.java:78)
 at org.apache.maven.DefaultMaven.buildGraph(DefaultMaven.java:511)
 at org.apache.maven.DefaultMaven.doExecute(DefaultMaven.java:221)
 at org.apache.maven.DefaultMaven.doExecute(DefaultMaven.java:194)
 at org.apache.maven.DefaultMaven.execute(DefaultMaven.java:107)
 at org.apache.maven.cli.MavenCli.execute(MavenCli.java:993)
 at org.apache.maven.cli.MavenCli.doMain(MavenCli.java:345)
 at org.apache.maven.cli.MavenCli.main(MavenCli.java:191)
 at java.base/jdk.internal.reflect.NativeMethodAccessorImpl.invoke0(Native Method)
 at java.base/jdk.internal.reflect.NativeMethodAccessorImpl.invoke(NativeMethodAccessorImpl.java:62)
 at java.base/jdk.internal.reflect.DelegatingMethodAccessorImpl.invoke(DelegatingMethodAccessorImpl.java:43)
 at java.base/java.lang.reflect.Method.invoke(Method.java:564)
 at org.codehaus.plexus.classworlds.launcher.Launcher.launchEnhanced(Launcher.java:289)
 at org.codehaus.plexus.classworlds.launcher.Launcher.launch(Launcher.java:229)
 at org.codehaus.plexus.classworlds.launcher.Launcher.mainWithExitCode(Launcher.java:415)
 at org.codehaus.plexus.classworlds.launcher.Launcher.main(Launcher.java:356)
Caused by: org.eclipse.aether.resolution.ArtifactResolutionException: Failure to find org.apache.maven.plugin.rresource.it:it-parent:pom:1.6-SNAPSHOT in http://repository.apache.org/snapshots/ was cached in the local repository, resolution will not be reattempted until the update interval of apache-snapshots has elapsed or updates are forced
 at org.eclipse.aether.internal.impl.DefaultArtifactResolver.resolve(DefaultArtifactResolver.java:453)
 at org.eclipse.aether.internal.impl.DefaultArtifactResolver.resolveArtifacts(DefaultArtifactResolver.java:255)
 at org.eclipse.aether.internal.impl.DefaultArtifactResolver.resolveArtifact(DefaultArtifactResolver.java:232)
 at org.eclipse.aether.internal.impl.DefaultRepositorySystem.resolveArtifact(DefaultRepositorySystem.java:303)
 at org.apache.maven.project.ProjectModelResolver.resolveModel(ProjectModelResolver.java:193)
 ... 27 more
Caused by: org.eclipse.aether.transfer.ArtifactNotFoundException: Failure to find org.apache.maven.plugin.rresource.it:it-parent:pom:1.6-SNAPSHOT in http://repository.apache.org/snapshots/ was cached in the local repository, resolution will not be reattempted until the update interval of apache-snapshots has elapsed or updates are forced
 at org.eclipse.aether.internal.impl.DefaultUpdateCheckManager.newException(DefaultUpdateCheckManager.java:240)
 at org.eclipse.aether.internal.impl.DefaultUpdateCheckManager.checkArtifact(DefaultUpdateCheckManager.java:192)
 at org.eclipse.aether.internal.impl.DefaultArtifactResolver.gatherDownloads(DefaultArtifactResolver.java:594)
 at org.eclipse.aether.internal.impl.DefaultArtifactResolver.performDownloads(DefaultArtifactResolver.java:512)
 at org.eclipse.aether.internal.impl.DefaultArtifactResolver.resolve(DefaultArtifactResolver.java:430)
 ... 31 more
[ERROR] 
[ERROR] Re-run Maven using the -X switch to enable full debug logging.
[ERROR] 
[ERROR] For more information about the errors and possible solutions, please read the following articles:
[ERROR] [Help 1] http://cwiki.apache.org/confluence/display/MAVEN/ProjectBuildingException
[ERROR] [Help 2] http://cwiki.apache.org/confluence/display/MAVEN/UnresolvableModelException


Stack Trace:
org.apache.maven.it.VerificationException: 
Exit code was non-zero: 1; command line and log = 
F:\jenkins\tools\maven\apache-maven-3.5.0\bin\mvn -e --batch-mode -Dmaven.repo.local=f:\jenkins\jenkins-slave\workspace\ote-resources-plugin_master-FTEJEAA7J3RSA3RGNRQRTOLNK5IUQ7QP3AJQZXDE4RWB3DK3KFPQ@2\m\target/it-repo org.apache.maven.plugins:maven-clean-plugin:clean generate-resources
Picked up JAVA_TOOL_OPTIONS: -Dmaven.ext.class.path="f:\jenkins\jenkins-slave\workspace\ote-resources-plugin_master-FTEJEAA7J3RSA3RGNRQRTOLNK5IUQ7QP3AJQZXDE4RWB3DK3KFPQ@2@tmp\withMavend8ba7d91\pipeline-maven-spy.jar" -Dorg.jenkinsci.plugins.pipeline.maven.reportsFolder="f:\jenkins\jenkins-slave\workspace\ote-resources-plugin_master-FTEJEAA7J3RSA3RGNRQRTOLNK5IUQ7QP3AJQZXDE4RWB3DK3KFPQ@2@tmp\withMavend8ba7d91" 
[INFO] [jenkins-event-spy] Generate F:\jenkins\jenkins-slave\workspace\ote-resources-plugin_master-FTEJEAA7J3RSA3RGNRQRTOLNK5IUQ7QP3AJQZXDE4RWB3DK3KFPQ@2@tmp\withMavend8ba7d91\maven-spy-20180303-174018-3887484889226421212125.log.tmp ...
[INFO] Error stacktraces are turned on.
[INFO] Scanning for projects...
[INFO] Downloading: http://repository.apache.org/snapshots/org/apache/maven/plugin/rresource/it/it-parent/1.6-SNAPSHOT/maven-metadata.xml
[INFO] Downloading: http://repository.apache.org/snapshots/org/apache/maven/plugin/rresource/it/it-parent/1.6-SNAPSHOT/it-parent-1.6-SNAPSHOT.pom
[ERROR] [ERROR] Some problems were encountered while processing the POMs:
[FATAL] Non-resolvable parent POM for org.apache.maven.plugin.rresource.it.mrr41:parent:[unknown-version]: Could not find artifact org.apache.maven.plugin.rresource.it:it-parent:pom:1.6-SNAPSHOT in apache-snapshots (http://repository.apache.org/snapshots/) and 'parent.relativePath' points at wrong local POM @ org.apache.maven.plugin.rresource.it.mrr41:parent:[unknown-version], F:\jenkins\jenkins-slave\workspace\ote-resources-plugin_master-FTEJEAA7J3RSA3RGNRQRTOLNK5IUQ7QP3AJQZXDE4RWB3DK3KFPQ@2\m\target\test-classes\run-only-at-execution-root\pom.xml, line 24, column 11
[FATAL] Non-resolvable parent POM for org.apache.maven.plugin.rresource.it.mrr41:parent:[unknown-version]: Failure to find org.apache.maven.plugin.rresource.it:it-parent:pom:1.6-SNAPSHOT in http://repository.apache.org/snapshots/ was cached in the local repository, resolution will not be reattempted until the update interval of apache-snapshots has elapsed or updates are forced and 'parent.relativePath' points at wrong local POM @ org.apache.maven.plugin.rresource.it.mrr41:parent:[unknown-version], F:\jenkins\jenkins-slave\workspace\ote-resources-plugin_master-FTEJEAA7J3RSA3RGNRQRTOLNK5IUQ7QP3AJQZXDE4RWB3DK3KFPQ@2\m\target\test-classes\run-only-at-execution-root\pom.xml, line 24, column 11
 @ 
[INFO] [jenkins-event-spy] Generated F:\jenkins\jenkins-slave\workspace\ote-resources-plugin_master-FTEJEAA7J3RSA3RGNRQRTOLNK5IUQ7QP3AJQZXDE4RWB3DK3KFPQ@2@tmp\withMavend8ba7d91\maven-spy-20180303-174018-3887484889226421212125.log
[ERROR] The build could not read 2 projects -> [Help 1]
org.apache.maven.project.ProjectBuildingException: Some problems were encountered while processing the POMs:
[FATAL] Non-resolvable parent POM for org.apache.maven.plugin.rresource.it.mrr41:parent:[unknown-version]: Could not find artifact org.apache.maven.plugin.rresource.it:it-parent:pom:1.6-SNAPSHOT in apache-snapshots (http://repository.apache.org/snapshots/) and 'parent.relativePath' points at wrong local POM @ org.apache.maven.plugin.rresource.it.mrr41:parent:[unknown-version], F:\jenkins\jenkins-slave\workspace\ote-resources-plugin_master-FTEJEAA7J3RSA3RGNRQRTOLNK5IUQ7QP3AJQZXDE4RWB3DK3KFPQ@2\m\target\test-classes\run-only-at-execution-root\pom.xml, line 24, column 11
[FATAL] Non-resolvable parent POM for org.apache.maven.plugin.rresource.it.mrr41:parent:[unknown-version]: Failure to find org.apache.maven.plugin.rresource.it:it-parent:pom:1.6-SNAPSHOT in http://repository.apache.org/snapshots/ was cached in the local repository, resolution will not be reattempted until the update interval of apache-snapshots has elapsed or updates are forced and 'parent.relativePath' points at wrong local POM @ org.apache.maven.plugin.rresource.it.mrr41:parent:[unknown-version], F:\jenkins\jenkins-slave\workspace\ote-resources-plugin_master-FTEJEAA7J3RSA3RGNRQRTOLNK5IUQ7QP3AJQZXDE4RWB3DK3KFPQ@2\m\target\test-classes\run-only-at-execution-root\pom.xml, line 24, column 11

	at org.apache.maven.project.DefaultProjectBuilder.build(DefaultProjectBuilder.java:382)
	at org.apache.maven.graph.DefaultGraphBuilder.collectProjects(DefaultGraphBuilder.java:400)
	at org.apache.maven.graph.DefaultGraphBuilder.getProjectsForMavenReactor(DefaultGraphBuilder.java:391)
	at org.apache.maven.graph.DefaultGraphBuilder.build(DefaultGraphBuilder.java:78)
	at org.apache.maven.DefaultMaven.buildGraph(DefaultMaven.java:511)
	at org.apache.maven.DefaultMaven.doExecute(DefaultMaven.java:221)
	at org.apache.maven.DefaultMaven.doExecute(DefaultMaven.java:194)
	at org.apache.maven.DefaultMaven.execute(DefaultMaven.java:107)
	at org.apache.maven.cli.MavenCli.execute(MavenCli.java:993)
	at org.apache.maven.cli.MavenCli.doMain(MavenCli.java:345)
	at org.apache.maven.cli.MavenCli.main(MavenCli.java:191)
	at java.base/jdk.internal.reflect.NativeMethodAccessorImpl.invoke0(Native Method)
	at java.base/jdk.internal.reflect.NativeMethodAccessorImpl.invoke(NativeMethodAccessorImpl.java:62)
	at java.base/jdk.internal.reflect.DelegatingMethodAccessorImpl.invoke(DelegatingMethodAccessorImpl.java:43)
	at java.base/java.lang.reflect.Method.invoke(Method.java:564)
	at org.codehaus.plexus.classworlds.launcher.Launcher.launchEnhanced(Launcher.java:289)
	at org.codehaus.plexus.classworlds.launcher.Launcher.launch(Launcher.java:229)
	at org.codehaus.plexus.classworlds.launcher.Launcher.mainWithExitCode(Launcher.java:415)
	at org.codehaus.plexus.classworlds.launcher.Launcher.main(Launcher.java:356)
[ERROR]   
[ERROR]   The project org.apache.maven.plugin.rresource.it.mrr41:child-1:[unknown-version] (F:\jenkins\jenkins-slave\workspace\ote-resources-plugin_master-FTEJEAA7J3RSA3RGNRQRTOLNK5IUQ7QP3AJQZXDE4RWB3DK3KFPQ@2\m\target\test-classes\run-only-at-execution-root\child1\pom.xml) has 1 error
[ERROR]     Non-resolvable parent POM for org.apache.maven.plugin.rresource.it.mrr41:parent:[unknown-version]: Could not find artifact org.apache.maven.plugin.rresource.it:it-parent:pom:1.6-SNAPSHOT in apache-snapshots (http://repository.apache.org/snapshots/) and 'parent.relativePath' points at wrong local POM @ org.apache.maven.plugin.rresource.it.mrr41:parent:[unknown-version], F:\jenkins\jenkins-slave\workspace\ote-resources-plugin_master-FTEJEAA7J3RSA3RGNRQRTOLNK5IUQ7QP3AJQZXDE4RWB3DK3KFPQ@2\m\target\test-classes\run-only-at-execution-root\pom.xml, line 24, column 11 -> [Help 2]
org.apache.maven.model.resolution.UnresolvableModelException: Could not find artifact org.apache.maven.plugin.rresource.it:it-parent:pom:1.6-SNAPSHOT in apache-snapshots (http://repository.apache.org/snapshots/)
	at org.apache.maven.project.ProjectModelResolver.resolveModel(ProjectModelResolver.java:197)
	at org.apache.maven.project.ProjectModelResolver.resolveModel(ProjectModelResolver.java:243)
	at org.apache.maven.model.building.DefaultModelBuilder.readParentExternally(DefaultModelBuilder.java:1051)
	at org.apache.maven.model.building.DefaultModelBuilder.readParent(DefaultModelBuilder.java:851)
	at org.apache.maven.model.building.DefaultModelBuilder.build(DefaultModelBuilder.java:331)
	at org.apache.maven.project.DefaultProjectBuilder.build(DefaultProjectBuilder.java:429)
	at org.apache.maven.project.DefaultProjectBuilder.build(DefaultProjectBuilder.java:398)
	at org.apache.maven.project.DefaultProjectBuilder.build(DefaultProjectBuilder.java:515)
	at org.apache.maven.project.DefaultProjectBuilder.build(DefaultProjectBuilder.java:398)
	at org.apache.maven.project.DefaultProjectBuilder.build(DefaultProjectBuilder.java:361)
	at org.apache.maven.graph.DefaultGraphBuilder.collectProjects(DefaultGraphBuilder.java:400)
	at org.apache.maven.graph.DefaultGraphBuilder.getProjectsForMavenReactor(DefaultGraphBuilder.java:391)
	at org.apache.maven.graph.DefaultGraphBuilder.build(DefaultGraphBuilder.java:78)
	at org.apache.maven.DefaultMaven.buildGraph(DefaultMaven.java:511)
	at org.apache.maven.DefaultMaven.doExecute(DefaultMaven.java:221)
	at org.apache.maven.DefaultMaven.doExecute(DefaultMaven.java:194)
	at org.apache.maven.DefaultMaven.execute(DefaultMaven.java:107)
	at org.apache.maven.cli.MavenCli.execute(MavenCli.java:993)
	at org.apache.maven.cli.MavenCli.doMain(MavenCli.java:345)
	at org.apache.maven.cli.MavenCli.main(MavenCli.java:191)
	at java.base/jdk.internal.reflect.NativeMethodAccessorImpl.invoke0(Native Method)
	at java.base/jdk.internal.reflect.NativeMethodAccessorImpl.invoke(NativeMethodAccessorImpl.java:62)
	at java.base/jdk.internal.reflect.DelegatingMethodAccessorImpl.invoke(DelegatingMethodAccessorImpl.java:43)
	at java.base/java.lang.reflect.Method.invoke(Method.java:564)
	at org.codehaus.plexus.classworlds.launcher.Launcher.launchEnhanced(Launcher.java:289)
	at org.codehaus.plexus.classworlds.launcher.Launcher.launch(Launcher.java:229)
	at org.codehaus.plexus.classworlds.launcher.Launcher.mainWithExitCode(Launcher.java:415)
	at org.codehaus.plexus.classworlds.launcher.Launcher.main(Launcher.java:356)
Caused by: org.eclipse.aether.resolution.ArtifactResolutionException: Could not find artifact org.apache.maven.plugin.rresource.it:it-parent:pom:1.6-SNAPSHOT in apache-snapshots (http://repository.apache.org/snapshots/)
	at org.eclipse.aether.internal.impl.DefaultArtifactResolver.resolve(DefaultArtifactResolver.java:453)
	at org.eclipse.aether.internal.impl.DefaultArtifactResolver.resolveArtifacts(DefaultArtifactResolver.java:255)
	at org.eclipse.aether.internal.impl.DefaultArtifactResolver.resolveArtifact(DefaultArtifactResolver.java:232)
	at org.eclipse.aether.internal.impl.DefaultRepositorySystem.resolveArtifact(DefaultRepositorySystem.java:303)
	at org.apache.maven.project.ProjectModelResolver.resolveModel(ProjectModelResolver.java:193)
	... 27 more
Caused by: org.eclipse.aether.transfer.ArtifactNotFoundException: Could not find artifact org.apache.maven.plugin.rresource.it:it-parent:pom:1.6-SNAPSHOT in apache-snapshots (http://repository.apache.org/snapshots/)
	at org.eclipse.aether.connector.basic.ArtifactTransportListener.transferFailed(ArtifactTransportListener.java:48)
	at org.eclipse.aether.connector.basic.BasicRepositoryConnector$TaskRunner.run(BasicRepositoryConnector.java:364)
	at org.eclipse.aether.util.concurrency.RunnableErrorForwarder$1.run(RunnableErrorForwarder.java:76)
	at org.eclipse.aether.connector.basic.BasicRepositoryConnector$DirectExecutor.execute(BasicRepositoryConnector.java:590)
	at org.eclipse.aether.connector.basic.BasicRepositoryConnector.get(BasicRepositoryConnector.java:258)
	at org.eclipse.aether.internal.impl.DefaultArtifactResolver.performDownloads(DefaultArtifactResolver.java:529)
	at org.eclipse.aether.internal.impl.DefaultArtifactResolver.resolve(DefaultArtifactResolver.java:430)
	... 31 more
[ERROR]   
[ERROR]   The project org.apache.maven.plugin.rresource.it.mrr41:child-2:[unknown-version] (F:\jenkins\jenkins-slave\workspace\ote-resources-plugin_master-FTEJEAA7J3RSA3RGNRQRTOLNK5IUQ7QP3AJQZXDE4RWB3DK3KFPQ@2\m\target\test-classes\run-only-at-execution-root\child2\pom.xml) has 1 error
[ERROR]     Non-resolvable parent POM for org.apache.maven.plugin.rresource.it.mrr41:parent:[unknown-version]: Failure to find org.apache.maven.plugin.rresource.it:it-parent:pom:1.6-SNAPSHOT in http://repository.apache.org/snapshots/ was cached in the local repository, resolution will not be reattempted until the update interval of apache-snapshots has elapsed or updates are forced and 'parent.relativePath' points at wrong local POM @ org.apache.maven.plugin.rresource.it.mrr41:parent:[unknown-version], F:\jenkins\jenkins-slave\workspace\ote-resources-plugin_master-FTEJEAA7J3RSA3RGNRQRTOLNK5IUQ7QP3AJQZXDE4RWB3DK3KFPQ@2\m\target\test-classes\run-only-at-execution-root\pom.xml, line 24, column 11 -> [Help 2]
org.apache.maven.model.resolution.UnresolvableModelException: Failure to find org.apache.maven.plugin.rresource.it:it-parent:pom:1.6-SNAPSHOT in http://repository.apache.org/snapshots/ was cached in the local repository, resolution will not be reattempted until the update interval of apache-snapshots has elapsed or updates are forced
	at org.apache.maven.project.ProjectModelResolver.resolveModel(ProjectModelResolver.java:197)
	at org.apache.maven.project.ProjectModelResolver.resolveModel(ProjectModelResolver.java:243)
	at org.apache.maven.model.building.DefaultModelBuilder.readParentExternally(DefaultModelBuilder.java:1051)
	at org.apache.maven.model.building.DefaultModelBuilder.readParent(DefaultModelBuilder.java:851)
	at org.apache.maven.model.building.DefaultModelBuilder.build(DefaultModelBuilder.java:331)
	at org.apache.maven.project.DefaultProjectBuilder.build(DefaultProjectBuilder.java:429)
	at org.apache.maven.project.DefaultProjectBuilder.build(DefaultProjectBuilder.java:398)
	at org.apache.maven.project.DefaultProjectBuilder.build(DefaultProjectBuilder.java:515)
	at org.apache.maven.project.DefaultProjectBuilder.build(DefaultProjectBuilder.java:398)
	at org.apache.maven.project.DefaultProjectBuilder.build(DefaultProjectBuilder.java:361)
	at org.apache.maven.graph.DefaultGraphBuilder.collectProjects(DefaultGraphBuilder.java:400)
	at org.apache.maven.graph.DefaultGraphBuilder.getProjectsForMavenReactor(DefaultGraphBuilder.java:391)
	at org.apache.maven.graph.DefaultGraphBuilder.build(DefaultGraphBuilder.java:78)
	at org.apache.maven.DefaultMaven.buildGraph(DefaultMaven.java:511)
	at org.apache.maven.DefaultMaven.doExecute(DefaultMaven.java:221)
	at org.apache.maven.DefaultMaven.doExecute(DefaultMaven.java:194)
	at org.apache.maven.DefaultMaven.execute(DefaultMaven.java:107)
	at org.apache.maven.cli.MavenCli.execute(MavenCli.java:993)
	at org.apache.maven.cli.MavenCli.doMain(MavenCli.java:345)
	at org.apache.maven.cli.MavenCli.main(MavenCli.java:191)
	at java.base/jdk.internal.reflect.NativeMethodAccessorImpl.invoke0(Native Method)
	at java.base/jdk.internal.reflect.NativeMethodAccessorImpl.invoke(NativeMethodAccessorImpl.java:62)
	at java.base/jdk.internal.reflect.DelegatingMethodAccessorImpl.invoke(DelegatingMethodAccessorImpl.java:43)
	at java.base/java.lang.reflect.Method.invoke(Method.java:564)
	at org.codehaus.plexus.classworlds.launcher.Launcher.launchEnhanced(Launcher.java:289)
	at org.codehaus.plexus.classworlds.launcher.Launcher.launch(Launcher.java:229)
	at org.codehaus.plexus.classworlds.launcher.Launcher.mainWithExitCode(Launcher.java:415)
	at org.codehaus.plexus.classworlds.launcher.Launcher.main(Launcher.java:356)
Caused by: org.eclipse.aether.resolution.ArtifactResolutionException: Failure to find org.apache.maven.plugin.rresource.it:it-parent:pom:1.6-SNAPSHOT in http://repository.apache.org/snapshots/ was cached in the local repository, resolution will not be reattempted until the update interval of apache-snapshots has elapsed or updates are forced
	at org.eclipse.aether.internal.impl.DefaultArtifactResolver.resolve(DefaultArtifactResolver.java:453)
	at org.eclipse.aether.internal.impl.DefaultArtifactResolver.resolveArtifacts(DefaultArtifactResolver.java:255)
	at org.eclipse.aether.internal.impl.DefaultArtifactResolver.resolveArtifact(DefaultArtifactResolver.java:232)
	at org.eclipse.aether.internal.impl.DefaultRepositorySystem.resolveArtifact(DefaultRepositorySystem.java:303)
	at org.apache.maven.project.ProjectModelResolver.resolveModel(ProjectModelResolver.java:193)
	... 27 more
Caused by: org.eclipse.aether.transfer.ArtifactNotFoundException: Failure to find org.apache.maven.plugin.rresource.it:it-parent:pom:1.6-SNAPSHOT in http://repository.apache.org/snapshots/ was cached in the local repository, resolution will not be reattempted until the update interval of apache-snapshots has elapsed or updates are forced
	at org.eclipse.aether.internal.impl.DefaultUpdateCheckManager.newException(DefaultUpdateCheckManager.java:240)
	at org.eclipse.aether.internal.impl.DefaultUpdateCheckManager.checkArtifact(DefaultUpdateCheckManager.java:192)
	at org.eclipse.aether.internal.impl.DefaultArtifactResolver.gatherDownloads(DefaultArtifactResolver.java:594)
	at org.eclipse.aether.internal.impl.DefaultArtifactResolver.performDownloads(DefaultArtifactResolver.java:512)
	at org.eclipse.aether.internal.impl.DefaultArtifactResolver.resolve(DefaultArtifactResolver.java:430)
	... 31 more
[ERROR] 
[ERROR] Re-run Maven using the -X switch to enable full debug logging.
[ERROR] 
[ERROR] For more information about the errors and possible solutions, please read the following articles:
[ERROR] [Help 1] http://cwiki.apache.org/confluence/display/MAVEN/ProjectBuildingException
[ERROR] [Help 2] http://cwiki.apache.org/confluence/display/MAVEN/UnresolvableModelException

	at org.apache.maven.plugin.resources.remote.it.IT_RunOnlyAtExecutionRoot.test(IT_RunOnlyAtExecutionRoot.java:60)


FAILED:  org.apache.maven.plugin.resources.remote.it.IT_RunOnlyAtExecutionRoot.test

Error Message:
Exit code was non-zero: 1; command line and log = 
F:\jenkins\tools\maven\apache-maven-3.5.0\bin\mvn -e --batch-mode -Dmaven.repo.local=f:\jenkins\jenkins-slave\workspace\ote-resources-plugin_master-FTEJEAA7J3RSA3RGNRQRTOLNK5IUQ7QP3AJQZXDE4RWB3DK3KFPQ\m\target/it-repo org.apache.maven.plugins:maven-clean-plugin:clean generate-resources
[INFO] [jenkins-event-spy] Generate F:\jenkins\jenkins-slave\workspace\ote-resources-plugin_master-FTEJEAA7J3RSA3RGNRQRTOLNK5IUQ7QP3AJQZXDE4RWB3DK3KFPQ@tmp\withMaven8364e518\maven-spy-20180303-174025-5724944910089255059347.log.tmp ...
[INFO] Error stacktraces are turned on.
[INFO] Scanning for projects...
[INFO] Downloading: http://repository.apache.org/snapshots/org/apache/maven/plugin/rresource/it/it-parent/1.6-SNAPSHOT/maven-metadata.xml
[INFO] Downloading: http://repository.apache.org/snapshots/org/apache/maven/plugin/rresource/it/it-parent/1.6-SNAPSHOT/it-parent-1.6-SNAPSHOT.pom
[ERROR] [ERROR] Some problems were encountered while processing the POMs:
[FATAL] Non-resolvable parent POM for org.apache.maven.plugin.rresource.it.mrr41:parent:[unknown-version]: Could not find artifact org.apache.maven.plugin.rresource.it:it-parent:pom:1.6-SNAPSHOT in apache-snapshots (http://repository.apache.org/snapshots/) and 'parent.relativePath' points at wrong local POM @ org.apache.maven.plugin.rresource.it.mrr41:parent:[unknown-version], F:\jenkins\jenkins-slave\workspace\ote-resources-plugin_master-FTEJEAA7J3RSA3RGNRQRTOLNK5IUQ7QP3AJQZXDE4RWB3DK3KFPQ\m\target\test-classes\run-only-at-execution-root\pom.xml, line 24, column 11
[FATAL] Non-resolvable parent POM for org.apache.maven.plugin.rresource.it.mrr41:parent:[unknown-version]: Failure to find org.apache.maven.plugin.rresource.it:it-parent:pom:1.6-SNAPSHOT in http://repository.apache.org/snapshots/ was cached in the local repository, resolution will not be reattempted until the update interval of apache-snapshots has elapsed or updates are forced and 'parent.relativePath' points at wrong local POM @ org.apache.maven.plugin.rresource.it.mrr41:parent:[unknown-version], F:\jenkins\jenkins-slave\workspace\ote-resources-plugin_master-FTEJEAA7J3RSA3RGNRQRTOLNK5IUQ7QP3AJQZXDE4RWB3DK3KFPQ\m\target\test-classes\run-only-at-execution-root\pom.xml, line 24, column 11
 @ 
[INFO] [jenkins-event-spy] Generated F:\jenkins\jenkins-slave\workspace\ote-resources-plugin_master-FTEJEAA7J3RSA3RGNRQRTOLNK5IUQ7QP3AJQZXDE4RWB3DK3KFPQ@tmp\withMaven8364e518\maven-spy-20180303-174025-5724944910089255059347.log
[ERROR] The build could not read 2 projects -> [Help 1]
org.apache.maven.project.ProjectBuildingException: Some problems were encountered while processing the POMs:
[FATAL] Non-resolvable parent POM for org.apache.maven.plugin.rresource.it.mrr41:parent:[unknown-version]: Could not find artifact org.apache.maven.plugin.rresource.it:it-parent:pom:1.6-SNAPSHOT in apache-snapshots (http://repository.apache.org/snapshots/) and 'parent.relativePath' points at wrong local POM @ org.apache.maven.plugin.rresource.it.mrr41:parent:[unknown-version], F:\jenkins\jenkins-slave\workspace\ote-resources-plugin_master-FTEJEAA7J3RSA3RGNRQRTOLNK5IUQ7QP3AJQZXDE4RWB3DK3KFPQ\m\target\test-classes\run-only-at-execution-root\pom.xml, line 24, column 11
[FATAL] Non-resolvable parent POM for org.apache.maven.plugin.rresource.it.mrr41:parent:[unknown-version]: Failure to find org.apache.maven.plugin.rresource.it:it-parent:pom:1.6-SNAPSHOT in http://repository.apache.org/snapshots/ was cached in the local repository, resolution will not be reattempted until the update interval of apache-snapshots has elapsed or updates are forced and 'parent.relativePath' points at wrong local POM @ org.apache.maven.plugin.rresource.it.mrr41:parent:[unknown-version], F:\jenkins\jenkins-slave\workspace\ote-resources-plugin_master-FTEJEAA7J3RSA3RGNRQRTOLNK5IUQ7QP3AJQZXDE4RWB3DK3KFPQ\m\target\test-classes\run-only-at-execution-root\pom.xml, line 24, column 11

 at org.apache.maven.project.DefaultProjectBuilder.build(DefaultProjectBuilder.java:382)
 at org.apache.maven.graph.DefaultGraphBuilder.collectProjects(DefaultGraphBuilder.java:400)
 at org.apache.maven.graph.DefaultGraphBuilder.getProjectsForMavenReactor(DefaultGraphBuilder.java:391)
 at org.apache.maven.graph.DefaultGraphBuilder.build(DefaultGraphBuilder.java:78)
 at org.apache.maven.DefaultMaven.buildGraph(DefaultMaven.java:511)
 at org.apache.maven.DefaultMaven.doExecute(DefaultMaven.java:221)
 at org.apache.maven.DefaultMaven.doExecute(DefaultMaven.java:194)
 at org.apache.maven.DefaultMaven.execute(DefaultMaven.java:107)
 at org.apache.maven.cli.MavenCli.execute(MavenCli.java:993)
 at org.apache.maven.cli.MavenCli.doMain(MavenCli.java:345)
 at org.apache.maven.cli.MavenCli.main(MavenCli.java:191)
 at sun.reflect.NativeMethodAccessorImpl.invoke0(Native Method)
 at sun.reflect.NativeMethodAccessorImpl.invoke(NativeMethodAccessorImpl.java:62)
 at sun.reflect.DelegatingMethodAccessorImpl.invoke(DelegatingMethodAccessorImpl.java:43)
 at java.lang.reflect.Method.invoke(Method.java:498)
 at org.codehaus.plexus.classworlds.launcher.Launcher.launchEnhanced(Launcher.java:289)
 at org.codehaus.plexus.classworlds.launcher.Launcher.launch(Launcher.java:229)
 at org.codehaus.plexus.classworlds.launcher.Launcher.mainWithExitCode(Launcher.java:415)
 at org.codehaus.plexus.classworlds.launcher.Launcher.main(Launcher.java:356)
[ERROR]   
[ERROR]   The project org.apache.maven.plugin.rresource.it.mrr41:child-1:[unknown-version] (F:\jenkins\jenkins-slave\workspace\ote-resources-plugin_master-FTEJEAA7J3RSA3RGNRQRTOLNK5IUQ7QP3AJQZXDE4RWB3DK3KFPQ\m\target\test-classes\run-only-at-execution-root\child1\pom.xml) has 1 error
[ERROR]     Non-resolvable parent POM for org.apache.maven.plugin.rresource.it.mrr41:parent:[unknown-version]: Could not find artifact org.apache.maven.plugin.rresource.it:it-parent:pom:1.6-SNAPSHOT in apache-snapshots (http://repository.apache.org/snapshots/) and 'parent.relativePath' points at wrong local POM @ org.apache.maven.plugin.rresource.it.mrr41:parent:[unknown-version], F:\jenkins\jenkins-slave\workspace\ote-resources-plugin_master-FTEJEAA7J3RSA3RGNRQRTOLNK5IUQ7QP3AJQZXDE4RWB3DK3KFPQ\m\target\test-classes\run-only-at-execution-root\pom.xml, line 24, column 11 -> [Help 2]
org.apache.maven.model.resolution.UnresolvableModelException: Could not find artifact org.apache.maven.plugin.rresource.it:it-parent:pom:1.6-SNAPSHOT in apache-snapshots (http://repository.apache.org/snapshots/)
 at org.apache.maven.project.ProjectModelResolver.resolveModel(ProjectModelResolver.java:197)
 at org.apache.maven.project.ProjectModelResolver.resolveModel(ProjectModelResolver.java:243)
 at org.apache.maven.model.building.DefaultModelBuilder.readParentExternally(DefaultModelBuilder.java:1051)
 at org.apache.maven.model.building.DefaultModelBuilder.readParent(DefaultModelBuilder.java:851)
 at org.apache.maven.model.building.DefaultModelBuilder.build(DefaultModelBuilder.java:331)
 at org.apache.maven.project.DefaultProjectBuilder.build(DefaultProjectBuilder.java:429)
 at org.apache.maven.project.DefaultProjectBuilder.build(DefaultProjectBuilder.java:398)
 at org.apache.maven.project.DefaultProjectBuilder.build(DefaultProjectBuilder.java:515)
 at org.apache.maven.project.DefaultProjectBuilder.build(DefaultProjectBuilder.java:398)
 at org.apache.maven.project.DefaultProjectBuilder.build(DefaultProjectBuilder.java:361)
 at org.apache.maven.graph.DefaultGraphBuilder.collectProjects(DefaultGraphBuilder.java:400)
 at org.apache.maven.graph.DefaultGraphBuilder.getProjectsForMavenReactor(DefaultGraphBuilder.java:391)
 at org.apache.maven.graph.DefaultGraphBuilder.build(DefaultGraphBuilder.java:78)
 at org.apache.maven.DefaultMaven.buildGraph(DefaultMaven.java:511)
 at org.apache.maven.DefaultMaven.doExecute(DefaultMaven.java:221)
 at org.apache.maven.DefaultMaven.doExecute(DefaultMaven.java:194)
 at org.apache.maven.DefaultMaven.execute(DefaultMaven.java:107)
 at org.apache.maven.cli.MavenCli.execute(MavenCli.java:993)
 at org.apache.maven.cli.MavenCli.doMain(MavenCli.java:345)
 at org.apache.maven.cli.MavenCli.main(MavenCli.java:191)
 at sun.reflect.NativeMethodAccessorImpl.invoke0(Native Method)
 at sun.reflect.NativeMethodAccessorImpl.invoke(NativeMethodAccessorImpl.java:62)
 at sun.reflect.DelegatingMethodAccessorImpl.invoke(DelegatingMethodAccessorImpl.java:43)
 at java.lang.reflect.Method.invoke(Method.java:498)
 at org.codehaus.plexus.classworlds.launcher.Launcher.launchEnhanced(Launcher.java:289)
 at org.codehaus.plexus.classworlds.launcher.Launcher.launch(Launcher.java:229)
 at org.codehaus.plexus.classworlds.launcher.Launcher.mainWithExitCode(Launcher.java:415)
 at org.codehaus.plexus.classworlds.launcher.Launcher.main(Launcher.java:356)
Caused by: org.eclipse.aether.resolution.ArtifactResolutionException: Could not find artifact org.apache.maven.plugin.rresource.it:it-parent:pom:1.6-SNAPSHOT in apache-snapshots (http://repository.apache.org/snapshots/)
 at org.eclipse.aether.internal.impl.DefaultArtifactResolver.resolve(DefaultArtifactResolver.java:453)
 at org.eclipse.aether.internal.impl.DefaultArtifactResolver.resolveArtifacts(DefaultArtifactResolver.java:255)
 at org.eclipse.aether.internal.impl.DefaultArtifactResolver.resolveArtifact(DefaultArtifactResolver.java:232)
 at org.eclipse.aether.internal.impl.DefaultRepositorySystem.resolveArtifact(DefaultRepositorySystem.java:303)
 at org.apache.maven.project.ProjectModelResolver.resolveModel(ProjectModelResolver.java:193)
 ... 27 more
Caused by: org.eclipse.aether.transfer.ArtifactNotFoundException: Could not find artifact org.apache.maven.plugin.rresource.it:it-parent:pom:1.6-SNAPSHOT in apache-snapshots (http://repository.apache.org/snapshots/)
 at org.eclipse.aether.connector.basic.ArtifactTransportListener.transferFailed(ArtifactTransportListener.java:48)
 at org.eclipse.aether.connector.basic.BasicRepositoryConnector$TaskRunner.run(BasicRepositoryConnector.java:364)
 at org.eclipse.aether.util.concurrency.RunnableErrorForwarder$1.run(RunnableErrorForwarder.java:76)
 at org.eclipse.aether.connector.basic.BasicRepositoryConnector$DirectExecutor.execute(BasicRepositoryConnector.java:590)
 at org.eclipse.aether.connector.basic.BasicRepositoryConnector.get(BasicRepositoryConnector.java:258)
 at org.eclipse.aether.internal.impl.DefaultArtifactResolver.performDownloads(DefaultArtifactResolver.java:529)
 at org.eclipse.aether.internal.impl.DefaultArtifactResolver.resolve(DefaultArtifactResolver.java:430)
 ... 31 more
[ERROR]   
[ERROR]   The project org.apache.maven.plugin.rresource.it.mrr41:child-2:[unknown-version] (F:\jenkins\jenkins-slave\workspace\ote-resources-plugin_master-FTEJEAA7J3RSA3RGNRQRTOLNK5IUQ7QP3AJQZXDE4RWB3DK3KFPQ\m\target\test-classes\run-only-at-execution-root\child2\pom.xml) has 1 error
[ERROR]     Non-resolvable parent POM for org.apache.maven.plugin.rresource.it.mrr41:parent:[unknown-version]: Failure to find org.apache.maven.plugin.rresource.it:it-parent:pom:1.6-SNAPSHOT in http://repository.apache.org/snapshots/ was cached in the local repository, resolution will not be reattempted until the update interval of apache-snapshots has elapsed or updates are forced and 'parent.relativePath' points at wrong local POM @ org.apache.maven.plugin.rresource.it.mrr41:parent:[unknown-version], F:\jenkins\jenkins-slave\workspace\ote-resources-plugin_master-FTEJEAA7J3RSA3RGNRQRTOLNK5IUQ7QP3AJQZXDE4RWB3DK3KFPQ\m\target\test-classes\run-only-at-execution-root\pom.xml, line 24, column 11 -> [Help 2]
org.apache.maven.model.resolution.UnresolvableModelException: Failure to find org.apache.maven.plugin.rresource.it:it-parent:pom:1.6-SNAPSHOT in http://repository.apache.org/snapshots/ was cached in the local repository, resolution will not be reattempted until the update interval of apache-snapshots has elapsed or updates are forced
 at org.apache.maven.project.ProjectModelResolver.resolveModel(ProjectModelResolver.java:197)
 at org.apache.maven.project.ProjectModelResolver.resolveModel(ProjectModelResolver.java:243)
 at org.apache.maven.model.building.DefaultModelBuilder.readParentExternally(DefaultModelBuilder.java:1051)
 at org.apache.maven.model.building.DefaultModelBuilder.readParent(DefaultModelBuilder.java:851)
 at org.apache.maven.model.building.DefaultModelBuilder.build(DefaultModelBuilder.java:331)
 at org.apache.maven.project.DefaultProjectBuilder.build(DefaultProjectBuilder.java:429)
 at org.apache.maven.project.DefaultProjectBuilder.build(DefaultProjectBuilder.java:398)
 at org.apache.maven.project.DefaultProjectBuilder.build(DefaultProjectBuilder.java:515)
 at org.apache.maven.project.DefaultProjectBuilder.build(DefaultProjectBuilder.java:398)
 at org.apache.maven.project.DefaultProjectBuilder.build(DefaultProjectBuilder.java:361)
 at org.apache.maven.graph.DefaultGraphBuilder.collectProjects(DefaultGraphBuilder.java:400)
 at org.apache.maven.graph.DefaultGraphBuilder.getProjectsForMavenReactor(DefaultGraphBuilder.java:391)
 at org.apache.maven.graph.DefaultGraphBuilder.build(DefaultGraphBuilder.java:78)
 at org.apache.maven.DefaultMaven.buildGraph(DefaultMaven.java:511)
 at org.apache.maven.DefaultMaven.doExecute(DefaultMaven.java:221)
 at org.apache.maven.DefaultMaven.doExecute(DefaultMaven.java:194)
 at org.apache.maven.DefaultMaven.execute(DefaultMaven.java:107)
 at org.apache.maven.cli.MavenCli.execute(MavenCli.java:993)
 at org.apache.maven.cli.MavenCli.doMain(MavenCli.java:345)
 at org.apache.maven.cli.MavenCli.main(MavenCli.java:191)
 at sun.reflect.NativeMethodAccessorImpl.invoke0(Native Method)
 at sun.reflect.NativeMethodAccessorImpl.invoke(NativeMethodAccessorImpl.java:62)
 at sun.reflect.DelegatingMethodAccessorImpl.invoke(DelegatingMethodAccessorImpl.java:43)
 at java.lang.reflect.Method.invoke(Method.java:498)
 at org.codehaus.plexus.classworlds.launcher.Launcher.launchEnhanced(Launcher.java:289)
 at org.codehaus.plexus.classworlds.launcher.Launcher.launch(Launcher.java:229)
 at org.codehaus.plexus.classworlds.launcher.Launcher.mainWithExitCode(Launcher.java:415)
 at org.codehaus.plexus.classworlds.launcher.Launcher.main(Launcher.java:356)
Caused by: org.eclipse.aether.resolution.ArtifactResolutionException: Failure to find org.apache.maven.plugin.rresource.it:it-parent:pom:1.6-SNAPSHOT in http://repository.apache.org/snapshots/ was cached in the local repository, resolution will not be reattempted until the update interval of apache-snapshots has elapsed or updates are forced
 at org.eclipse.aether.internal.impl.DefaultArtifactResolver.resolve(DefaultArtifactResolver.java:453)
 at org.eclipse.aether.internal.impl.DefaultArtifactResolver.resolveArtifacts(DefaultArtifactResolver.java:255)
 at org.eclipse.aether.internal.impl.DefaultArtifactResolver.resolveArtifact(DefaultArtifactResolver.java:232)
 at org.eclipse.aether.internal.impl.DefaultRepositorySystem.resolveArtifact(DefaultRepositorySystem.java:303)
 at org.apache.maven.project.ProjectModelResolver.resolveModel(ProjectModelResolver.java:193)
 ... 27 more
Caused by: org.eclipse.aether.transfer.ArtifactNotFoundException: Failure to find org.apache.maven.plugin.rresource.it:it-parent:pom:1.6-SNAPSHOT in http://repository.apache.org/snapshots/ was cached in the local repository, resolution will not be reattempted until the update interval of apache-snapshots has elapsed or updates are forced
 at org.eclipse.aether.internal.impl.DefaultUpdateCheckManager.newException(DefaultUpdateCheckManager.java:240)
 at org.eclipse.aether.internal.impl.DefaultUpdateCheckManager.checkArtifact(DefaultUpdateCheckManager.java:192)
 at org.eclipse.aether.internal.impl.DefaultArtifactResolver.gatherDownloads(DefaultArtifactResolver.java:594)
 at org.eclipse.aether.internal.impl.DefaultArtifactResolver.performDownloads(DefaultArtifactResolver.java:512)
 at org.eclipse.aether.internal.impl.DefaultArtifactResolver.resolve(DefaultArtifactResolver.java:430)
 ... 31 more
[ERROR] 
[ERROR] Re-run Maven using the -X switch to enable full debug logging.
[ERROR] 
[ERROR] For more information about the errors and possible solutions, please read the following articles:
[ERROR] [Help 1] http://cwiki.apache.org/confluence/display/MAVEN/ProjectBuildingException
[ERROR] [Help 2] http://cwiki.apache.org/confluence/display/MAVEN/UnresolvableModelException
Picked up JAVA_TOOL_OPTIONS: -Dmaven.ext.class.path="f:\jenkins\jenkins-slave\workspace\ote-resources-plugin_master-FTEJEAA7J3RSA3RGNRQRTOLNK5IUQ7QP3AJQZXDE4RWB3DK3KFPQ@tmp\withMaven8364e518\pipeline-maven-spy.jar" -Dorg.jenkinsci.plugins.pipeline.maven.reportsFolder="f:\jenkins\jenkins-slave\workspace\ote-resources-plugin_master-FTEJEAA7J3RSA3RGNRQRTOLNK5IUQ7QP3AJQZXDE4RWB3DK3KFPQ@tmp\withMaven8364e518" 


Stack Trace:
org.apache.maven.it.VerificationException: 
Exit code was non-zero: 1; command line and log = 
F:\jenkins\tools\maven\apache-maven-3.5.0\bin\mvn -e --batch-mode -Dmaven.repo.local=f:\jenkins\jenkins-slave\workspace\ote-resources-plugin_master-FTEJEAA7J3RSA3RGNRQRTOLNK5IUQ7QP3AJQZXDE4RWB3DK3KFPQ\m\target/it-repo org.apache.maven.plugins:maven-clean-plugin:clean generate-resources
[INFO] [jenkins-event-spy] Generate F:\jenkins\jenkins-slave\workspace\ote-resources-plugin_master-FTEJEAA7J3RSA3RGNRQRTOLNK5IUQ7QP3AJQZXDE4RWB3DK3KFPQ@tmp\withMaven8364e518\maven-spy-20180303-174025-5724944910089255059347.log.tmp ...
[INFO] Error stacktraces are turned on.
[INFO] Scanning for projects...
[INFO] Downloading: http://repository.apache.org/snapshots/org/apache/maven/plugin/rresource/it/it-parent/1.6-SNAPSHOT/maven-metadata.xml
[INFO] Downloading: http://repository.apache.org/snapshots/org/apache/maven/plugin/rresource/it/it-parent/1.6-SNAPSHOT/it-parent-1.6-SNAPSHOT.pom
[ERROR] [ERROR] Some problems were encountered while processing the POMs:
[FATAL] Non-resolvable parent POM for org.apache.maven.plugin.rresource.it.mrr41:parent:[unknown-version]: Could not find artifact org.apache.maven.plugin.rresource.it:it-parent:pom:1.6-SNAPSHOT in apache-snapshots (http://repository.apache.org/snapshots/) and 'parent.relativePath' points at wrong local POM @ org.apache.maven.plugin.rresource.it.mrr41:parent:[unknown-version], F:\jenkins\jenkins-slave\workspace\ote-resources-plugin_master-FTEJEAA7J3RSA3RGNRQRTOLNK5IUQ7QP3AJQZXDE4RWB3DK3KFPQ\m\target\test-classes\run-only-at-execution-root\pom.xml, line 24, column 11
[FATAL] Non-resolvable parent POM for org.apache.maven.plugin.rresource.it.mrr41:parent:[unknown-version]: Failure to find org.apache.maven.plugin.rresource.it:it-parent:pom:1.6-SNAPSHOT in http://repository.apache.org/snapshots/ was cached in the local repository, resolution will not be reattempted until the update interval of apache-snapshots has elapsed or updates are forced and 'parent.relativePath' points at wrong local POM @ org.apache.maven.plugin.rresource.it.mrr41:parent:[unknown-version], F:\jenkins\jenkins-slave\workspace\ote-resources-plugin_master-FTEJEAA7J3RSA3RGNRQRTOLNK5IUQ7QP3AJQZXDE4RWB3DK3KFPQ\m\target\test-classes\run-only-at-execution-root\pom.xml, line 24, column 11
 @ 
[INFO] [jenkins-event-spy] Generated F:\jenkins\jenkins-slave\workspace\ote-resources-plugin_master-FTEJEAA7J3RSA3RGNRQRTOLNK5IUQ7QP3AJQZXDE4RWB3DK3KFPQ@tmp\withMaven8364e518\maven-spy-20180303-174025-5724944910089255059347.log
[ERROR] The build could not read 2 projects -> [Help 1]
org.apache.maven.project.ProjectBuildingException: Some problems were encountered while processing the POMs:
[FATAL] Non-resolvable parent POM for org.apache.maven.plugin.rresource.it.mrr41:parent:[unknown-version]: Could not find artifact org.apache.maven.plugin.rresource.it:it-parent:pom:1.6-SNAPSHOT in apache-snapshots (http://repository.apache.org/snapshots/) and 'parent.relativePath' points at wrong local POM @ org.apache.maven.plugin.rresource.it.mrr41:parent:[unknown-version], F:\jenkins\jenkins-slave\workspace\ote-resources-plugin_master-FTEJEAA7J3RSA3RGNRQRTOLNK5IUQ7QP3AJQZXDE4RWB3DK3KFPQ\m\target\test-classes\run-only-at-execution-root\pom.xml, line 24, column 11
[FATAL] Non-resolvable parent POM for org.apache.maven.plugin.rresource.it.mrr41:parent:[unknown-version]: Failure to find org.apache.maven.plugin.rresource.it:it-parent:pom:1.6-SNAPSHOT in http://repository.apache.org/snapshots/ was cached in the local repository, resolution will not be reattempted until the update interval of apache-snapshots has elapsed or updates are forced and 'parent.relativePath' points at wrong local POM @ org.apache.maven.plugin.rresource.it.mrr41:parent:[unknown-version], F:\jenkins\jenkins-slave\workspace\ote-resources-plugin_master-FTEJEAA7J3RSA3RGNRQRTOLNK5IUQ7QP3AJQZXDE4RWB3DK3KFPQ\m\target\test-classes\run-only-at-execution-root\pom.xml, line 24, column 11

	at org.apache.maven.project.DefaultProjectBuilder.build(DefaultProjectBuilder.java:382)
	at org.apache.maven.graph.DefaultGraphBuilder.collectProjects(DefaultGraphBuilder.java:400)
	at org.apache.maven.graph.DefaultGraphBuilder.getProjectsForMavenReactor(DefaultGraphBuilder.java:391)
	at org.apache.maven.graph.DefaultGraphBuilder.build(DefaultGraphBuilder.java:78)
	at org.apache.maven.DefaultMaven.buildGraph(DefaultMaven.java:511)
	at org.apache.maven.DefaultMaven.doExecute(DefaultMaven.java:221)
	at org.apache.maven.DefaultMaven.doExecute(DefaultMaven.java:194)
	at org.apache.maven.DefaultMaven.execute(DefaultMaven.java:107)
	at org.apache.maven.cli.MavenCli.execute(MavenCli.java:993)
	at org.apache.maven.cli.MavenCli.doMain(MavenCli.java:345)
	at org.apache.maven.cli.MavenCli.main(MavenCli.java:191)
	at sun.reflect.NativeMethodAccessorImpl.invoke0(Native Method)
	at sun.reflect.NativeMethodAccessorImpl.invoke(NativeMethodAccessorImpl.java:62)
	at sun.reflect.DelegatingMethodAccessorImpl.invoke(DelegatingMethodAccessorImpl.java:43)
	at java.lang.reflect.Method.invoke(Method.java:498)
	at org.codehaus.plexus.classworlds.launcher.Launcher.launchEnhanced(Launcher.java:289)
	at org.codehaus.plexus.classworlds.launcher.Launcher.launch(Launcher.java:229)
	at org.codehaus.plexus.classworlds.launcher.Launcher.mainWithExitCode(Launcher.java:415)
	at org.codehaus.plexus.classworlds.launcher.Launcher.main(Launcher.java:356)
[ERROR]   
[ERROR]   The project org.apache.maven.plugin.rresource.it.mrr41:child-1:[unknown-version] (F:\jenkins\jenkins-slave\workspace\ote-resources-plugin_master-FTEJEAA7J3RSA3RGNRQRTOLNK5IUQ7QP3AJQZXDE4RWB3DK3KFPQ\m\target\test-classes\run-only-at-execution-root\child1\pom.xml) has 1 error
[ERROR]     Non-resolvable parent POM for org.apache.maven.plugin.rresource.it.mrr41:parent:[unknown-version]: Could not find artifact org.apache.maven.plugin.rresource.it:it-parent:pom:1.6-SNAPSHOT in apache-snapshots (http://repository.apache.org/snapshots/) and 'parent.relativePath' points at wrong local POM @ org.apache.maven.plugin.rresource.it.mrr41:parent:[unknown-version], F:\jenkins\jenkins-slave\workspace\ote-resources-plugin_master-FTEJEAA7J3RSA3RGNRQRTOLNK5IUQ7QP3AJQZXDE4RWB3DK3KFPQ\m\target\test-classes\run-only-at-execution-root\pom.xml, line 24, column 11 -> [Help 2]
org.apache.maven.model.resolution.UnresolvableModelException: Could not find artifact org.apache.maven.plugin.rresource.it:it-parent:pom:1.6-SNAPSHOT in apache-snapshots (http://repository.apache.org/snapshots/)
	at org.apache.maven.project.ProjectModelResolver.resolveModel(ProjectModelResolver.java:197)
	at org.apache.maven.project.ProjectModelResolver.resolveModel(ProjectModelResolver.java:243)
	at org.apache.maven.model.building.DefaultModelBuilder.readParentExternally(DefaultModelBuilder.java:1051)
	at org.apache.maven.model.building.DefaultModelBuilder.readParent(DefaultModelBuilder.java:851)
	at org.apache.maven.model.building.DefaultModelBuilder.build(DefaultModelBuilder.java:331)
	at org.apache.maven.project.DefaultProjectBuilder.build(DefaultProjectBuilder.java:429)
	at org.apache.maven.project.DefaultProjectBuilder.build(DefaultProjectBuilder.java:398)
	at org.apache.maven.project.DefaultProjectBuilder.build(DefaultProjectBuilder.java:515)
	at org.apache.maven.project.DefaultProjectBuilder.build(DefaultProjectBuilder.java:398)
	at org.apache.maven.project.DefaultProjectBuilder.build(DefaultProjectBuilder.java:361)
	at org.apache.maven.graph.DefaultGraphBuilder.collectProjects(DefaultGraphBuilder.java:400)
	at org.apache.maven.graph.DefaultGraphBuilder.getProjectsForMavenReactor(DefaultGraphBuilder.java:391)
	at org.apache.maven.graph.DefaultGraphBuilder.build(DefaultGraphBuilder.java:78)
	at org.apache.maven.DefaultMaven.buildGraph(DefaultMaven.java:511)
	at org.apache.maven.DefaultMaven.doExecute(DefaultMaven.java:221)
	at org.apache.maven.DefaultMaven.doExecute(DefaultMaven.java:194)
	at org.apache.maven.DefaultMaven.execute(DefaultMaven.java:107)
	at org.apache.maven.cli.MavenCli.execute(MavenCli.java:993)
	at org.apache.maven.cli.MavenCli.doMain(MavenCli.java:345)
	at org.apache.maven.cli.MavenCli.main(MavenCli.java:191)
	at sun.reflect.NativeMethodAccessorImpl.invoke0(Native Method)
	at sun.reflect.NativeMethodAccessorImpl.invoke(NativeMethodAccessorImpl.java:62)
	at sun.reflect.DelegatingMethodAccessorImpl.invoke(DelegatingMethodAccessorImpl.java:43)
	at java.lang.reflect.Method.invoke(Method.java:498)
	at org.codehaus.plexus.classworlds.launcher.Launcher.launchEnhanced(Launcher.java:289)
	at org.codehaus.plexus.classworlds.launcher.Launcher.launch(Launcher.java:229)
	at org.codehaus.plexus.classworlds.launcher.Launcher.mainWithExitCode(Launcher.java:415)
	at org.codehaus.plexus.classworlds.launcher.Launcher.main(Launcher.java:356)
Caused by: org.eclipse.aether.resolution.ArtifactResolutionException: Could not find artifact org.apache.maven.plugin.rresource.it:it-parent:pom:1.6-SNAPSHOT in apache-snapshots (http://repository.apache.org/snapshots/)
	at org.eclipse.aether.internal.impl.DefaultArtifactResolver.resolve(DefaultArtifactResolver.java:453)
	at org.eclipse.aether.internal.impl.DefaultArtifactResolver.resolveArtifacts(DefaultArtifactResolver.java:255)
	at org.eclipse.aether.internal.impl.DefaultArtifactResolver.resolveArtifact(DefaultArtifactResolver.java:232)
	at org.eclipse.aether.internal.impl.DefaultRepositorySystem.resolveArtifact(DefaultRepositorySystem.java:303)
	at org.apache.maven.project.ProjectModelResolver.resolveModel(ProjectModelResolver.java:193)
	... 27 more
Caused by: org.eclipse.aether.transfer.ArtifactNotFoundException: Could not find artifact org.apache.maven.plugin.rresource.it:it-parent:pom:1.6-SNAPSHOT in apache-snapshots (http://repository.apache.org/snapshots/)
	at org.eclipse.aether.connector.basic.ArtifactTransportListener.transferFailed(ArtifactTransportListener.java:48)
	at org.eclipse.aether.connector.basic.BasicRepositoryConnector$TaskRunner.run(BasicRepositoryConnector.java:364)
	at org.eclipse.aether.util.concurrency.RunnableErrorForwarder$1.run(RunnableErrorForwarder.java:76)
	at org.eclipse.aether.connector.basic.BasicRepositoryConnector$DirectExecutor.execute(BasicRepositoryConnector.java:590)
	at org.eclipse.aether.connector.basic.BasicRepositoryConnector.get(BasicRepositoryConnector.java:258)
	at org.eclipse.aether.internal.impl.DefaultArtifactResolver.performDownloads(DefaultArtifactResolver.java:529)
	at org.eclipse.aether.internal.impl.DefaultArtifactResolver.resolve(DefaultArtifactResolver.java:430)
	... 31 more
[ERROR]   
[ERROR]   The project org.apache.maven.plugin.rresource.it.mrr41:child-2:[unknown-version] (F:\jenkins\jenkins-slave\workspace\ote-resources-plugin_master-FTEJEAA7J3RSA3RGNRQRTOLNK5IUQ7QP3AJQZXDE4RWB3DK3KFPQ\m\target\test-classes\run-only-at-execution-root\child2\pom.xml) has 1 error
[ERROR]     Non-resolvable parent POM for org.apache.maven.plugin.rresource.it.mrr41:parent:[unknown-version]: Failure to find org.apache.maven.plugin.rresource.it:it-parent:pom:1.6-SNAPSHOT in http://repository.apache.org/snapshots/ was cached in the local repository, resolution will not be reattempted until the update interval of apache-snapshots has elapsed or updates are forced and 'parent.relativePath' points at wrong local POM @ org.apache.maven.plugin.rresource.it.mrr41:parent:[unknown-version], F:\jenkins\jenkins-slave\workspace\ote-resources-plugin_master-FTEJEAA7J3RSA3RGNRQRTOLNK5IUQ7QP3AJQZXDE4RWB3DK3KFPQ\m\target\test-classes\run-only-at-execution-root\pom.xml, line 24, column 11 -> [Help 2]
org.apache.maven.model.resolution.UnresolvableModelException: Failure to find org.apache.maven.plugin.rresource.it:it-parent:pom:1.6-SNAPSHOT in http://repository.apache.org/snapshots/ was cached in the local repository, resolution will not be reattempted until the update interval of apache-snapshots has elapsed or updates are forced
	at org.apache.maven.project.ProjectModelResolver.resolveModel(ProjectModelResolver.java:197)
	at org.apache.maven.project.ProjectModelResolver.resolveModel(ProjectModelResolver.java:243)
	at org.apache.maven.model.building.DefaultModelBuilder.readParentExternally(DefaultModelBuilder.java:1051)
	at org.apache.maven.model.building.DefaultModelBuilder.readParent(DefaultModelBuilder.java:851)
	at org.apache.maven.model.building.DefaultModelBuilder.build(DefaultModelBuilder.java:331)
	at org.apache.maven.project.DefaultProjectBuilder.build(DefaultProjectBuilder.java:429)
	at org.apache.maven.project.DefaultProjectBuilder.build(DefaultProjectBuilder.java:398)
	at org.apache.maven.project.DefaultProjectBuilder.build(DefaultProjectBuilder.java:515)
	at org.apache.maven.project.DefaultProjectBuilder.build(DefaultProjectBuilder.java:398)
	at org.apache.maven.project.DefaultProjectBuilder.build(DefaultProjectBuilder.java:361)
	at org.apache.maven.graph.DefaultGraphBuilder.collectProjects(DefaultGraphBuilder.java:400)
	at org.apache.maven.graph.DefaultGraphBuilder.getProjectsForMavenReactor(DefaultGraphBuilder.java:391)
	at org.apache.maven.graph.DefaultGraphBuilder.build(DefaultGraphBuilder.java:78)
	at org.apache.maven.DefaultMaven.buildGraph(DefaultMaven.java:511)
	at org.apache.maven.DefaultMaven.doExecute(DefaultMaven.java:221)
	at org.apache.maven.DefaultMaven.doExecute(DefaultMaven.java:194)
	at org.apache.maven.DefaultMaven.execute(DefaultMaven.java:107)
	at org.apache.maven.cli.MavenCli.execute(MavenCli.java:993)
	at org.apache.maven.cli.MavenCli.doMain(MavenCli.java:345)
	at org.apache.maven.cli.MavenCli.main(MavenCli.java:191)
	at sun.reflect.NativeMethodAccessorImpl.invoke0(Native Method)
	at sun.reflect.NativeMethodAccessorImpl.invoke(NativeMethodAccessorImpl.java:62)
	at sun.reflect.DelegatingMethodAccessorImpl.invoke(DelegatingMethodAccessorImpl.java:43)
	at java.lang.reflect.Method.invoke(Method.java:498)
	at org.codehaus.plexus.classworlds.launcher.Launcher.launchEnhanced(Launcher.java:289)
	at org.codehaus.plexus.classworlds.launcher.Launcher.launch(Launcher.java:229)
	at org.codehaus.plexus.classworlds.launcher.Launcher.mainWithExitCode(Launcher.java:415)
	at org.codehaus.plexus.classworlds.launcher.Launcher.main(Launcher.java:356)
Caused by: org.eclipse.aether.resolution.ArtifactResolutionException: Failure to find org.apache.maven.plugin.rresource.it:it-parent:pom:1.6-SNAPSHOT in http://repository.apache.org/snapshots/ was cached in the local repository, resolution will not be reattempted until the update interval of apache-snapshots has elapsed or updates are forced
	at org.eclipse.aether.internal.impl.DefaultArtifactResolver.resolve(DefaultArtifactResolver.java:453)
	at org.eclipse.aether.internal.impl.DefaultArtifactResolver.resolveArtifacts(DefaultArtifactResolver.java:255)
	at org.eclipse.aether.internal.impl.DefaultArtifactResolver.resolveArtifact(DefaultArtifactResolver.java:232)
	at org.eclipse.aether.internal.impl.DefaultRepositorySystem.resolveArtifact(DefaultRepositorySystem.java:303)
	at org.apache.maven.project.ProjectModelResolver.resolveModel(ProjectModelResolver.java:193)
	... 27 more
Caused by: org.eclipse.aether.transfer.ArtifactNotFoundException: Failure to find org.apache.maven.plugin.rresource.it:it-parent:pom:1.6-SNAPSHOT in http://repository.apache.org/snapshots/ was cached in the local repository, resolution will not be reattempted until the update interval of apache-snapshots has elapsed or updates are forced
	at org.eclipse.aether.internal.impl.DefaultUpdateCheckManager.newException(DefaultUpdateCheckManager.java:240)
	at org.eclipse.aether.internal.impl.DefaultUpdateCheckManager.checkArtifact(DefaultUpdateCheckManager.java:192)
	at org.eclipse.aether.internal.impl.DefaultArtifactResolver.gatherDownloads(DefaultArtifactResolver.java:594)
	at org.eclipse.aether.internal.impl.DefaultArtifactResolver.performDownloads(DefaultArtifactResolver.java:512)
	at org.eclipse.aether.internal.impl.DefaultArtifactResolver.resolve(DefaultArtifactResolver.java:430)
	... 31 more
[ERROR] 
[ERROR] Re-run Maven using the -X switch to enable full debug logging.
[ERROR] 
[ERROR] For more information about the errors and possible solutions, please read the following articles:
[ERROR] [Help 1] http://cwiki.apache.org/confluence/display/MAVEN/ProjectBuildingException
[ERROR] [Help 2] http://cwiki.apache.org/confluence/display/MAVEN/UnresolvableModelException
Picked up JAVA_TOOL_OPTIONS: -Dmaven.ext.class.path="f:\jenkins\jenkins-slave\workspace\ote-resources-plugin_master-FTEJEAA7J3RSA3RGNRQRTOLNK5IUQ7QP3AJQZXDE4RWB3DK3KFPQ@tmp\withMaven8364e518\pipeline-maven-spy.jar" -Dorg.jenkinsci.plugins.pipeline.maven.reportsFolder="f:\jenkins\jenkins-slave\workspace\ote-resources-plugin_master-FTEJEAA7J3RSA3RGNRQRTOLNK5IUQ7QP3AJQZXDE4RWB3DK3KFPQ@tmp\withMaven8364e518" 

	at org.apache.maven.plugin.resources.remote.it.IT_RunOnlyAtExecutionRoot.test(IT_RunOnlyAtExecutionRoot.java:60)


FAILED:  org.apache.maven.plugin.resources.remote.it.IT_RunOnlyAtExecutionRoot.test

Error Message:
Exit code was non-zero: 1; command line and log = 
F:\jenkins\tools\maven\apache-maven-3.5.0\bin\mvn -e --batch-mode -Dmaven.repo.local=f:\jenkins\jenkins-slave\workspace\ote-resources-plugin_master-FTEJEAA7J3RSA3RGNRQRTOLNK5IUQ7QP3AJQZXDE4RWB3DK3KFPQ\m\target/it-repo org.apache.maven.plugins:maven-clean-plugin:clean generate-resources
[INFO] [jenkins-event-spy] Generate F:\jenkins\jenkins-slave\workspace\ote-resources-plugin_master-FTEJEAA7J3RSA3RGNRQRTOLNK5IUQ7QP3AJQZXDE4RWB3DK3KFPQ@tmp\withMaven50b5b628\maven-spy-20180303-174003-814538797645496232462.log.tmp ...
[INFO] Error stacktraces are turned on.
[INFO] Scanning for projects...
[INFO] Downloading: http://repository.apache.org/snapshots/org/apache/maven/plugin/rresource/it/it-parent/1.6-SNAPSHOT/maven-metadata.xml
[INFO] Downloading: http://repository.apache.org/snapshots/org/apache/maven/plugin/rresource/it/it-parent/1.6-SNAPSHOT/it-parent-1.6-SNAPSHOT.pom
[ERROR] [ERROR] Some problems were encountered while processing the POMs:
[FATAL] Non-resolvable parent POM for org.apache.maven.plugin.rresource.it.mrr41:parent:[unknown-version]: Could not find artifact org.apache.maven.plugin.rresource.it:it-parent:pom:1.6-SNAPSHOT in apache-snapshots (http://repository.apache.org/snapshots/) and 'parent.relativePath' points at wrong local POM @ org.apache.maven.plugin.rresource.it.mrr41:parent:[unknown-version], F:\jenkins\jenkins-slave\workspace\ote-resources-plugin_master-FTEJEAA7J3RSA3RGNRQRTOLNK5IUQ7QP3AJQZXDE4RWB3DK3KFPQ\m\target\test-classes\run-only-at-execution-root\pom.xml, line 24, column 11
[FATAL] Non-resolvable parent POM for org.apache.maven.plugin.rresource.it.mrr41:parent:[unknown-version]: Failure to find org.apache.maven.plugin.rresource.it:it-parent:pom:1.6-SNAPSHOT in http://repository.apache.org/snapshots/ was cached in the local repository, resolution will not be reattempted until the update interval of apache-snapshots has elapsed or updates are forced and 'parent.relativePath' points at wrong local POM @ org.apache.maven.plugin.rresource.it.mrr41:parent:[unknown-version], F:\jenkins\jenkins-slave\workspace\ote-resources-plugin_master-FTEJEAA7J3RSA3RGNRQRTOLNK5IUQ7QP3AJQZXDE4RWB3DK3KFPQ\m\target\test-classes\run-only-at-execution-root\pom.xml, line 24, column 11
 @ 
[INFO] [jenkins-event-spy] Generated F:\jenkins\jenkins-slave\workspace\ote-resources-plugin_master-FTEJEAA7J3RSA3RGNRQRTOLNK5IUQ7QP3AJQZXDE4RWB3DK3KFPQ@tmp\withMaven50b5b628\maven-spy-20180303-174003-814538797645496232462.log
[ERROR] The build could not read 2 projects -> [Help 1]
org.apache.maven.project.ProjectBuildingException: Some problems were encountered while processing the POMs:
[FATAL] Non-resolvable parent POM for org.apache.maven.plugin.rresource.it.mrr41:parent:[unknown-version]: Could not find artifact org.apache.maven.plugin.rresource.it:it-parent:pom:1.6-SNAPSHOT in apache-snapshots (http://repository.apache.org/snapshots/) and 'parent.relativePath' points at wrong local POM @ org.apache.maven.plugin.rresource.it.mrr41:parent:[unknown-version], F:\jenkins\jenkins-slave\workspace\ote-resources-plugin_master-FTEJEAA7J3RSA3RGNRQRTOLNK5IUQ7QP3AJQZXDE4RWB3DK3KFPQ\m\target\test-classes\run-only-at-execution-root\pom.xml, line 24, column 11
[FATAL] Non-resolvable parent POM for org.apache.maven.plugin.rresource.it.mrr41:parent:[unknown-version]: Failure to find org.apache.maven.plugin.rresource.it:it-parent:pom:1.6-SNAPSHOT in http://repository.apache.org/snapshots/ was cached in the local repository, resolution will not be reattempted until the update interval of apache-snapshots has elapsed or updates are forced and 'parent.relativePath' points at wrong local POM @ org.apache.maven.plugin.rresource.it.mrr41:parent:[unknown-version], F:\jenkins\jenkins-slave\workspace\ote-resources-plugin_master-FTEJEAA7J3RSA3RGNRQRTOLNK5IUQ7QP3AJQZXDE4RWB3DK3KFPQ\m\target\test-classes\run-only-at-execution-root\pom.xml, line 24, column 11

 at org.apache.maven.project.DefaultProjectBuilder.build(DefaultProjectBuilder.java:382)
 at org.apache.maven.graph.DefaultGraphBuilder.collectProjects(DefaultGraphBuilder.java:400)
 at org.apache.maven.graph.DefaultGraphBuilder.getProjectsForMavenReactor(DefaultGraphBuilder.java:391)
 at org.apache.maven.graph.DefaultGraphBuilder.build(DefaultGraphBuilder.java:78)
 at org.apache.maven.DefaultMaven.buildGraph(DefaultMaven.java:511)
 at org.apache.maven.DefaultMaven.doExecute(DefaultMaven.java:221)
 at org.apache.maven.DefaultMaven.doExecute(DefaultMaven.java:194)
 at org.apache.maven.DefaultMaven.execute(DefaultMaven.java:107)
 at org.apache.maven.cli.MavenCli.execute(MavenCli.java:993)
 at org.apache.maven.cli.MavenCli.doMain(MavenCli.java:345)
 at org.apache.maven.cli.MavenCli.main(MavenCli.java:191)
 at sun.reflect.NativeMethodAccessorImpl.invoke0(Native Method)
 at sun.reflect.NativeMethodAccessorImpl.invoke(NativeMethodAccessorImpl.java:57)
 at sun.reflect.DelegatingMethodAccessorImpl.invoke(DelegatingMethodAccessorImpl.java:43)
 at java.lang.reflect.Method.invoke(Method.java:606)
 at org.codehaus.plexus.classworlds.launcher.Launcher.launchEnhanced(Launcher.java:289)
 at org.codehaus.plexus.classworlds.launcher.Launcher.launch(Launcher.java:229)
 at org.codehaus.plexus.classworlds.launcher.Launcher.mainWithExitCode(Launcher.java:415)
 at org.codehaus.plexus.classworlds.launcher.Launcher.main(Launcher.java:356)
[ERROR]   
[ERROR]   The project org.apache.maven.plugin.rresource.it.mrr41:child-1:[unknown-version] (F:\jenkins\jenkins-slave\workspace\ote-resources-plugin_master-FTEJEAA7J3RSA3RGNRQRTOLNK5IUQ7QP3AJQZXDE4RWB3DK3KFPQ\m\target\test-classes\run-only-at-execution-root\child1\pom.xml) has 1 error
[ERROR]     Non-resolvable parent POM for org.apache.maven.plugin.rresource.it.mrr41:parent:[unknown-version]: Could not find artifact org.apache.maven.plugin.rresource.it:it-parent:pom:1.6-SNAPSHOT in apache-snapshots (http://repository.apache.org/snapshots/) and 'parent.relativePath' points at wrong local POM @ org.apache.maven.plugin.rresource.it.mrr41:parent:[unknown-version], F:\jenkins\jenkins-slave\workspace\ote-resources-plugin_master-FTEJEAA7J3RSA3RGNRQRTOLNK5IUQ7QP3AJQZXDE4RWB3DK3KFPQ\m\target\test-classes\run-only-at-execution-root\pom.xml, line 24, column 11 -> [Help 2]
org.apache.maven.model.resolution.UnresolvableModelException: Could not find artifact org.apache.maven.plugin.rresource.it:it-parent:pom:1.6-SNAPSHOT in apache-snapshots (http://repository.apache.org/snapshots/)
 at org.apache.maven.project.ProjectModelResolver.resolveModel(ProjectModelResolver.java:197)
 at org.apache.maven.project.ProjectModelResolver.resolveModel(ProjectModelResolver.java:243)
 at org.apache.maven.model.building.DefaultModelBuilder.readParentExternally(DefaultModelBuilder.java:1051)
 at org.apache.maven.model.building.DefaultModelBuilder.readParent(DefaultModelBuilder.java:851)
 at org.apache.maven.model.building.DefaultModelBuilder.build(DefaultModelBuilder.java:331)
 at org.apache.maven.project.DefaultProjectBuilder.build(DefaultProjectBuilder.java:429)
 at org.apache.maven.project.DefaultProjectBuilder.build(DefaultProjectBuilder.java:398)
 at org.apache.maven.project.DefaultProjectBuilder.build(DefaultProjectBuilder.java:515)
 at org.apache.maven.project.DefaultProjectBuilder.build(DefaultProjectBuilder.java:398)
 at org.apache.maven.project.DefaultProjectBuilder.build(DefaultProjectBuilder.java:361)
 at org.apache.maven.graph.DefaultGraphBuilder.collectProjects(DefaultGraphBuilder.java:400)
 at org.apache.maven.graph.DefaultGraphBuilder.getProjectsForMavenReactor(DefaultGraphBuilder.java:391)
 at org.apache.maven.graph.DefaultGraphBuilder.build(DefaultGraphBuilder.java:78)
 at org.apache.maven.DefaultMaven.buildGraph(DefaultMaven.java:511)
 at org.apache.maven.DefaultMaven.doExecute(DefaultMaven.java:221)
 at org.apache.maven.DefaultMaven.doExecute(DefaultMaven.java:194)
 at org.apache.maven.DefaultMaven.execute(DefaultMaven.java:107)
 at org.apache.maven.cli.MavenCli.execute(MavenCli.java:993)
 at org.apache.maven.cli.MavenCli.doMain(MavenCli.java:345)
 at org.apache.maven.cli.MavenCli.main(MavenCli.java:191)
 at sun.reflect.NativeMethodAccessorImpl.invoke0(Native Method)
 at sun.reflect.NativeMethodAccessorImpl.invoke(NativeMethodAccessorImpl.java:57)
 at sun.reflect.DelegatingMethodAccessorImpl.invoke(DelegatingMethodAccessorImpl.java:43)
 at java.lang.reflect.Method.invoke(Method.java:606)
 at org.codehaus.plexus.classworlds.launcher.Launcher.launchEnhanced(Launcher.java:289)
 at org.codehaus.plexus.classworlds.launcher.Launcher.launch(Launcher.java:229)
 at org.codehaus.plexus.classworlds.launcher.Launcher.mainWithExitCode(Launcher.java:415)
 at org.codehaus.plexus.classworlds.launcher.Launcher.main(Launcher.java:356)
Caused by: org.eclipse.aether.resolution.ArtifactResolutionException: Could not find artifact org.apache.maven.plugin.rresource.it:it-parent:pom:1.6-SNAPSHOT in apache-snapshots (http://repository.apache.org/snapshots/)
 at org.eclipse.aether.internal.impl.DefaultArtifactResolver.resolve(DefaultArtifactResolver.java:453)
 at org.eclipse.aether.internal.impl.DefaultArtifactResolver.resolveArtifacts(DefaultArtifactResolver.java:255)
 at org.eclipse.aether.internal.impl.DefaultArtifactResolver.resolveArtifact(DefaultArtifactResolver.java:232)
 at org.eclipse.aether.internal.impl.DefaultRepositorySystem.resolveArtifact(DefaultRepositorySystem.java:303)
 at org.apache.maven.project.ProjectModelResolver.resolveModel(ProjectModelResolver.java:193)
 ... 27 more
Caused by: org.eclipse.aether.transfer.ArtifactNotFoundException: Could not find artifact org.apache.maven.plugin.rresource.it:it-parent:pom:1.6-SNAPSHOT in apache-snapshots (http://repository.apache.org/snapshots/)
 at org.eclipse.aether.connector.basic.ArtifactTransportListener.transferFailed(ArtifactTransportListener.java:48)
 at org.eclipse.aether.connector.basic.BasicRepositoryConnector$TaskRunner.run(BasicRepositoryConnector.java:364)
 at org.eclipse.aether.util.concurrency.RunnableErrorForwarder$1.run(RunnableErrorForwarder.java:76)
 at org.eclipse.aether.connector.basic.BasicRepositoryConnector$DirectExecutor.execute(BasicRepositoryConnector.java:590)
 at org.eclipse.aether.connector.basic.BasicRepositoryConnector.get(BasicRepositoryConnector.java:258)
 at org.eclipse.aether.internal.impl.DefaultArtifactResolver.performDownloads(DefaultArtifactResolver.java:529)
 at org.eclipse.aether.internal.impl.DefaultArtifactResolver.resolve(DefaultArtifactResolver.java:430)
 ... 31 more
[ERROR]   
[ERROR]   The project org.apache.maven.plugin.rresource.it.mrr41:child-2:[unknown-version] (F:\jenkins\jenkins-slave\workspace\ote-resources-plugin_master-FTEJEAA7J3RSA3RGNRQRTOLNK5IUQ7QP3AJQZXDE4RWB3DK3KFPQ\m\target\test-classes\run-only-at-execution-root\child2\pom.xml) has 1 error
[ERROR]     Non-resolvable parent POM for org.apache.maven.plugin.rresource.it.mrr41:parent:[unknown-version]: Failure to find org.apache.maven.plugin.rresource.it:it-parent:pom:1.6-SNAPSHOT in http://repository.apache.org/snapshots/ was cached in the local repository, resolution will not be reattempted until the update interval of apache-snapshots has elapsed or updates are forced and 'parent.relativePath' points at wrong local POM @ org.apache.maven.plugin.rresource.it.mrr41:parent:[unknown-version], F:\jenkins\jenkins-slave\workspace\ote-resources-plugin_master-FTEJEAA7J3RSA3RGNRQRTOLNK5IUQ7QP3AJQZXDE4RWB3DK3KFPQ\m\target\test-classes\run-only-at-execution-root\pom.xml, line 24, column 11 -> [Help 2]
org.apache.maven.model.resolution.UnresolvableModelException: Failure to find org.apache.maven.plugin.rresource.it:it-parent:pom:1.6-SNAPSHOT in http://repository.apache.org/snapshots/ was cached in the local repository, resolution will not be reattempted until the update interval of apache-snapshots has elapsed or updates are forced
 at org.apache.maven.project.ProjectModelResolver.resolveModel(ProjectModelResolver.java:197)
 at org.apache.maven.project.ProjectModelResolver.resolveModel(ProjectModelResolver.java:243)
 at org.apache.maven.model.building.DefaultModelBuilder.readParentExternally(DefaultModelBuilder.java:1051)
 at org.apache.maven.model.building.DefaultModelBuilder.readParent(DefaultModelBuilder.java:851)
 at org.apache.maven.model.building.DefaultModelBuilder.build(DefaultModelBuilder.java:331)
 at org.apache.maven.project.DefaultProjectBuilder.build(DefaultProjectBuilder.java:429)
 at org.apache.maven.project.DefaultProjectBuilder.build(DefaultProjectBuilder.java:398)
 at org.apache.maven.project.DefaultProjectBuilder.build(DefaultProjectBuilder.java:515)
 at org.apache.maven.project.DefaultProjectBuilder.build(DefaultProjectBuilder.java:398)
 at org.apache.maven.project.DefaultProjectBuilder.build(DefaultProjectBuilder.java:361)
 at org.apache.maven.graph.DefaultGraphBuilder.collectProjects(DefaultGraphBuilder.java:400)
 at org.apache.maven.graph.DefaultGraphBuilder.getProjectsForMavenReactor(DefaultGraphBuilder.java:391)
 at org.apache.maven.graph.DefaultGraphBuilder.build(DefaultGraphBuilder.java:78)
 at org.apache.maven.DefaultMaven.buildGraph(DefaultMaven.java:511)
 at org.apache.maven.DefaultMaven.doExecute(DefaultMaven.java:221)
 at org.apache.maven.DefaultMaven.doExecute(DefaultMaven.java:194)
 at org.apache.maven.DefaultMaven.execute(DefaultMaven.java:107)
 at org.apache.maven.cli.MavenCli.execute(MavenCli.java:993)
 at org.apache.maven.cli.MavenCli.doMain(MavenCli.java:345)
 at org.apache.maven.cli.MavenCli.main(MavenCli.java:191)
 at sun.reflect.NativeMethodAccessorImpl.invoke0(Native Method)
 at sun.reflect.NativeMethodAccessorImpl.invoke(NativeMethodAccessorImpl.java:57)
 at sun.reflect.DelegatingMethodAccessorImpl.invoke(DelegatingMethodAccessorImpl.java:43)
 at java.lang.reflect.Method.invoke(Method.java:606)
 at org.codehaus.plexus.classworlds.launcher.Launcher.launchEnhanced(Launcher.java:289)
 at org.codehaus.plexus.classworlds.launcher.Launcher.launch(Launcher.java:229)
 at org.codehaus.plexus.classworlds.launcher.Launcher.mainWithExitCode(Launcher.java:415)
 at org.codehaus.plexus.classworlds.launcher.Launcher.main(Launcher.java:356)
Caused by: org.eclipse.aether.resolution.ArtifactResolutionException: Failure to find org.apache.maven.plugin.rresource.it:it-parent:pom:1.6-SNAPSHOT in http://repository.apache.org/snapshots/ was cached in the local repository, resolution will not be reattempted until the update interval of apache-snapshots has elapsed or updates are forced
 at org.eclipse.aether.internal.impl.DefaultArtifactResolver.resolve(DefaultArtifactResolver.java:453)
 at org.eclipse.aether.internal.impl.DefaultArtifactResolver.resolveArtifacts(DefaultArtifactResolver.java:255)
 at org.eclipse.aether.internal.impl.DefaultArtifactResolver.resolveArtifact(DefaultArtifactResolver.java:232)
 at org.eclipse.aether.internal.impl.DefaultRepositorySystem.resolveArtifact(DefaultRepositorySystem.java:303)
 at org.apache.maven.project.ProjectModelResolver.resolveModel(ProjectModelResolver.java:193)
 ... 27 more
Caused by: org.eclipse.aether.transfer.ArtifactNotFoundException: Failure to find org.apache.maven.plugin.rresource.it:it-parent:pom:1.6-SNAPSHOT in http://repository.apache.org/snapshots/ was cached in the local repository, resolution will not be reattempted until the update interval of apache-snapshots has elapsed or updates are forced
 at org.eclipse.aether.internal.impl.DefaultUpdateCheckManager.newException(DefaultUpdateCheckManager.java:240)
 at org.eclipse.aether.internal.impl.DefaultUpdateCheckManager.checkArtifact(DefaultUpdateCheckManager.java:192)
 at org.eclipse.aether.internal.impl.DefaultArtifactResolver.gatherDownloads(DefaultArtifactResolver.java:594)
 at org.eclipse.aether.internal.impl.DefaultArtifactResolver.performDownloads(DefaultArtifactResolver.java:512)
 at org.eclipse.aether.internal.impl.DefaultArtifactResolver.resolve(DefaultArtifactResolver.java:430)
 ... 31 more
[ERROR] 
[ERROR] Re-run Maven using the -X switch to enable full debug logging.
[ERROR] 
[ERROR] For more information about the errors and possible solutions, please read the following articles:
[ERROR] [Help 1] http://cwiki.apache.org/confluence/display/MAVEN/ProjectBuildingException
[ERROR] [Help 2] http://cwiki.apache.org/confluence/display/MAVEN/UnresolvableModelException
Picked up JAVA_TOOL_OPTIONS: -Dmaven.ext.class.path="f:\jenkins\jenkins-slave\workspace\ote-resources-plugin_master-FTEJEAA7J3RSA3RGNRQRTOLNK5IUQ7QP3AJQZXDE4RWB3DK3KFPQ@tmp\withMaven50b5b628\pipeline-maven-spy.jar" -Dorg.jenkinsci.plugins.pipeline.maven.reportsFolder="f:\jenkins\jenkins-slave\workspace\ote-resources-plugin_master-FTEJEAA7J3RSA3RGNRQRTOLNK5IUQ7QP3AJQZXDE4RWB3DK3KFPQ@tmp\withMaven50b5b628" 


Stack Trace:
org.apache.maven.it.VerificationException: 
Exit code was non-zero: 1; command line and log = 
F:\jenkins\tools\maven\apache-maven-3.5.0\bin\mvn -e --batch-mode -Dmaven.repo.local=f:\jenkins\jenkins-slave\workspace\ote-resources-plugin_master-FTEJEAA7J3RSA3RGNRQRTOLNK5IUQ7QP3AJQZXDE4RWB3DK3KFPQ\m\target/it-repo org.apache.maven.plugins:maven-clean-plugin:clean generate-resources
[INFO] [jenkins-event-spy] Generate F:\jenkins\jenkins-slave\workspace\ote-resources-plugin_master-FTEJEAA7J3RSA3RGNRQRTOLNK5IUQ7QP3AJQZXDE4RWB3DK3KFPQ@tmp\withMaven50b5b628\maven-spy-20180303-174003-814538797645496232462.log.tmp ...
[INFO] Error stacktraces are turned on.
[INFO] Scanning for projects...
[INFO] Downloading: http://repository.apache.org/snapshots/org/apache/maven/plugin/rresource/it/it-parent/1.6-SNAPSHOT/maven-metadata.xml
[INFO] Downloading: http://repository.apache.org/snapshots/org/apache/maven/plugin/rresource/it/it-parent/1.6-SNAPSHOT/it-parent-1.6-SNAPSHOT.pom
[ERROR] [ERROR] Some problems were encountered while processing the POMs:
[FATAL] Non-resolvable parent POM for org.apache.maven.plugin.rresource.it.mrr41:parent:[unknown-version]: Could not find artifact org.apache.maven.plugin.rresource.it:it-parent:pom:1.6-SNAPSHOT in apache-snapshots (http://repository.apache.org/snapshots/) and 'parent.relativePath' points at wrong local POM @ org.apache.maven.plugin.rresource.it.mrr41:parent:[unknown-version], F:\jenkins\jenkins-slave\workspace\ote-resources-plugin_master-FTEJEAA7J3RSA3RGNRQRTOLNK5IUQ7QP3AJQZXDE4RWB3DK3KFPQ\m\target\test-classes\run-only-at-execution-root\pom.xml, line 24, column 11
[FATAL] Non-resolvable parent POM for org.apache.maven.plugin.rresource.it.mrr41:parent:[unknown-version]: Failure to find org.apache.maven.plugin.rresource.it:it-parent:pom:1.6-SNAPSHOT in http://repository.apache.org/snapshots/ was cached in the local repository, resolution will not be reattempted until the update interval of apache-snapshots has elapsed or updates are forced and 'parent.relativePath' points at wrong local POM @ org.apache.maven.plugin.rresource.it.mrr41:parent:[unknown-version], F:\jenkins\jenkins-slave\workspace\ote-resources-plugin_master-FTEJEAA7J3RSA3RGNRQRTOLNK5IUQ7QP3AJQZXDE4RWB3DK3KFPQ\m\target\test-classes\run-only-at-execution-root\pom.xml, line 24, column 11
 @ 
[INFO] [jenkins-event-spy] Generated F:\jenkins\jenkins-slave\workspace\ote-resources-plugin_master-FTEJEAA7J3RSA3RGNRQRTOLNK5IUQ7QP3AJQZXDE4RWB3DK3KFPQ@tmp\withMaven50b5b628\maven-spy-20180303-174003-814538797645496232462.log
[ERROR] The build could not read 2 projects -> [Help 1]
org.apache.maven.project.ProjectBuildingException: Some problems were encountered while processing the POMs:
[FATAL] Non-resolvable parent POM for org.apache.maven.plugin.rresource.it.mrr41:parent:[unknown-version]: Could not find artifact org.apache.maven.plugin.rresource.it:it-parent:pom:1.6-SNAPSHOT in apache-snapshots (http://repository.apache.org/snapshots/) and 'parent.relativePath' points at wrong local POM @ org.apache.maven.plugin.rresource.it.mrr41:parent:[unknown-version], F:\jenkins\jenkins-slave\workspace\ote-resources-plugin_master-FTEJEAA7J3RSA3RGNRQRTOLNK5IUQ7QP3AJQZXDE4RWB3DK3KFPQ\m\target\test-classes\run-only-at-execution-root\pom.xml, line 24, column 11
[FATAL] Non-resolvable parent POM for org.apache.maven.plugin.rresource.it.mrr41:parent:[unknown-version]: Failure to find org.apache.maven.plugin.rresource.it:it-parent:pom:1.6-SNAPSHOT in http://repository.apache.org/snapshots/ was cached in the local repository, resolution will not be reattempted until the update interval of apache-snapshots has elapsed or updates are forced and 'parent.relativePath' points at wrong local POM @ org.apache.maven.plugin.rresource.it.mrr41:parent:[unknown-version], F:\jenkins\jenkins-slave\workspace\ote-resources-plugin_master-FTEJEAA7J3RSA3RGNRQRTOLNK5IUQ7QP3AJQZXDE4RWB3DK3KFPQ\m\target\test-classes\run-only-at-execution-root\pom.xml, line 24, column 11

	at org.apache.maven.project.DefaultProjectBuilder.build(DefaultProjectBuilder.java:382)
	at org.apache.maven.graph.DefaultGraphBuilder.collectProjects(DefaultGraphBuilder.java:400)
	at org.apache.maven.graph.DefaultGraphBuilder.getProjectsForMavenReactor(DefaultGraphBuilder.java:391)
	at org.apache.maven.graph.DefaultGraphBuilder.build(DefaultGraphBuilder.java:78)
	at org.apache.maven.DefaultMaven.buildGraph(DefaultMaven.java:511)
	at org.apache.maven.DefaultMaven.doExecute(DefaultMaven.java:221)
	at org.apache.maven.DefaultMaven.doExecute(DefaultMaven.java:194)
	at org.apache.maven.DefaultMaven.execute(DefaultMaven.java:107)
	at org.apache.maven.cli.MavenCli.execute(MavenCli.java:993)
	at org.apache.maven.cli.MavenCli.doMain(MavenCli.java:345)
	at org.apache.maven.cli.MavenCli.main(MavenCli.java:191)
	at sun.reflect.NativeMethodAccessorImpl.invoke0(Native Method)
	at sun.reflect.NativeMethodAccessorImpl.invoke(NativeMethodAccessorImpl.java:57)
	at sun.reflect.DelegatingMethodAccessorImpl.invoke(DelegatingMethodAccessorImpl.java:43)
	at java.lang.reflect.Method.invoke(Method.java:606)
	at org.codehaus.plexus.classworlds.launcher.Launcher.launchEnhanced(Launcher.java:289)
	at org.codehaus.plexus.classworlds.launcher.Launcher.launch(Launcher.java:229)
	at org.codehaus.plexus.classworlds.launcher.Launcher.mainWithExitCode(Launcher.java:415)
	at org.codehaus.plexus.classworlds.launcher.Launcher.main(Launcher.java:356)
[ERROR]   
[ERROR]   The project org.apache.maven.plugin.rresource.it.mrr41:child-1:[unknown-version] (F:\jenkins\jenkins-slave\workspace\ote-resources-plugin_master-FTEJEAA7J3RSA3RGNRQRTOLNK5IUQ7QP3AJQZXDE4RWB3DK3KFPQ\m\target\test-classes\run-only-at-execution-root\child1\pom.xml) has 1 error
[ERROR]     Non-resolvable parent POM for org.apache.maven.plugin.rresource.it.mrr41:parent:[unknown-version]: Could not find artifact org.apache.maven.plugin.rresource.it:it-parent:pom:1.6-SNAPSHOT in apache-snapshots (http://repository.apache.org/snapshots/) and 'parent.relativePath' points at wrong local POM @ org.apache.maven.plugin.rresource.it.mrr41:parent:[unknown-version], F:\jenkins\jenkins-slave\workspace\ote-resources-plugin_master-FTEJEAA7J3RSA3RGNRQRTOLNK5IUQ7QP3AJQZXDE4RWB3DK3KFPQ\m\target\test-classes\run-only-at-execution-root\pom.xml, line 24, column 11 -> [Help 2]
org.apache.maven.model.resolution.UnresolvableModelException: Could not find artifact org.apache.maven.plugin.rresource.it:it-parent:pom:1.6-SNAPSHOT in apache-snapshots (http://repository.apache.org/snapshots/)
	at org.apache.maven.project.ProjectModelResolver.resolveModel(ProjectModelResolver.java:197)
	at org.apache.maven.project.ProjectModelResolver.resolveModel(ProjectModelResolver.java:243)
	at org.apache.maven.model.building.DefaultModelBuilder.readParentExternally(DefaultModelBuilder.java:1051)
	at org.apache.maven.model.building.DefaultModelBuilder.readParent(DefaultModelBuilder.java:851)
	at org.apache.maven.model.building.DefaultModelBuilder.build(DefaultModelBuilder.java:331)
	at org.apache.maven.project.DefaultProjectBuilder.build(DefaultProjectBuilder.java:429)
	at org.apache.maven.project.DefaultProjectBuilder.build(DefaultProjectBuilder.java:398)
	at org.apache.maven.project.DefaultProjectBuilder.build(DefaultProjectBuilder.java:515)
	at org.apache.maven.project.DefaultProjectBuilder.build(DefaultProjectBuilder.java:398)
	at org.apache.maven.project.DefaultProjectBuilder.build(DefaultProjectBuilder.java:361)
	at org.apache.maven.graph.DefaultGraphBuilder.collectProjects(DefaultGraphBuilder.java:400)
	at org.apache.maven.graph.DefaultGraphBuilder.getProjectsForMavenReactor(DefaultGraphBuilder.java:391)
	at org.apache.maven.graph.DefaultGraphBuilder.build(DefaultGraphBuilder.java:78)
	at org.apache.maven.DefaultMaven.buildGraph(DefaultMaven.java:511)
	at org.apache.maven.DefaultMaven.doExecute(DefaultMaven.java:221)
	at org.apache.maven.DefaultMaven.doExecute(DefaultMaven.java:194)
	at org.apache.maven.DefaultMaven.execute(DefaultMaven.java:107)
	at org.apache.maven.cli.MavenCli.execute(MavenCli.java:993)
	at org.apache.maven.cli.MavenCli.doMain(MavenCli.java:345)
	at org.apache.maven.cli.MavenCli.main(MavenCli.java:191)
	at sun.reflect.NativeMethodAccessorImpl.invoke0(Native Method)
	at sun.reflect.NativeMethodAccessorImpl.invoke(NativeMethodAccessorImpl.java:57)
	at sun.reflect.DelegatingMethodAccessorImpl.invoke(DelegatingMethodAccessorImpl.java:43)
	at java.lang.reflect.Method.invoke(Method.java:606)
	at org.codehaus.plexus.classworlds.launcher.Launcher.launchEnhanced(Launcher.java:289)
	at org.codehaus.plexus.classworlds.launcher.Launcher.launch(Launcher.java:229)
	at org.codehaus.plexus.classworlds.launcher.Launcher.mainWithExitCode(Launcher.java:415)
	at org.codehaus.plexus.classworlds.launcher.Launcher.main(Launcher.java:356)
Caused by: org.eclipse.aether.resolution.ArtifactResolutionException: Could not find artifact org.apache.maven.plugin.rresource.it:it-parent:pom:1.6-SNAPSHOT in apache-snapshots (http://repository.apache.org/snapshots/)
	at org.eclipse.aether.internal.impl.DefaultArtifactResolver.resolve(DefaultArtifactResolver.java:453)
	at org.eclipse.aether.internal.impl.DefaultArtifactResolver.resolveArtifacts(DefaultArtifactResolver.java:255)
	at org.eclipse.aether.internal.impl.DefaultArtifactResolver.resolveArtifact(DefaultArtifactResolver.java:232)
	at org.eclipse.aether.internal.impl.DefaultRepositorySystem.resolveArtifact(DefaultRepositorySystem.java:303)
	at org.apache.maven.project.ProjectModelResolver.resolveModel(ProjectModelResolver.java:193)
	... 27 more
Caused by: org.eclipse.aether.transfer.ArtifactNotFoundException: Could not find artifact org.apache.maven.plugin.rresource.it:it-parent:pom:1.6-SNAPSHOT in apache-snapshots (http://repository.apache.org/snapshots/)
	at org.eclipse.aether.connector.basic.ArtifactTransportListener.transferFailed(ArtifactTransportListener.java:48)
	at org.eclipse.aether.connector.basic.BasicRepositoryConnector$TaskRunner.run(BasicRepositoryConnector.java:364)
	at org.eclipse.aether.util.concurrency.RunnableErrorForwarder$1.run(RunnableErrorForwarder.java:76)
	at org.eclipse.aether.connector.basic.BasicRepositoryConnector$DirectExecutor.execute(BasicRepositoryConnector.java:590)
	at org.eclipse.aether.connector.basic.BasicRepositoryConnector.get(BasicRepositoryConnector.java:258)
	at org.eclipse.aether.internal.impl.DefaultArtifactResolver.performDownloads(DefaultArtifactResolver.java:529)
	at org.eclipse.aether.internal.impl.DefaultArtifactResolver.resolve(DefaultArtifactResolver.java:430)
	... 31 more
[ERROR]   
[ERROR]   The project org.apache.maven.plugin.rresource.it.mrr41:child-2:[unknown-version] (F:\jenkins\jenkins-slave\workspace\ote-resources-plugin_master-FTEJEAA7J3RSA3RGNRQRTOLNK5IUQ7QP3AJQZXDE4RWB3DK3KFPQ\m\target\test-classes\run-only-at-execution-root\child2\pom.xml) has 1 error
[ERROR]     Non-resolvable parent POM for org.apache.maven.plugin.rresource.it.mrr41:parent:[unknown-version]: Failure to find org.apache.maven.plugin.rresource.it:it-parent:pom:1.6-SNAPSHOT in http://repository.apache.org/snapshots/ was cached in the local repository, resolution will not be reattempted until the update interval of apache-snapshots has elapsed or updates are forced and 'parent.relativePath' points at wrong local POM @ org.apache.maven.plugin.rresource.it.mrr41:parent:[unknown-version], F:\jenkins\jenkins-slave\workspace\ote-resources-plugin_master-FTEJEAA7J3RSA3RGNRQRTOLNK5IUQ7QP3AJQZXDE4RWB3DK3KFPQ\m\target\test-classes\run-only-at-execution-root\pom.xml, line 24, column 11 -> [Help 2]
org.apache.maven.model.resolution.UnresolvableModelException: Failure to find org.apache.maven.plugin.rresource.it:it-parent:pom:1.6-SNAPSHOT in http://repository.apache.org/snapshots/ was cached in the local repository, resolution will not be reattempted until the update interval of apache-snapshots has elapsed or updates are forced
	at org.apache.maven.project.ProjectModelResolver.resolveModel(ProjectModelResolver.java:197)
	at org.apache.maven.project.ProjectModelResolver.resolveModel(ProjectModelResolver.java:243)
	at org.apache.maven.model.building.DefaultModelBuilder.readParentExternally(DefaultModelBuilder.java:1051)
	at org.apache.maven.model.building.DefaultModelBuilder.readParent(DefaultModelBuilder.java:851)
	at org.apache.maven.model.building.DefaultModelBuilder.build(DefaultModelBuilder.java:331)
	at org.apache.maven.project.DefaultProjectBuilder.build(DefaultProjectBuilder.java:429)
	at org.apache.maven.project.DefaultProjectBuilder.build(DefaultProjectBuilder.java:398)
	at org.apache.maven.project.DefaultProjectBuilder.build(DefaultProjectBuilder.java:515)
	at org.apache.maven.project.DefaultProjectBuilder.build(DefaultProjectBuilder.java:398)
	at org.apache.maven.project.DefaultProjectBuilder.build(DefaultProjectBuilder.java:361)
	at org.apache.maven.graph.DefaultGraphBuilder.collectProjects(DefaultGraphBuilder.java:400)
	at org.apache.maven.graph.DefaultGraphBuilder.getProjectsForMavenReactor(DefaultGraphBuilder.java:391)
	at org.apache.maven.graph.DefaultGraphBuilder.build(DefaultGraphBuilder.java:78)
	at org.apache.maven.DefaultMaven.buildGraph(DefaultMaven.java:511)
	at org.apache.maven.DefaultMaven.doExecute(DefaultMaven.java:221)
	at org.apache.maven.DefaultMaven.doExecute(DefaultMaven.java:194)
	at org.apache.maven.DefaultMaven.execute(DefaultMaven.java:107)
	at org.apache.maven.cli.MavenCli.execute(MavenCli.java:993)
	at org.apache.maven.cli.MavenCli.doMain(MavenCli.java:345)
	at org.apache.maven.cli.MavenCli.main(MavenCli.java:191)
	at sun.reflect.NativeMethodAccessorImpl.invoke0(Native Method)
	at sun.reflect.NativeMethodAccessorImpl.invoke(NativeMethodAccessorImpl.java:57)
	at sun.reflect.DelegatingMethodAccessorImpl.invoke(DelegatingMethodAccessorImpl.java:43)
	at java.lang.reflect.Method.invoke(Method.java:606)
	at org.codehaus.plexus.classworlds.launcher.Launcher.launchEnhanced(Launcher.java:289)
	at org.codehaus.plexus.classworlds.launcher.Launcher.launch(Launcher.java:229)
	at org.codehaus.plexus.classworlds.launcher.Launcher.mainWithExitCode(Launcher.java:415)
	at org.codehaus.plexus.classworlds.launcher.Launcher.main(Launcher.java:356)
Caused by: org.eclipse.aether.resolution.ArtifactResolutionException: Failure to find org.apache.maven.plugin.rresource.it:it-parent:pom:1.6-SNAPSHOT in http://repository.apache.org/snapshots/ was cached in the local repository, resolution will not be reattempted until the update interval of apache-snapshots has elapsed or updates are forced
	at org.eclipse.aether.internal.impl.DefaultArtifactResolver.resolve(DefaultArtifactResolver.java:453)
	at org.eclipse.aether.internal.impl.DefaultArtifactResolver.resolveArtifacts(DefaultArtifactResolver.java:255)
	at org.eclipse.aether.internal.impl.DefaultArtifactResolver.resolveArtifact(DefaultArtifactResolver.java:232)
	at org.eclipse.aether.internal.impl.DefaultRepositorySystem.resolveArtifact(DefaultRepositorySystem.java:303)
	at org.apache.maven.project.ProjectModelResolver.resolveModel(ProjectModelResolver.java:193)
	... 27 more
Caused by: org.eclipse.aether.transfer.ArtifactNotFoundException: Failure to find org.apache.maven.plugin.rresource.it:it-parent:pom:1.6-SNAPSHOT in http://repository.apache.org/snapshots/ was cached in the local repository, resolution will not be reattempted until the update interval of apache-snapshots has elapsed or updates are forced
	at org.eclipse.aether.internal.impl.DefaultUpdateCheckManager.newException(DefaultUpdateCheckManager.java:240)
	at org.eclipse.aether.internal.impl.DefaultUpdateCheckManager.checkArtifact(DefaultUpdateCheckManager.java:192)
	at org.eclipse.aether.internal.impl.DefaultArtifactResolver.gatherDownloads(DefaultArtifactResolver.java:594)
	at org.eclipse.aether.internal.impl.DefaultArtifactResolver.performDownloads(DefaultArtifactResolver.java:512)
	at org.eclipse.aether.internal.impl.DefaultArtifactResolver.resolve(DefaultArtifactResolver.java:430)
	... 31 more
[ERROR] 
[ERROR] Re-run Maven using the -X switch to enable full debug logging.
[ERROR] 
[ERROR] For more information about the errors and possible solutions, please read the following articles:
[ERROR] [Help 1] http://cwiki.apache.org/confluence/display/MAVEN/ProjectBuildingException
[ERROR] [Help 2] http://cwiki.apache.org/confluence/display/MAVEN/UnresolvableModelException
Picked up JAVA_TOOL_OPTIONS: -Dmaven.ext.class.path="f:\jenkins\jenkins-slave\workspace\ote-resources-plugin_master-FTEJEAA7J3RSA3RGNRQRTOLNK5IUQ7QP3AJQZXDE4RWB3DK3KFPQ@tmp\withMaven50b5b628\pipeline-maven-spy.jar" -Dorg.jenkinsci.plugins.pipeline.maven.reportsFolder="f:\jenkins\jenkins-slave\workspace\ote-resources-plugin_master-FTEJEAA7J3RSA3RGNRQRTOLNK5IUQ7QP3AJQZXDE4RWB3DK3KFPQ@tmp\withMaven50b5b628" 

	at org.apache.maven.plugin.resources.remote.it.IT_RunOnlyAtExecutionRoot.test(IT_RunOnlyAtExecutionRoot.java:60)


FAILED:  org.apache.maven.plugin.resources.remote.it.IT_SupplementalArtifact.test

Error Message:
Exit code was non-zero: 1; command line and log = 
/home/jenkins/tools/maven/apache-maven-3.5.2/bin/mvn -e --batch-mode -Dmaven.repo.local=/home/jenkins/jenkins-slave/workspace/ote-resources-plugin_master-FTEJEAA7J3RSA3RGNRQRTOLNK5IUQ7QP3AJQZXDE4RWB3DK3KFPQ/m/target/it-repo org.apache.maven.plugins:maven-clean-plugin:clean deploy
Picked up JAVA_TOOL_OPTIONS: -Dmaven.ext.class.path="/home/jenkins/jenkins-slave/workspace/ote-resources-plugin_master-FTEJEAA7J3RSA3RGNRQRTOLNK5IUQ7QP3AJQZXDE4RWB3DK3KFPQ@tmp/withMavenade7beb8/pipeline-maven-spy.jar" -Dorg.jenkinsci.plugins.pipeline.maven.reportsFolder="/home/jenkins/jenkins-slave/workspace/ote-resources-plugin_master-FTEJEAA7J3RSA3RGNRQRTOLNK5IUQ7QP3AJQZXDE4RWB3DK3KFPQ@tmp/withMavenade7beb8" 
[INFO] [jenkins-event-spy] Generate /home/jenkins/jenkins-slave/workspace/ote-resources-plugin_master-FTEJEAA7J3RSA3RGNRQRTOLNK5IUQ7QP3AJQZXDE4RWB3DK3KFPQ@tmp/withMavenade7beb8/maven-spy-20180303-173947-3054117920884462127233.log.tmp ...
[INFO] Error stacktraces are turned on.
[INFO] Scanning for projects...
[INFO] ------------------------------------------------------------------------
[INFO] Reactor Build Order:
[INFO] 
[INFO] resources
[INFO] supplemental-models
[INFO] deficient-dep
[INFO] 
[INFO] ------------------------------------------------------------------------
[INFO] Building resources 1
[INFO] ------------------------------------------------------------------------
[INFO] 
[INFO] --- maven-clean-plugin:2.5:clean (default-cli) @ resources ---
[INFO] 
[INFO] --- maven-install-plugin:2.4:install (default-install) @ resources ---
[INFO] Installing /home/jenkins/jenkins-slave/workspace/ote-resources-plugin_master-FTEJEAA7J3RSA3RGNRQRTOLNK5IUQ7QP3AJQZXDE4RWB3DK3KFPQ/m/target/test-classes/supplemental-artifact/resource-projects/pom.xml to /home/jenkins/jenkins-slave/workspace/ote-resources-plugin_master-FTEJEAA7J3RSA3RGNRQRTOLNK5IUQ7QP3AJQZXDE4RWB3DK3KFPQ/m/target/it-repo/org/apache/maven/plugin/rresource/it/mrr43/resources/1/resources-1.pom
[INFO] 
[INFO] --- maven-deploy-plugin:2.7:deploy (default-deploy) @ resources ---
[INFO] Uploading to it-remote: file:/home/jenkins/jenkins-slave/workspace/ote-resources-plugin_master-FTEJEAA7J3RSA3RGNRQRTOLNK5IUQ7QP3AJQZXDE4RWB3DK3KFPQ/m/target/remote-repo/org/apache/maven/plugin/rresource/it/mrr43/resources/1/resources-1.pom
[INFO] Uploaded to it-remote: file:/home/jenkins/jenkins-slave/workspace/ote-resources-plugin_master-FTEJEAA7J3RSA3RGNRQRTOLNK5IUQ7QP3AJQZXDE4RWB3DK3KFPQ/m/target/remote-repo/org/apache/maven/plugin/rresource/it/mrr43/resources/1/resources-1.pom (1.6 kB at 80 kB/s)
[INFO] Downloading from it-remote: file:/home/jenkins/jenkins-slave/workspace/ote-resources-plugin_master-FTEJEAA7J3RSA3RGNRQRTOLNK5IUQ7QP3AJQZXDE4RWB3DK3KFPQ/m/target/remote-repo/org/apache/maven/plugin/rresource/it/mrr43/resources/maven-metadata.xml
[INFO] Uploading to it-remote: file:/home/jenkins/jenkins-slave/workspace/ote-resources-plugin_master-FTEJEAA7J3RSA3RGNRQRTOLNK5IUQ7QP3AJQZXDE4RWB3DK3KFPQ/m/target/remote-repo/org/apache/maven/plugin/rresource/it/mrr43/resources/maven-metadata.xml
[INFO] Uploaded to it-remote: file:/home/jenkins/jenkins-slave/workspace/ote-resources-plugin_master-FTEJEAA7J3RSA3RGNRQRTOLNK5IUQ7QP3AJQZXDE4RWB3DK3KFPQ/m/target/remote-repo/org/apache/maven/plugin/rresource/it/mrr43/resources/maven-metadata.xml (323 B at 323 kB/s)
[INFO] 
[INFO] ------------------------------------------------------------------------
[INFO] Building supplemental-models 1
[INFO] ------------------------------------------------------------------------
[INFO] 
[INFO] --- maven-clean-plugin:2.5:clean (default-cli) @ supplemental-models ---
[INFO] 
[INFO] --- maven-resources-plugin:2.6:resources (default-resources) @ supplemental-models ---
[WARNING] Using platform encoding (ISO-8859-1 actually) to copy filtered resources, i.e. build is platform dependent!
[INFO] Copying 1 resource
[INFO] 
[INFO] --- maven-compiler-plugin:3.1:compile (default-compile) @ supplemental-models ---
[INFO] No sources to compile
[INFO] 
[INFO] --- maven-resources-plugin:2.6:testResources (default-testResources) @ supplemental-models ---
[WARNING] Using platform encoding (ISO-8859-1 actually) to copy filtered resources, i.e. build is platform dependent!
[INFO] skip non existing resourceDirectory /home/jenkins/jenkins-slave/workspace/ote-resources-plugin_master-FTEJEAA7J3RSA3RGNRQRTOLNK5IUQ7QP3AJQZXDE4RWB3DK3KFPQ/m/target/test-classes/supplemental-artifact/resource-projects/supplemental-models/src/test/resources
[INFO] 
[INFO] --- maven-compiler-plugin:3.1:testCompile (default-testCompile) @ supplemental-models ---
[INFO] No sources to compile
[INFO] 
[INFO] --- maven-surefire-plugin:2.12.4:test (default-test) @ supplemental-models ---
[INFO] No tests to run.
[INFO] 
[INFO] --- maven-jar-plugin:2.4:jar (default-jar) @ supplemental-models ---
[INFO] Building jar: /home/jenkins/jenkins-slave/workspace/ote-resources-plugin_master-FTEJEAA7J3RSA3RGNRQRTOLNK5IUQ7QP3AJQZXDE4RWB3DK3KFPQ/m/target/test-classes/supplemental-artifact/resource-projects/supplemental-models/target/supplemental-models-1.jar
[INFO] 
[INFO] --- maven-install-plugin:2.4:install (default-install) @ supplemental-models ---
[INFO] Installing /home/jenkins/jenkins-slave/workspace/ote-resources-plugin_master-FTEJEAA7J3RSA3RGNRQRTOLNK5IUQ7QP3AJQZXDE4RWB3DK3KFPQ/m/target/test-classes/supplemental-artifact/resource-projects/supplemental-models/target/supplemental-models-1.jar to /home/jenkins/jenkins-slave/workspace/ote-resources-plugin_master-FTEJEAA7J3RSA3RGNRQRTOLNK5IUQ7QP3AJQZXDE4RWB3DK3KFPQ/m/target/it-repo/org/apache/maven/plugin/rresource/it/mrr43/supplemental-models/1/supplemental-models-1.jar
[INFO] Installing /home/jenkins/jenkins-slave/workspace/ote-resources-plugin_master-FTEJEAA7J3RSA3RGNRQRTOLNK5IUQ7QP3AJQZXDE4RWB3DK3KFPQ/m/target/test-classes/supplemental-artifact/resource-projects/supplemental-models/pom.xml to /home/jenkins/jenkins-slave/workspace/ote-resources-plugin_master-FTEJEAA7J3RSA3RGNRQRTOLNK5IUQ7QP3AJQZXDE4RWB3DK3KFPQ/m/target/it-repo/org/apache/maven/plugin/rresource/it/mrr43/supplemental-models/1/supplemental-models-1.pom
[INFO] 
[INFO] --- maven-deploy-plugin:2.7:deploy (default-deploy) @ supplemental-models ---
[INFO] Uploading to it-remote: file:/home/jenkins/jenkins-slave/workspace/ote-resources-plugin_master-FTEJEAA7J3RSA3RGNRQRTOLNK5IUQ7QP3AJQZXDE4RWB3DK3KFPQ/m/target/remote-repo/org/apache/maven/plugin/rresource/it/mrr43/supplemental-models/1/supplemental-models-1.jar
[INFO] Uploaded to it-remote: file:/home/jenkins/jenkins-slave/workspace/ote-resources-plugin_master-FTEJEAA7J3RSA3RGNRQRTOLNK5IUQ7QP3AJQZXDE4RWB3DK3KFPQ/m/target/remote-repo/org/apache/maven/plugin/rresource/it/mrr43/supplemental-models/1/supplemental-models-1.jar (3.0 kB at 1.5 MB/s)
[INFO] Uploading to it-remote: file:/home/jenkins/jenkins-slave/workspace/ote-resources-plugin_master-FTEJEAA7J3RSA3RGNRQRTOLNK5IUQ7QP3AJQZXDE4RWB3DK3KFPQ/m/target/remote-repo/org/apache/maven/plugin/rresource/it/mrr43/supplemental-models/1/supplemental-models-1.pom
[INFO] Uploaded to it-remote: file:/home/jenkins/jenkins-slave/workspace/ote-resources-plugin_master-FTEJEAA7J3RSA3RGNRQRTOLNK5IUQ7QP3AJQZXDE4RWB3DK3KFPQ/m/target/remote-repo/org/apache/maven/plugin/rresource/it/mrr43/supplemental-models/1/supplemental-models-1.pom (1.3 kB at 1.3 MB/s)
[INFO] Downloading from it-remote: file:/home/jenkins/jenkins-slave/workspace/ote-resources-plugin_master-FTEJEAA7J3RSA3RGNRQRTOLNK5IUQ7QP3AJQZXDE4RWB3DK3KFPQ/m/target/remote-repo/org/apache/maven/plugin/rresource/it/mrr43/supplemental-models/maven-metadata.xml
[INFO] Uploading to it-remote: file:/home/jenkins/jenkins-slave/workspace/ote-resources-plugin_master-FTEJEAA7J3RSA3RGNRQRTOLNK5IUQ7QP3AJQZXDE4RWB3DK3KFPQ/m/target/remote-repo/org/apache/maven/plugin/rresource/it/mrr43/supplemental-models/maven-metadata.xml
[INFO] Uploaded to it-remote: file:/home/jenkins/jenkins-slave/workspace/ote-resources-plugin_master-FTEJEAA7J3RSA3RGNRQRTOLNK5IUQ7QP3AJQZXDE4RWB3DK3KFPQ/m/target/remote-repo/org/apache/maven/plugin/rresource/it/mrr43/supplemental-models/maven-metadata.xml (333 B at 333 kB/s)
[INFO] 
[INFO] ------------------------------------------------------------------------
[INFO] Building deficient-dep 1
[INFO] ------------------------------------------------------------------------
[INFO] 
[INFO] --- maven-clean-plugin:2.5:clean (default-cli) @ deficient-dep ---
[INFO] 
[INFO] --- maven-resources-plugin:2.6:resources (default-resources) @ deficient-dep ---
[WARNING] Using platform encoding (ISO-8859-1 actually) to copy filtered resources, i.e. build is platform dependent!
[INFO] skip non existing resourceDirectory /home/jenkins/jenkins-slave/workspace/ote-resources-plugin_master-FTEJEAA7J3RSA3RGNRQRTOLNK5IUQ7QP3AJQZXDE4RWB3DK3KFPQ/m/target/test-classes/supplemental-artifact/resource-projects/deficient-dep/src/main/resources
[INFO] 
[INFO] --- maven-compiler-plugin:3.1:compile (default-compile) @ deficient-dep ---
[INFO] Changes detected - recompiling the module!
[WARNING] File encoding has not been set, using platform encoding ISO-8859-1, i.e. build is platform dependent!
[INFO] Compiling 1 source file to /home/jenkins/jenkins-slave/workspace/ote-resources-plugin_master-FTEJEAA7J3RSA3RGNRQRTOLNK5IUQ7QP3AJQZXDE4RWB3DK3KFPQ/m/target/test-classes/supplemental-artifact/resource-projects/deficient-dep/target/classes
[INFO] -------------------------------------------------------------
[ERROR] COMPILATION ERROR : 
[INFO] -------------------------------------------------------------
[ERROR] Source option 1.5 is no longer supported. Use 1.6 or later.
[ERROR] Target option 1.5 is no longer supported. Use 1.6 or later.
[INFO] 2 errors 
[INFO] -------------------------------------------------------------
[INFO] ------------------------------------------------------------------------
[INFO] Reactor Summary:
[INFO] 
[INFO] resources .......................................... SUCCESS [  0.509 s]
[INFO] supplemental-models ................................ SUCCESS [  0.780 s]
[INFO] deficient-dep ...................................... FAILURE [  0.368 s]
[INFO] ------------------------------------------------------------------------
[INFO] BUILD FAILURE
[INFO] ------------------------------------------------------------------------
[INFO] Total time: 1.836 s
[INFO] Finished at: 2018-03-03T17:39:49Z
[INFO] Final Memory: 14M/52M
[INFO] ------------------------------------------------------------------------
[INFO] [jenkins-event-spy] Generated /home/jenkins/jenkins-slave/workspace/ote-resources-plugin_master-FTEJEAA7J3RSA3RGNRQRTOLNK5IUQ7QP3AJQZXDE4RWB3DK3KFPQ@tmp/withMavenade7beb8/maven-spy-20180303-173947-3054117920884462127233.log
[ERROR] Failed to execute goal org.apache.maven.plugins:maven-compiler-plugin:3.1:compile (default-compile) on project deficient-dep: Compilation failure: Compilation failure: 
[ERROR] Source option 1.5 is no longer supported. Use 1.6 or later.
[ERROR] Target option 1.5 is no longer supported. Use 1.6 or later.
[ERROR] -> [Help 1]
org.apache.maven.lifecycle.LifecycleExecutionException: Failed to execute goal org.apache.maven.plugins:maven-compiler-plugin:3.1:compile (default-compile) on project deficient-dep: Compilation failure
    at org.apache.maven.lifecycle.internal.MojoExecutor.execute (MojoExecutor.java:213)
    at org.apache.maven.lifecycle.internal.MojoExecutor.execute (MojoExecutor.java:154)
    at org.apache.maven.lifecycle.internal.MojoExecutor.execute (MojoExecutor.java:146)
    at org.apache.maven.lifecycle.internal.LifecycleModuleBuilder.buildProject (LifecycleModuleBuilder.java:117)
    at org.apache.maven.lifecycle.internal.LifecycleModuleBuilder.buildProject (LifecycleModuleBuilder.java:81)
    at org.apache.maven.lifecycle.internal.builder.singlethreaded.SingleThreadedBuilder.build (SingleThreadedBuilder.java:51)
    at org.apache.maven.lifecycle.internal.LifecycleStarter.execute (LifecycleStarter.java:128)
    at org.apache.maven.DefaultMaven.doExecute (DefaultMaven.java:309)
    at org.apache.maven.DefaultMaven.doExecute (DefaultMaven.java:194)
    at org.apache.maven.DefaultMaven.execute (DefaultMaven.java:107)
    at org.apache.maven.cli.MavenCli.execute (MavenCli.java:955)
    at org.apache.maven.cli.MavenCli.doMain (MavenCli.java:290)
    at org.apache.maven.cli.MavenCli.main (MavenCli.java:194)
    at jdk.internal.reflect.NativeMethodAccessorImpl.invoke0 (Native Method)
    at jdk.internal.reflect.NativeMethodAccessorImpl.invoke (NativeMethodAccessorImpl.java:62)
    at jdk.internal.reflect.DelegatingMethodAccessorImpl.invoke (DelegatingMethodAccessorImpl.java:43)
    at java.lang.reflect.Method.invoke (Method.java:564)
    at org.codehaus.plexus.classworlds.launcher.Launcher.launchEnhanced (Launcher.java:289)
    at org.codehaus.plexus.classworlds.launcher.Launcher.launch (Launcher.java:229)
    at org.codehaus.plexus.classworlds.launcher.Launcher.mainWithExitCode (Launcher.java:415)
    at org.codehaus.plexus.classworlds.launcher.Launcher.main (Launcher.java:356)
Caused by: org.apache.maven.plugin.compiler.CompilationFailureException: Compilation failure
    at org.apache.maven.plugin.compiler.AbstractCompilerMojo.execute (AbstractCompilerMojo.java:858)
    at org.apache.maven.plugin.compiler.CompilerMojo.execute (CompilerMojo.java:129)
    at org.apache.maven.plugin.DefaultBuildPluginManager.executeMojo (DefaultBuildPluginManager.java:134)
    at org.apache.maven.lifecycle.internal.MojoExecutor.execute (MojoExecutor.java:208)
    at org.apache.maven.lifecycle.internal.MojoExecutor.execute (MojoExecutor.java:154)
    at org.apache.maven.lifecycle.internal.MojoExecutor.execute (MojoExecutor.java:146)
    at org.apache.maven.lifecycle.internal.LifecycleModuleBuilder.buildProject (LifecycleModuleBuilder.java:117)
    at org.apache.maven.lifecycle.internal.LifecycleModuleBuilder.buildProject (LifecycleModuleBuilder.java:81)
    at org.apache.maven.lifecycle.internal.builder.singlethreaded.SingleThreadedBuilder.build (SingleThreadedBuilder.java:51)
    at org.apache.maven.lifecycle.internal.LifecycleStarter.execute (LifecycleStarter.java:128)
    at org.apache.maven.DefaultMaven.doExecute (DefaultMaven.java:309)
    at org.apache.maven.DefaultMaven.doExecute (DefaultMaven.java:194)
    at org.apache.maven.DefaultMaven.execute (DefaultMaven.java:107)
    at org.apache.maven.cli.MavenCli.execute (MavenCli.java:955)
    at org.apache.maven.cli.MavenCli.doMain (MavenCli.java:290)
    at org.apache.maven.cli.MavenCli.main (MavenCli.java:194)
    at jdk.internal.reflect.NativeMethodAccessorImpl.invoke0 (Native Method)
    at jdk.internal.reflect.NativeMethodAccessorImpl.invoke (NativeMethodAccessorImpl.java:62)
    at jdk.internal.reflect.DelegatingMethodAccessorImpl.invoke (DelegatingMethodAccessorImpl.java:43)
    at java.lang.reflect.Method.invoke (Method.java:564)
    at org.codehaus.plexus.classworlds.launcher.Launcher.launchEnhanced (Launcher.java:289)
    at org.codehaus.plexus.classworlds.launcher.Launcher.launch (Launcher.java:229)
    at org.codehaus.plexus.classworlds.launcher.Launcher.mainWithExitCode (Launcher.java:415)
    at org.codehaus.plexus.classworlds.launcher.Launcher.main (Launcher.java:356)
[ERROR] 
[ERROR] Re-run Maven using the -X switch to enable full debug logging.
[ERROR] 
[ERROR] For more information about the errors and possible solutions, please read the following articles:
[ERROR] [Help 1] http://cwiki.apache.org/confluence/display/MAVEN/MojoFailureException
[ERROR] 
[ERROR] After correcting the problems, you can resume the build with the command
[ERROR]   mvn <goals> -rf :deficient-dep


Stack Trace:
org.apache.maven.it.VerificationException: 
Exit code was non-zero: 1; command line and log = 
/home/jenkins/tools/maven/apache-maven-3.5.2/bin/mvn -e --batch-mode -Dmaven.repo.local=/home/jenkins/jenkins-slave/workspace/ote-resources-plugin_master-FTEJEAA7J3RSA3RGNRQRTOLNK5IUQ7QP3AJQZXDE4RWB3DK3KFPQ/m/target/it-repo org.apache.maven.plugins:maven-clean-plugin:clean deploy
Picked up JAVA_TOOL_OPTIONS: -Dmaven.ext.class.path="/home/jenkins/jenkins-slave/workspace/ote-resources-plugin_master-FTEJEAA7J3RSA3RGNRQRTOLNK5IUQ7QP3AJQZXDE4RWB3DK3KFPQ@tmp/withMavenade7beb8/pipeline-maven-spy.jar" -Dorg.jenkinsci.plugins.pipeline.maven.reportsFolder="/home/jenkins/jenkins-slave/workspace/ote-resources-plugin_master-FTEJEAA7J3RSA3RGNRQRTOLNK5IUQ7QP3AJQZXDE4RWB3DK3KFPQ@tmp/withMavenade7beb8" 
[INFO] [jenkins-event-spy] Generate /home/jenkins/jenkins-slave/workspace/ote-resources-plugin_master-FTEJEAA7J3RSA3RGNRQRTOLNK5IUQ7QP3AJQZXDE4RWB3DK3KFPQ@tmp/withMavenade7beb8/maven-spy-20180303-173947-3054117920884462127233.log.tmp ...
[INFO] Error stacktraces are turned on.
[INFO] Scanning for projects...
[INFO] ------------------------------------------------------------------------
[INFO] Reactor Build Order:
[INFO] 
[INFO] resources
[INFO] supplemental-models
[INFO] deficient-dep
[INFO] 
[INFO] ------------------------------------------------------------------------
[INFO] Building resources 1
[INFO] ------------------------------------------------------------------------
[INFO] 
[INFO] --- maven-clean-plugin:2.5:clean (default-cli) @ resources ---
[INFO] 
[INFO] --- maven-install-plugin:2.4:install (default-install) @ resources ---
[INFO] Installing /home/jenkins/jenkins-slave/workspace/ote-resources-plugin_master-FTEJEAA7J3RSA3RGNRQRTOLNK5IUQ7QP3AJQZXDE4RWB3DK3KFPQ/m/target/test-classes/supplemental-artifact/resource-projects/pom.xml to /home/jenkins/jenkins-slave/workspace/ote-resources-plugin_master-FTEJEAA7J3RSA3RGNRQRTOLNK5IUQ7QP3AJQZXDE4RWB3DK3KFPQ/m/target/it-repo/org/apache/maven/plugin/rresource/it/mrr43/resources/1/resources-1.pom
[INFO] 
[INFO] --- maven-deploy-plugin:2.7:deploy (default-deploy) @ resources ---
[INFO] Uploading to it-remote: file:/home/jenkins/jenkins-slave/workspace/ote-resources-plugin_master-FTEJEAA7J3RSA3RGNRQRTOLNK5IUQ7QP3AJQZXDE4RWB3DK3KFPQ/m/target/remote-repo/org/apache/maven/plugin/rresource/it/mrr43/resources/1/resources-1.pom
[INFO] Uploaded to it-remote: file:/home/jenkins/jenkins-slave/workspace/ote-resources-plugin_master-FTEJEAA7J3RSA3RGNRQRTOLNK5IUQ7QP3AJQZXDE4RWB3DK3KFPQ/m/target/remote-repo/org/apache/maven/plugin/rresource/it/mrr43/resources/1/resources-1.pom (1.6 kB at 80 kB/s)
[INFO] Downloading from it-remote: file:/home/jenkins/jenkins-slave/workspace/ote-resources-plugin_master-FTEJEAA7J3RSA3RGNRQRTOLNK5IUQ7QP3AJQZXDE4RWB3DK3KFPQ/m/target/remote-repo/org/apache/maven/plugin/rresource/it/mrr43/resources/maven-metadata.xml
[INFO] Uploading to it-remote: file:/home/jenkins/jenkins-slave/workspace/ote-resources-plugin_master-FTEJEAA7J3RSA3RGNRQRTOLNK5IUQ7QP3AJQZXDE4RWB3DK3KFPQ/m/target/remote-repo/org/apache/maven/plugin/rresource/it/mrr43/resources/maven-metadata.xml
[INFO] Uploaded to it-remote: file:/home/jenkins/jenkins-slave/workspace/ote-resources-plugin_master-FTEJEAA7J3RSA3RGNRQRTOLNK5IUQ7QP3AJQZXDE4RWB3DK3KFPQ/m/target/remote-repo/org/apache/maven/plugin/rresource/it/mrr43/resources/maven-metadata.xml (323 B at 323 kB/s)
[INFO] 
[INFO] ------------------------------------------------------------------------
[INFO] Building supplemental-models 1
[INFO] ------------------------------------------------------------------------
[INFO] 
[INFO] --- maven-clean-plugin:2.5:clean (default-cli) @ supplemental-models ---
[INFO] 
[INFO] --- maven-resources-plugin:2.6:resources (default-resources) @ supplemental-models ---
[WARNING] Using platform encoding (ISO-8859-1 actually) to copy filtered resources, i.e. build is platform dependent!
[INFO] Copying 1 resource
[INFO] 
[INFO] --- maven-compiler-plugin:3.1:compile (default-compile) @ supplemental-models ---
[INFO] No sources to compile
[INFO] 
[INFO] --- maven-resources-plugin:2.6:testResources (default-testResources) @ supplemental-models ---
[WARNING] Using platform encoding (ISO-8859-1 actually) to copy filtered resources, i.e. build is platform dependent!
[INFO] skip non existing resourceDirectory /home/jenkins/jenkins-slave/workspace/ote-resources-plugin_master-FTEJEAA7J3RSA3RGNRQRTOLNK5IUQ7QP3AJQZXDE4RWB3DK3KFPQ/m/target/test-classes/supplemental-artifact/resource-projects/supplemental-models/src/test/resources
[INFO] 
[INFO] --- maven-compiler-plugin:3.1:testCompile (default-testCompile) @ supplemental-models ---
[INFO] No sources to compile
[INFO] 
[INFO] --- maven-surefire-plugin:2.12.4:test (default-test) @ supplemental-models ---
[INFO] No tests to run.
[INFO] 
[INFO] --- maven-jar-plugin:2.4:jar (default-jar) @ supplemental-models ---
[INFO] Building jar: /home/jenkins/jenkins-slave/workspace/ote-resources-plugin_master-FTEJEAA7J3RSA3RGNRQRTOLNK5IUQ7QP3AJQZXDE4RWB3DK3KFPQ/m/target/test-classes/supplemental-artifact/resource-projects/supplemental-models/target/supplemental-models-1.jar
[INFO] 
[INFO] --- maven-install-plugin:2.4:install (default-install) @ supplemental-models ---
[INFO] Installing /home/jenkins/jenkins-slave/workspace/ote-resources-plugin_master-FTEJEAA7J3RSA3RGNRQRTOLNK5IUQ7QP3AJQZXDE4RWB3DK3KFPQ/m/target/test-classes/supplemental-artifact/resource-projects/supplemental-models/target/supplemental-models-1.jar to /home/jenkins/jenkins-slave/workspace/ote-resources-plugin_master-FTEJEAA7J3RSA3RGNRQRTOLNK5IUQ7QP3AJQZXDE4RWB3DK3KFPQ/m/target/it-repo/org/apache/maven/plugin/rresource/it/mrr43/supplemental-models/1/supplemental-models-1.jar
[INFO] Installing /home/jenkins/jenkins-slave/workspace/ote-resources-plugin_master-FTEJEAA7J3RSA3RGNRQRTOLNK5IUQ7QP3AJQZXDE4RWB3DK3KFPQ/m/target/test-classes/supplemental-artifact/resource-projects/supplemental-models/pom.xml to /home/jenkins/jenkins-slave/workspace/ote-resources-plugin_master-FTEJEAA7J3RSA3RGNRQRTOLNK5IUQ7QP3AJQZXDE4RWB3DK3KFPQ/m/target/it-repo/org/apache/maven/plugin/rresource/it/mrr43/supplemental-models/1/supplemental-models-1.pom
[INFO] 
[INFO] --- maven-deploy-plugin:2.7:deploy (default-deploy) @ supplemental-models ---
[INFO] Uploading to it-remote: file:/home/jenkins/jenkins-slave/workspace/ote-resources-plugin_master-FTEJEAA7J3RSA3RGNRQRTOLNK5IUQ7QP3AJQZXDE4RWB3DK3KFPQ/m/target/remote-repo/org/apache/maven/plugin/rresource/it/mrr43/supplemental-models/1/supplemental-models-1.jar
[INFO] Uploaded to it-remote: file:/home/jenkins/jenkins-slave/workspace/ote-resources-plugin_master-FTEJEAA7J3RSA3RGNRQRTOLNK5IUQ7QP3AJQZXDE4RWB3DK3KFPQ/m/target/remote-repo/org/apache/maven/plugin/rresource/it/mrr43/supplemental-models/1/supplemental-models-1.jar (3.0 kB at 1.5 MB/s)
[INFO] Uploading to it-remote: file:/home/jenkins/jenkins-slave/workspace/ote-resources-plugin_master-FTEJEAA7J3RSA3RGNRQRTOLNK5IUQ7QP3AJQZXDE4RWB3DK3KFPQ/m/target/remote-repo/org/apache/maven/plugin/rresource/it/mrr43/supplemental-models/1/supplemental-models-1.pom
[INFO] Uploaded to it-remote: file:/home/jenkins/jenkins-slave/workspace/ote-resources-plugin_master-FTEJEAA7J3RSA3RGNRQRTOLNK5IUQ7QP3AJQZXDE4RWB3DK3KFPQ/m/target/remote-repo/org/apache/maven/plugin/rresource/it/mrr43/supplemental-models/1/supplemental-models-1.pom (1.3 kB at 1.3 MB/s)
[INFO] Downloading from it-remote: file:/home/jenkins/jenkins-slave/workspace/ote-resources-plugin_master-FTEJEAA7J3RSA3RGNRQRTOLNK5IUQ7QP3AJQZXDE4RWB3DK3KFPQ/m/target/remote-repo/org/apache/maven/plugin/rresource/it/mrr43/supplemental-models/maven-metadata.xml
[INFO] Uploading to it-remote: file:/home/jenkins/jenkins-slave/workspace/ote-resources-plugin_master-FTEJEAA7J3RSA3RGNRQRTOLNK5IUQ7QP3AJQZXDE4RWB3DK3KFPQ/m/target/remote-repo/org/apache/maven/plugin/rresource/it/mrr43/supplemental-models/maven-metadata.xml
[INFO] Uploaded to it-remote: file:/home/jenkins/jenkins-slave/workspace/ote-resources-plugin_master-FTEJEAA7J3RSA3RGNRQRTOLNK5IUQ7QP3AJQZXDE4RWB3DK3KFPQ/m/target/remote-repo/org/apache/maven/plugin/rresource/it/mrr43/supplemental-models/maven-metadata.xml (333 B at 333 kB/s)
[INFO] 
[INFO] ------------------------------------------------------------------------
[INFO] Building deficient-dep 1
[INFO] ------------------------------------------------------------------------
[INFO] 
[INFO] --- maven-clean-plugin:2.5:clean (default-cli) @ deficient-dep ---
[INFO] 
[INFO] --- maven-resources-plugin:2.6:resources (default-resources) @ deficient-dep ---
[WARNING] Using platform encoding (ISO-8859-1 actually) to copy filtered resources, i.e. build is platform dependent!
[INFO] skip non existing resourceDirectory /home/jenkins/jenkins-slave/workspace/ote-resources-plugin_master-FTEJEAA7J3RSA3RGNRQRTOLNK5IUQ7QP3AJQZXDE4RWB3DK3KFPQ/m/target/test-classes/supplemental-artifact/resource-projects/deficient-dep/src/main/resources
[INFO] 
[INFO] --- maven-compiler-plugin:3.1:compile (default-compile) @ deficient-dep ---
[INFO] Changes detected - recompiling the module!
[WARNING] File encoding has not been set, using platform encoding ISO-8859-1, i.e. build is platform dependent!
[INFO] Compiling 1 source file to /home/jenkins/jenkins-slave/workspace/ote-resources-plugin_master-FTEJEAA7J3RSA3RGNRQRTOLNK5IUQ7QP3AJQZXDE4RWB3DK3KFPQ/m/target/test-classes/supplemental-artifact/resource-projects/deficient-dep/target/classes
[INFO] -------------------------------------------------------------
[ERROR] COMPILATION ERROR : 
[INFO] -------------------------------------------------------------
[ERROR] Source option 1.5 is no longer supported. Use 1.6 or later.
[ERROR] Target option 1.5 is no longer supported. Use 1.6 or later.
[INFO] 2 errors 
[INFO] -------------------------------------------------------------
[INFO] ------------------------------------------------------------------------
[INFO] Reactor Summary:
[INFO] 
[INFO] resources .......................................... SUCCESS [  0.509 s]
[INFO] supplemental-models ................................ SUCCESS [  0.780 s]
[INFO] deficient-dep ...................................... FAILURE [  0.368 s]
[INFO] ------------------------------------------------------------------------
[INFO] BUILD FAILURE
[INFO] ------------------------------------------------------------------------
[INFO] Total time: 1.836 s
[INFO] Finished at: 2018-03-03T17:39:49Z
[INFO] Final Memory: 14M/52M
[INFO] ------------------------------------------------------------------------
[INFO] [jenkins-event-spy] Generated /home/jenkins/jenkins-slave/workspace/ote-resources-plugin_master-FTEJEAA7J3RSA3RGNRQRTOLNK5IUQ7QP3AJQZXDE4RWB3DK3KFPQ@tmp/withMavenade7beb8/maven-spy-20180303-173947-3054117920884462127233.log
[ERROR] Failed to execute goal org.apache.maven.plugins:maven-compiler-plugin:3.1:compile (default-compile) on project deficient-dep: Compilation failure: Compilation failure: 
[ERROR] Source option 1.5 is no longer supported. Use 1.6 or later.
[ERROR] Target option 1.5 is no longer supported. Use 1.6 or later.
[ERROR] -> [Help 1]
org.apache.maven.lifecycle.LifecycleExecutionException: Failed to execute goal org.apache.maven.plugins:maven-compiler-plugin:3.1:compile (default-compile) on project deficient-dep: Compilation failure
    at org.apache.maven.lifecycle.internal.MojoExecutor.execute (MojoExecutor.java:213)
    at org.apache.maven.lifecycle.internal.MojoExecutor.execute (MojoExecutor.java:154)
    at org.apache.maven.lifecycle.internal.MojoExecutor.execute (MojoExecutor.java:146)
    at org.apache.maven.lifecycle.internal.LifecycleModuleBuilder.buildProject (LifecycleModuleBuilder.java:117)
    at org.apache.maven.lifecycle.internal.LifecycleModuleBuilder.buildProject (LifecycleModuleBuilder.java:81)
    at org.apache.maven.lifecycle.internal.builder.singlethreaded.SingleThreadedBuilder.build (SingleThreadedBuilder.java:51)
    at org.apache.maven.lifecycle.internal.LifecycleStarter.execute (LifecycleStarter.java:128)
    at org.apache.maven.DefaultMaven.doExecute (DefaultMaven.java:309)
    at org.apache.maven.DefaultMaven.doExecute (DefaultMaven.java:194)
    at org.apache.maven.DefaultMaven.execute (DefaultMaven.java:107)
    at org.apache.maven.cli.MavenCli.execute (MavenCli.java:955)
    at org.apache.maven.cli.MavenCli.doMain (MavenCli.java:290)
    at org.apache.maven.cli.MavenCli.main (MavenCli.java:194)
    at jdk.internal.reflect.NativeMethodAccessorImpl.invoke0 (Native Method)
    at jdk.internal.reflect.NativeMethodAccessorImpl.invoke (NativeMethodAccessorImpl.java:62)
    at jdk.internal.reflect.DelegatingMethodAccessorImpl.invoke (DelegatingMethodAccessorImpl.java:43)
    at java.lang.reflect.Method.invoke (Method.java:564)
    at org.codehaus.plexus.classworlds.launcher.Launcher.launchEnhanced (Launcher.java:289)
    at org.codehaus.plexus.classworlds.launcher.Launcher.launch (Launcher.java:229)
    at org.codehaus.plexus.classworlds.launcher.Launcher.mainWithExitCode (Launcher.java:415)
    at org.codehaus.plexus.classworlds.launcher.Launcher.main (Launcher.java:356)
Caused by: org.apache.maven.plugin.compiler.CompilationFailureException: Compilation failure
    at org.apache.maven.plugin.compiler.AbstractCompilerMojo.execute (AbstractCompilerMojo.java:858)
    at org.apache.maven.plugin.compiler.CompilerMojo.execute (CompilerMojo.java:129)
    at org.apache.maven.plugin.DefaultBuildPluginManager.executeMojo (DefaultBuildPluginManager.java:134)
    at org.apache.maven.lifecycle.internal.MojoExecutor.execute (MojoExecutor.java:208)
    at org.apache.maven.lifecycle.internal.MojoExecutor.execute (MojoExecutor.java:154)
    at org.apache.maven.lifecycle.internal.MojoExecutor.execute (MojoExecutor.java:146)
    at org.apache.maven.lifecycle.internal.LifecycleModuleBuilder.buildProject (LifecycleModuleBuilder.java:117)
    at org.apache.maven.lifecycle.internal.LifecycleModuleBuilder.buildProject (LifecycleModuleBuilder.java:81)
    at org.apache.maven.lifecycle.internal.builder.singlethreaded.SingleThreadedBuilder.build (SingleThreadedBuilder.java:51)
    at org.apache.maven.lifecycle.internal.LifecycleStarter.execute (LifecycleStarter.java:128)
    at org.apache.maven.DefaultMaven.doExecute (DefaultMaven.java:309)
    at org.apache.maven.DefaultMaven.doExecute (DefaultMaven.java:194)
    at org.apache.maven.DefaultMaven.execute (DefaultMaven.java:107)
    at org.apache.maven.cli.MavenCli.execute (MavenCli.java:955)
    at org.apache.maven.cli.MavenCli.doMain (MavenCli.java:290)
    at org.apache.maven.cli.MavenCli.main (MavenCli.java:194)
    at jdk.internal.reflect.NativeMethodAccessorImpl.invoke0 (Native Method)
    at jdk.internal.reflect.NativeMethodAccessorImpl.invoke (NativeMethodAccessorImpl.java:62)
    at jdk.internal.reflect.DelegatingMethodAccessorImpl.invoke (DelegatingMethodAccessorImpl.java:43)
    at java.lang.reflect.Method.invoke (Method.java:564)
    at org.codehaus.plexus.classworlds.launcher.Launcher.launchEnhanced (Launcher.java:289)
    at org.codehaus.plexus.classworlds.launcher.Launcher.launch (Launcher.java:229)
    at org.codehaus.plexus.classworlds.launcher.Launcher.mainWithExitCode (Launcher.java:415)
    at org.codehaus.plexus.classworlds.launcher.Launcher.main (Launcher.java:356)
[ERROR] 
[ERROR] Re-run Maven using the -X switch to enable full debug logging.
[ERROR] 
[ERROR] For more information about the errors and possible solutions, please read the following articles:
[ERROR] [Help 1] http://cwiki.apache.org/confluence/display/MAVEN/MojoFailureException
[ERROR] 
[ERROR] After correcting the problems, you can resume the build with the command
[ERROR]   mvn <goals> -rf :deficient-dep

	at org.apache.maven.plugin.resources.remote.it.IT_SupplementalArtifact.test(IT_SupplementalArtifact.java:50)


FAILED:  org.apache.maven.plugin.resources.remote.it.IT_SupplementalArtifact.test

Error Message:
Exit code was non-zero: 1; command line and log = 
F:\jenkins\tools\maven\apache-maven-3.5.0\bin\mvn -e --batch-mode -Dmaven.repo.local=f:\jenkins\jenkins-slave\workspace\ote-resources-plugin_master-FTEJEAA7J3RSA3RGNRQRTOLNK5IUQ7QP3AJQZXDE4RWB3DK3KFPQ@2\m\target/it-repo org.apache.maven.plugins:maven-clean-plugin:clean deploy
Picked up JAVA_TOOL_OPTIONS: -Dmaven.ext.class.path="f:\jenkins\jenkins-slave\workspace\ote-resources-plugin_master-FTEJEAA7J3RSA3RGNRQRTOLNK5IUQ7QP3AJQZXDE4RWB3DK3KFPQ@2@tmp\withMavend8ba7d91\pipeline-maven-spy.jar" -Dorg.jenkinsci.plugins.pipeline.maven.reportsFolder="f:\jenkins\jenkins-slave\workspace\ote-resources-plugin_master-FTEJEAA7J3RSA3RGNRQRTOLNK5IUQ7QP3AJQZXDE4RWB3DK3KFPQ@2@tmp\withMavend8ba7d91" 
[INFO] [jenkins-event-spy] Generate F:\jenkins\jenkins-slave\workspace\ote-resources-plugin_master-FTEJEAA7J3RSA3RGNRQRTOLNK5IUQ7QP3AJQZXDE4RWB3DK3KFPQ@2@tmp\withMavend8ba7d91\maven-spy-20180303-174023-32815796926225573682634.log.tmp ...
[INFO] Error stacktraces are turned on.
[INFO] Scanning for projects...
[INFO] ------------------------------------------------------------------------
[INFO] Reactor Build Order:
[INFO] 
[INFO] resources
[INFO] supplemental-models
[INFO] deficient-dep
[INFO] 
[INFO] ------------------------------------------------------------------------
[INFO] Building resources 1
[INFO] ------------------------------------------------------------------------
[INFO] 
[INFO] --- maven-clean-plugin:2.5:clean (default-cli) @ resources ---
[INFO] 
[INFO] --- maven-install-plugin:2.4:install (default-install) @ resources ---
[INFO] Installing f:\jenkins\jenkins-slave\workspace\ote-resources-plugin_master-FTEJEAA7J3RSA3RGNRQRTOLNK5IUQ7QP3AJQZXDE4RWB3DK3KFPQ@2\m\target\test-classes\supplemental-artifact\resource-projects\pom.xml to f:\jenkins\jenkins-slave\workspace\ote-resources-plugin_master-FTEJEAA7J3RSA3RGNRQRTOLNK5IUQ7QP3AJQZXDE4RWB3DK3KFPQ@2\m\target\it-repo\org\apache\maven\plugin\rresource\it\mrr43\resources\1\resources-1.pom
[INFO] 
[INFO] --- maven-deploy-plugin:2.7:deploy (default-deploy) @ resources ---
[INFO] Uploading: file:f:\\jenkins\\jenkins-slave\\workspace\\ote-resources-plugin_master-FTEJEAA7J3RSA3RGNRQRTOLNK5IUQ7QP3AJQZXDE4RWB3DK3KFPQ@2\\m\\target/remote-repo/org/apache/maven/plugin/rresource/it/mrr43/resources/1/resources-1.pom
[INFO] Uploaded: file:f:\\jenkins\\jenkins-slave\\workspace\\ote-resources-plugin_master-FTEJEAA7J3RSA3RGNRQRTOLNK5IUQ7QP3AJQZXDE4RWB3DK3KFPQ@2\\m\\target/remote-repo/org/apache/maven/plugin/rresource/it/mrr43/resources/1/resources-1.pom (1.6 kB at 36 kB/s)
[INFO] Downloading: file:f:\\jenkins\\jenkins-slave\\workspace\\ote-resources-plugin_master-FTEJEAA7J3RSA3RGNRQRTOLNK5IUQ7QP3AJQZXDE4RWB3DK3KFPQ@2\\m\\target/remote-repo/org/apache/maven/plugin/rresource/it/mrr43/resources/maven-metadata.xml
[INFO] Uploading: file:f:\\jenkins\\jenkins-slave\\workspace\\ote-resources-plugin_master-FTEJEAA7J3RSA3RGNRQRTOLNK5IUQ7QP3AJQZXDE4RWB3DK3KFPQ@2\\m\\target/remote-repo/org/apache/maven/plugin/rresource/it/mrr43/resources/maven-metadata.xml
[INFO] Uploaded: file:f:\\jenkins\\jenkins-slave\\workspace\\ote-resources-plugin_master-FTEJEAA7J3RSA3RGNRQRTOLNK5IUQ7QP3AJQZXDE4RWB3DK3KFPQ@2\\m\\target/remote-repo/org/apache/maven/plugin/rresource/it/mrr43/resources/maven-metadata.xml (323 B at 162 kB/s)
[INFO] 
[INFO] ------------------------------------------------------------------------
[INFO] Building supplemental-models 1
[INFO] ------------------------------------------------------------------------
[INFO] 
[INFO] --- maven-clean-plugin:2.5:clean (default-cli) @ supplemental-models ---
[INFO] 
[INFO] --- maven-resources-plugin:2.6:resources (default-resources) @ supplemental-models ---
[WARNING] Using platform encoding (Cp1252 actually) to copy filtered resources, i.e. build is platform dependent!
[INFO] Copying 1 resource
[INFO] 
[INFO] --- maven-compiler-plugin:3.1:compile (default-compile) @ supplemental-models ---
[INFO] No sources to compile
[INFO] 
[INFO] --- maven-resources-plugin:2.6:testResources (default-testResources) @ supplemental-models ---
[WARNING] Using platform encoding (Cp1252 actually) to copy filtered resources, i.e. build is platform dependent!
[INFO] skip non existing resourceDirectory F:\jenkins\jenkins-slave\workspace\ote-resources-plugin_master-FTEJEAA7J3RSA3RGNRQRTOLNK5IUQ7QP3AJQZXDE4RWB3DK3KFPQ@2\m\target\test-classes\supplemental-artifact\resource-projects\supplemental-models\src\test\resources
[INFO] 
[INFO] --- maven-compiler-plugin:3.1:testCompile (default-testCompile) @ supplemental-models ---
[INFO] No sources to compile
[INFO] 
[INFO] --- maven-surefire-plugin:2.12.4:test (default-test) @ supplemental-models ---
[INFO] No tests to run.
[INFO] 
[INFO] --- maven-jar-plugin:2.4:jar (default-jar) @ supplemental-models ---
[INFO] Building jar: F:\jenkins\jenkins-slave\workspace\ote-resources-plugin_master-FTEJEAA7J3RSA3RGNRQRTOLNK5IUQ7QP3AJQZXDE4RWB3DK3KFPQ@2\m\target\test-classes\supplemental-artifact\resource-projects\supplemental-models\target\supplemental-models-1.jar
[INFO] 
[INFO] --- maven-install-plugin:2.4:install (default-install) @ supplemental-models ---
[INFO] Installing F:\jenkins\jenkins-slave\workspace\ote-resources-plugin_master-FTEJEAA7J3RSA3RGNRQRTOLNK5IUQ7QP3AJQZXDE4RWB3DK3KFPQ@2\m\target\test-classes\supplemental-artifact\resource-projects\supplemental-models\target\supplemental-models-1.jar to f:\jenkins\jenkins-slave\workspace\ote-resources-plugin_master-FTEJEAA7J3RSA3RGNRQRTOLNK5IUQ7QP3AJQZXDE4RWB3DK3KFPQ@2\m\target\it-repo\org\apache\maven\plugin\rresource\it\mrr43\supplemental-models\1\supplemental-models-1.jar
[INFO] Installing F:\jenkins\jenkins-slave\workspace\ote-resources-plugin_master-FTEJEAA7J3RSA3RGNRQRTOLNK5IUQ7QP3AJQZXDE4RWB3DK3KFPQ@2\m\target\test-classes\supplemental-artifact\resource-projects\supplemental-models\pom.xml to f:\jenkins\jenkins-slave\workspace\ote-resources-plugin_master-FTEJEAA7J3RSA3RGNRQRTOLNK5IUQ7QP3AJQZXDE4RWB3DK3KFPQ@2\m\target\it-repo\org\apache\maven\plugin\rresource\it\mrr43\supplemental-models\1\supplemental-models-1.pom
[INFO] 
[INFO] --- maven-deploy-plugin:2.7:deploy (default-deploy) @ supplemental-models ---
[INFO] Uploading: file:f:\\jenkins\\jenkins-slave\\workspace\\ote-resources-plugin_master-FTEJEAA7J3RSA3RGNRQRTOLNK5IUQ7QP3AJQZXDE4RWB3DK3KFPQ@2\\m\\target/remote-repo/org/apache/maven/plugin/rresource/it/mrr43/supplemental-models/1/supplemental-models-1.jar
[INFO] Uploaded: file:f:\\jenkins\\jenkins-slave\\workspace\\ote-resources-plugin_master-FTEJEAA7J3RSA3RGNRQRTOLNK5IUQ7QP3AJQZXDE4RWB3DK3KFPQ@2\\m\\target/remote-repo/org/apache/maven/plugin/rresource/it/mrr43/supplemental-models/1/supplemental-models-1.jar (3.0 kB at 597 kB/s)
[INFO] Uploading: file:f:\\jenkins\\jenkins-slave\\workspace\\ote-resources-plugin_master-FTEJEAA7J3RSA3RGNRQRTOLNK5IUQ7QP3AJQZXDE4RWB3DK3KFPQ@2\\m\\target/remote-repo/org/apache/maven/plugin/rresource/it/mrr43/supplemental-models/1/supplemental-models-1.pom
[INFO] Uploaded: file:f:\\jenkins\\jenkins-slave\\workspace\\ote-resources-plugin_master-FTEJEAA7J3RSA3RGNRQRTOLNK5IUQ7QP3AJQZXDE4RWB3DK3KFPQ@2\\m\\target/remote-repo/org/apache/maven/plugin/rresource/it/mrr43/supplemental-models/1/supplemental-models-1.pom (1.3 kB at 62 kB/s)
[INFO] Downloading: file:f:\\jenkins\\jenkins-slave\\workspace\\ote-resources-plugin_master-FTEJEAA7J3RSA3RGNRQRTOLNK5IUQ7QP3AJQZXDE4RWB3DK3KFPQ@2\\m\\target/remote-repo/org/apache/maven/plugin/rresource/it/mrr43/supplemental-models/maven-metadata.xml
[INFO] Uploading: file:f:\\jenkins\\jenkins-slave\\workspace\\ote-resources-plugin_master-FTEJEAA7J3RSA3RGNRQRTOLNK5IUQ7QP3AJQZXDE4RWB3DK3KFPQ@2\\m\\target/remote-repo/org/apache/maven/plugin/rresource/it/mrr43/supplemental-models/maven-metadata.xml
[INFO] Uploaded: file:f:\\jenkins\\jenkins-slave\\workspace\\ote-resources-plugin_master-FTEJEAA7J3RSA3RGNRQRTOLNK5IUQ7QP3AJQZXDE4RWB3DK3KFPQ@2\\m\\target/remote-repo/org/apache/maven/plugin/rresource/it/mrr43/supplemental-models/maven-metadata.xml (333 B at 333 kB/s)
[INFO] 
[INFO] ------------------------------------------------------------------------
[INFO] Building deficient-dep 1
[INFO] ------------------------------------------------------------------------
[INFO] 
[INFO] --- maven-clean-plugin:2.5:clean (default-cli) @ deficient-dep ---
[INFO] 
[INFO] --- maven-resources-plugin:2.6:resources (default-resources) @ deficient-dep ---
[WARNING] Using platform encoding (Cp1252 actually) to copy filtered resources, i.e. build is platform dependent!
[INFO] skip non existing resourceDirectory F:\jenkins\jenkins-slave\workspace\ote-resources-plugin_master-FTEJEAA7J3RSA3RGNRQRTOLNK5IUQ7QP3AJQZXDE4RWB3DK3KFPQ@2\m\target\test-classes\supplemental-artifact\resource-projects\deficient-dep\src\main\resources
[INFO] 
[INFO] --- maven-compiler-plugin:3.1:compile (default-compile) @ deficient-dep ---
[INFO] Changes detected - recompiling the module!
[WARNING] File encoding has not been set, using platform encoding Cp1252, i.e. build is platform dependent!
[INFO] Compiling 1 source file to F:\jenkins\jenkins-slave\workspace\ote-resources-plugin_master-FTEJEAA7J3RSA3RGNRQRTOLNK5IUQ7QP3AJQZXDE4RWB3DK3KFPQ@2\m\target\test-classes\supplemental-artifact\resource-projects\deficient-dep\target\classes
[INFO] -------------------------------------------------------------
[ERROR] COMPILATION ERROR : 
[INFO] -------------------------------------------------------------
[ERROR] Source option 1.5 is no longer supported. Use 1.6 or later.
[ERROR] Target option 1.5 is no longer supported. Use 1.6 or later.
[INFO] 2 errors 
[INFO] -------------------------------------------------------------
[INFO] ------------------------------------------------------------------------
[INFO] Reactor Summary:
[INFO] 
[INFO] resources .......................................... SUCCESS [  0.750 s]
[INFO] supplemental-models ................................ SUCCESS [  1.492 s]
[INFO] deficient-dep ...................................... FAILURE [  0.819 s]
[INFO] ------------------------------------------------------------------------
[INFO] BUILD FAILURE
[INFO] ------------------------------------------------------------------------
[INFO] Total time: 3.482 s
[INFO] Finished at: 2018-03-03T17:40:27Z
[INFO] Final Memory: 14M/48M
[INFO] ------------------------------------------------------------------------
[INFO] [jenkins-event-spy] Generated F:\jenkins\jenkins-slave\workspace\ote-resources-plugin_master-FTEJEAA7J3RSA3RGNRQRTOLNK5IUQ7QP3AJQZXDE4RWB3DK3KFPQ@2@tmp\withMavend8ba7d91\maven-spy-20180303-174023-32815796926225573682634.log
[ERROR] Failed to execute goal org.apache.maven.plugins:maven-compiler-plugin:3.1:compile (default-compile) on project deficient-dep: Compilation failure: Compilation failure: 
[ERROR] Source option 1.5 is no longer supported. Use 1.6 or later.
[ERROR] Target option 1.5 is no longer supported. Use 1.6 or later.
[ERROR] -> [Help 1]
org.apache.maven.lifecycle.LifecycleExecutionException: Failed to execute goal org.apache.maven.plugins:maven-compiler-plugin:3.1:compile (default-compile) on project deficient-dep: Compilation failure
 at org.apache.maven.lifecycle.internal.MojoExecutor.execute(MojoExecutor.java:213)
 at org.apache.maven.lifecycle.internal.MojoExecutor.execute(MojoExecutor.java:154)
 at org.apache.maven.lifecycle.internal.MojoExecutor.execute(MojoExecutor.java:146)
 at org.apache.maven.lifecycle.internal.LifecycleModuleBuilder.buildProject(LifecycleModuleBuilder.java:117)
 at org.apache.maven.lifecycle.internal.LifecycleModuleBuilder.buildProject(LifecycleModuleBuilder.java:81)
 at org.apache.maven.lifecycle.internal.builder.singlethreaded.SingleThreadedBuilder.build(SingleThreadedBuilder.java:51)
 at org.apache.maven.lifecycle.internal.LifecycleStarter.execute(LifecycleStarter.java:128)
 at org.apache.maven.DefaultMaven.doExecute(DefaultMaven.java:309)
 at org.apache.maven.DefaultMaven.doExecute(DefaultMaven.java:194)
 at org.apache.maven.DefaultMaven.execute(DefaultMaven.java:107)
 at org.apache.maven.cli.MavenCli.execute(MavenCli.java:993)
 at org.apache.maven.cli.MavenCli.doMain(MavenCli.java:345)
 at org.apache.maven.cli.MavenCli.main(MavenCli.java:191)
 at java.base/jdk.internal.reflect.NativeMethodAccessorImpl.invoke0(Native Method)
 at java.base/jdk.internal.reflect.NativeMethodAccessorImpl.invoke(NativeMethodAccessorImpl.java:62)
 at java.base/jdk.internal.reflect.DelegatingMethodAccessorImpl.invoke(DelegatingMethodAccessorImpl.java:43)
 at java.base/java.lang.reflect.Method.invoke(Method.java:564)
 at org.codehaus.plexus.classworlds.launcher.Launcher.launchEnhanced(Launcher.java:289)
 at org.codehaus.plexus.classworlds.launcher.Launcher.launch(Launcher.java:229)
 at org.codehaus.plexus.classworlds.launcher.Launcher.mainWithExitCode(Launcher.java:415)
 at org.codehaus.plexus.classworlds.launcher.Launcher.main(Launcher.java:356)
Caused by: org.apache.maven.plugin.compiler.CompilationFailureException: Compilation failure
 at org.apache.maven.plugin.compiler.AbstractCompilerMojo.execute(AbstractCompilerMojo.java:858)
 at org.apache.maven.plugin.compiler.CompilerMojo.execute(CompilerMojo.java:129)
 at org.apache.maven.plugin.DefaultBuildPluginManager.executeMojo(DefaultBuildPluginManager.java:134)
 at org.apache.maven.lifecycle.internal.MojoExecutor.execute(MojoExecutor.java:208)
 ... 20 more
[ERROR] 
[ERROR] Re-run Maven using the -X switch to enable full debug logging.
[ERROR] 
[ERROR] For more information about the errors and possible solutions, please read the following articles:
[ERROR] [Help 1] http://cwiki.apache.org/confluence/display/MAVEN/MojoFailureException
[ERROR] 
[ERROR] After correcting the problems, you can resume the build with the command
[ERROR]   mvn <goals> -rf :deficient-dep


Stack Trace:
org.apache.maven.it.VerificationException: 
Exit code was non-zero: 1; command line and log = 
F:\jenkins\tools\maven\apache-maven-3.5.0\bin\mvn -e --batch-mode -Dmaven.repo.local=f:\jenkins\jenkins-slave\workspace\ote-resources-plugin_master-FTEJEAA7J3RSA3RGNRQRTOLNK5IUQ7QP3AJQZXDE4RWB3DK3KFPQ@2\m\target/it-repo org.apache.maven.plugins:maven-clean-plugin:clean deploy
Picked up JAVA_TOOL_OPTIONS: -Dmaven.ext.class.path="f:\jenkins\jenkins-slave\workspace\ote-resources-plugin_master-FTEJEAA7J3RSA3RGNRQRTOLNK5IUQ7QP3AJQZXDE4RWB3DK3KFPQ@2@tmp\withMavend8ba7d91\pipeline-maven-spy.jar" -Dorg.jenkinsci.plugins.pipeline.maven.reportsFolder="f:\jenkins\jenkins-slave\workspace\ote-resources-plugin_master-FTEJEAA7J3RSA3RGNRQRTOLNK5IUQ7QP3AJQZXDE4RWB3DK3KFPQ@2@tmp\withMavend8ba7d91" 
[INFO] [jenkins-event-spy] Generate F:\jenkins\jenkins-slave\workspace\ote-resources-plugin_master-FTEJEAA7J3RSA3RGNRQRTOLNK5IUQ7QP3AJQZXDE4RWB3DK3KFPQ@2@tmp\withMavend8ba7d91\maven-spy-20180303-174023-32815796926225573682634.log.tmp ...
[INFO] Error stacktraces are turned on.
[INFO] Scanning for projects...
[INFO] ------------------------------------------------------------------------
[INFO] Reactor Build Order:
[INFO] 
[INFO] resources
[INFO] supplemental-models
[INFO] deficient-dep
[INFO] 
[INFO] ------------------------------------------------------------------------
[INFO] Building resources 1
[INFO] ------------------------------------------------------------------------
[INFO] 
[INFO] --- maven-clean-plugin:2.5:clean (default-cli) @ resources ---
[INFO] 
[INFO] --- maven-install-plugin:2.4:install (default-install) @ resources ---
[INFO] Installing f:\jenkins\jenkins-slave\workspace\ote-resources-plugin_master-FTEJEAA7J3RSA3RGNRQRTOLNK5IUQ7QP3AJQZXDE4RWB3DK3KFPQ@2\m\target\test-classes\supplemental-artifact\resource-projects\pom.xml to f:\jenkins\jenkins-slave\workspace\ote-resources-plugin_master-FTEJEAA7J3RSA3RGNRQRTOLNK5IUQ7QP3AJQZXDE4RWB3DK3KFPQ@2\m\target\it-repo\org\apache\maven\plugin\rresource\it\mrr43\resources\1\resources-1.pom
[INFO] 
[INFO] --- maven-deploy-plugin:2.7:deploy (default-deploy) @ resources ---
[INFO] Uploading: file:f:\\jenkins\\jenkins-slave\\workspace\\ote-resources-plugin_master-FTEJEAA7J3RSA3RGNRQRTOLNK5IUQ7QP3AJQZXDE4RWB3DK3KFPQ@2\\m\\target/remote-repo/org/apache/maven/plugin/rresource/it/mrr43/resources/1/resources-1.pom
[INFO] Uploaded: file:f:\\jenkins\\jenkins-slave\\workspace\\ote-resources-plugin_master-FTEJEAA7J3RSA3RGNRQRTOLNK5IUQ7QP3AJQZXDE4RWB3DK3KFPQ@2\\m\\target/remote-repo/org/apache/maven/plugin/rresource/it/mrr43/resources/1/resources-1.pom (1.6 kB at 36 kB/s)
[INFO] Downloading: file:f:\\jenkins\\jenkins-slave\\workspace\\ote-resources-plugin_master-FTEJEAA7J3RSA3RGNRQRTOLNK5IUQ7QP3AJQZXDE4RWB3DK3KFPQ@2\\m\\target/remote-repo/org/apache/maven/plugin/rresource/it/mrr43/resources/maven-metadata.xml
[INFO] Uploading: file:f:\\jenkins\\jenkins-slave\\workspace\\ote-resources-plugin_master-FTEJEAA7J3RSA3RGNRQRTOLNK5IUQ7QP3AJQZXDE4RWB3DK3KFPQ@2\\m\\target/remote-repo/org/apache/maven/plugin/rresource/it/mrr43/resources/maven-metadata.xml
[INFO] Uploaded: file:f:\\jenkins\\jenkins-slave\\workspace\\ote-resources-plugin_master-FTEJEAA7J3RSA3RGNRQRTOLNK5IUQ7QP3AJQZXDE4RWB3DK3KFPQ@2\\m\\target/remote-repo/org/apache/maven/plugin/rresource/it/mrr43/resources/maven-metadata.xml (323 B at 162 kB/s)
[INFO] 
[INFO] ------------------------------------------------------------------------
[INFO] Building supplemental-models 1
[INFO] ------------------------------------------------------------------------
[INFO] 
[INFO] --- maven-clean-plugin:2.5:clean (default-cli) @ supplemental-models ---
[INFO] 
[INFO] --- maven-resources-plugin:2.6:resources (default-resources) @ supplemental-models ---
[WARNING] Using platform encoding (Cp1252 actually) to copy filtered resources, i.e. build is platform dependent!
[INFO] Copying 1 resource
[INFO] 
[INFO] --- maven-compiler-plugin:3.1:compile (default-compile) @ supplemental-models ---
[INFO] No sources to compile
[INFO] 
[INFO] --- maven-resources-plugin:2.6:testResources (default-testResources) @ supplemental-models ---
[WARNING] Using platform encoding (Cp1252 actually) to copy filtered resources, i.e. build is platform dependent!
[INFO] skip non existing resourceDirectory F:\jenkins\jenkins-slave\workspace\ote-resources-plugin_master-FTEJEAA7J3RSA3RGNRQRTOLNK5IUQ7QP3AJQZXDE4RWB3DK3KFPQ@2\m\target\test-classes\supplemental-artifact\resource-projects\supplemental-models\src\test\resources
[INFO] 
[INFO] --- maven-compiler-plugin:3.1:testCompile (default-testCompile) @ supplemental-models ---
[INFO] No sources to compile
[INFO] 
[INFO] --- maven-surefire-plugin:2.12.4:test (default-test) @ supplemental-models ---
[INFO] No tests to run.
[INFO] 
[INFO] --- maven-jar-plugin:2.4:jar (default-jar) @ supplemental-models ---
[INFO] Building jar: F:\jenkins\jenkins-slave\workspace\ote-resources-plugin_master-FTEJEAA7J3RSA3RGNRQRTOLNK5IUQ7QP3AJQZXDE4RWB3DK3KFPQ@2\m\target\test-classes\supplemental-artifact\resource-projects\supplemental-models\target\supplemental-models-1.jar
[INFO] 
[INFO] --- maven-install-plugin:2.4:install (default-install) @ supplemental-models ---
[INFO] Installing F:\jenkins\jenkins-slave\workspace\ote-resources-plugin_master-FTEJEAA7J3RSA3RGNRQRTOLNK5IUQ7QP3AJQZXDE4RWB3DK3KFPQ@2\m\target\test-classes\supplemental-artifact\resource-projects\supplemental-models\target\supplemental-models-1.jar to f:\jenkins\jenkins-slave\workspace\ote-resources-plugin_master-FTEJEAA7J3RSA3RGNRQRTOLNK5IUQ7QP3AJQZXDE4RWB3DK3KFPQ@2\m\target\it-repo\org\apache\maven\plugin\rresource\it\mrr43\supplemental-models\1\supplemental-models-1.jar
[INFO] Installing F:\jenkins\jenkins-slave\workspace\ote-resources-plugin_master-FTEJEAA7J3RSA3RGNRQRTOLNK5IUQ7QP3AJQZXDE4RWB3DK3KFPQ@2\m\target\test-classes\supplemental-artifact\resource-projects\supplemental-models\pom.xml to f:\jenkins\jenkins-slave\workspace\ote-resources-plugin_master-FTEJEAA7J3RSA3RGNRQRTOLNK5IUQ7QP3AJQZXDE4RWB3DK3KFPQ@2\m\target\it-repo\org\apache\maven\plugin\rresource\it\mrr43\supplemental-models\1\supplemental-models-1.pom
[INFO] 
[INFO] --- maven-deploy-plugin:2.7:deploy (default-deploy) @ supplemental-models ---
[INFO] Uploading: file:f:\\jenkins\\jenkins-slave\\workspace\\ote-resources-plugin_master-FTEJEAA7J3RSA3RGNRQRTOLNK5IUQ7QP3AJQZXDE4RWB3DK3KFPQ@2\\m\\target/remote-repo/org/apache/maven/plugin/rresource/it/mrr43/supplemental-models/1/supplemental-models-1.jar
[INFO] Uploaded: file:f:\\jenkins\\jenkins-slave\\workspace\\ote-resources-plugin_master-FTEJEAA7J3RSA3RGNRQRTOLNK5IUQ7QP3AJQZXDE4RWB3DK3KFPQ@2\\m\\target/remote-repo/org/apache/maven/plugin/rresource/it/mrr43/supplemental-models/1/supplemental-models-1.jar (3.0 kB at 597 kB/s)
[INFO] Uploading: file:f:\\jenkins\\jenkins-slave\\workspace\\ote-resources-plugin_master-FTEJEAA7J3RSA3RGNRQRTOLNK5IUQ7QP3AJQZXDE4RWB3DK3KFPQ@2\\m\\target/remote-repo/org/apache/maven/plugin/rresource/it/mrr43/supplemental-models/1/supplemental-models-1.pom
[INFO] Uploaded: file:f:\\jenkins\\jenkins-slave\\workspace\\ote-resources-plugin_master-FTEJEAA7J3RSA3RGNRQRTOLNK5IUQ7QP3AJQZXDE4RWB3DK3KFPQ@2\\m\\target/remote-repo/org/apache/maven/plugin/rresource/it/mrr43/supplemental-models/1/supplemental-models-1.pom (1.3 kB at 62 kB/s)
[INFO] Downloading: file:f:\\jenkins\\jenkins-slave\\workspace\\ote-resources-plugin_master-FTEJEAA7J3RSA3RGNRQRTOLNK5IUQ7QP3AJQZXDE4RWB3DK3KFPQ@2\\m\\target/remote-repo/org/apache/maven/plugin/rresource/it/mrr43/supplemental-models/maven-metadata.xml
[INFO] Uploading: file:f:\\jenkins\\jenkins-slave\\workspace\\ote-resources-plugin_master-FTEJEAA7J3RSA3RGNRQRTOLNK5IUQ7QP3AJQZXDE4RWB3DK3KFPQ@2\\m\\target/remote-repo/org/apache/maven/plugin/rresource/it/mrr43/supplemental-models/maven-metadata.xml
[INFO] Uploaded: file:f:\\jenkins\\jenkins-slave\\workspace\\ote-resources-plugin_master-FTEJEAA7J3RSA3RGNRQRTOLNK5IUQ7QP3AJQZXDE4RWB3DK3KFPQ@2\\m\\target/remote-repo/org/apache/maven/plugin/rresource/it/mrr43/supplemental-models/maven-metadata.xml (333 B at 333 kB/s)
[INFO] 
[INFO] ------------------------------------------------------------------------
[INFO] Building deficient-dep 1
[INFO] ------------------------------------------------------------------------
[INFO] 
[INFO] --- maven-clean-plugin:2.5:clean (default-cli) @ deficient-dep ---
[INFO] 
[INFO] --- maven-resources-plugin:2.6:resources (default-resources) @ deficient-dep ---
[WARNING] Using platform encoding (Cp1252 actually) to copy filtered resources, i.e. build is platform dependent!
[INFO] skip non existing resourceDirectory F:\jenkins\jenkins-slave\workspace\ote-resources-plugin_master-FTEJEAA7J3RSA3RGNRQRTOLNK5IUQ7QP3AJQZXDE4RWB3DK3KFPQ@2\m\target\test-classes\supplemental-artifact\resource-projects\deficient-dep\src\main\resources
[INFO] 
[INFO] --- maven-compiler-plugin:3.1:compile (default-compile) @ deficient-dep ---
[INFO] Changes detected - recompiling the module!
[WARNING] File encoding has not been set, using platform encoding Cp1252, i.e. build is platform dependent!
[INFO] Compiling 1 source file to F:\jenkins\jenkins-slave\workspace\ote-resources-plugin_master-FTEJEAA7J3RSA3RGNRQRTOLNK5IUQ7QP3AJQZXDE4RWB3DK3KFPQ@2\m\target\test-classes\supplemental-artifact\resource-projects\deficient-dep\target\classes
[INFO] -------------------------------------------------------------
[ERROR] COMPILATION ERROR : 
[INFO] -------------------------------------------------------------
[ERROR] Source option 1.5 is no longer supported. Use 1.6 or later.
[ERROR] Target option 1.5 is no longer supported. Use 1.6 or later.
[INFO] 2 errors 
[INFO] -------------------------------------------------------------
[INFO] ------------------------------------------------------------------------
[INFO] Reactor Summary:
[INFO] 
[INFO] resources .......................................... SUCCESS [  0.750 s]
[INFO] supplemental-models ................................ SUCCESS [  1.492 s]
[INFO] deficient-dep ...................................... FAILURE [  0.819 s]
[INFO] ------------------------------------------------------------------------
[INFO] BUILD FAILURE
[INFO] ------------------------------------------------------------------------
[INFO] Total time: 3.482 s
[INFO] Finished at: 2018-03-03T17:40:27Z
[INFO] Final Memory: 14M/48M
[INFO] ------------------------------------------------------------------------
[INFO] [jenkins-event-spy] Generated F:\jenkins\jenkins-slave\workspace\ote-resources-plugin_master-FTEJEAA7J3RSA3RGNRQRTOLNK5IUQ7QP3AJQZXDE4RWB3DK3KFPQ@2@tmp\withMavend8ba7d91\maven-spy-20180303-174023-32815796926225573682634.log
[ERROR] Failed to execute goal org.apache.maven.plugins:maven-compiler-plugin:3.1:compile (default-compile) on project deficient-dep: Compilation failure: Compilation failure: 
[ERROR] Source option 1.5 is no longer supported. Use 1.6 or later.
[ERROR] Target option 1.5 is no longer supported. Use 1.6 or later.
[ERROR] -> [Help 1]
org.apache.maven.lifecycle.LifecycleExecutionException: Failed to execute goal org.apache.maven.plugins:maven-compiler-plugin:3.1:compile (default-compile) on project deficient-dep: Compilation failure
	at org.apache.maven.lifecycle.internal.MojoExecutor.execute(MojoExecutor.java:213)
	at org.apache.maven.lifecycle.internal.MojoExecutor.execute(MojoExecutor.java:154)
	at org.apache.maven.lifecycle.internal.MojoExecutor.execute(MojoExecutor.java:146)
	at org.apache.maven.lifecycle.internal.LifecycleModuleBuilder.buildProject(LifecycleModuleBuilder.java:117)
	at org.apache.maven.lifecycle.internal.LifecycleModuleBuilder.buildProject(LifecycleModuleBuilder.java:81)
	at org.apache.maven.lifecycle.internal.builder.singlethreaded.SingleThreadedBuilder.build(SingleThreadedBuilder.java:51)
	at org.apache.maven.lifecycle.internal.LifecycleStarter.execute(LifecycleStarter.java:128)
	at org.apache.maven.DefaultMaven.doExecute(DefaultMaven.java:309)
	at org.apache.maven.DefaultMaven.doExecute(DefaultMaven.java:194)
	at org.apache.maven.DefaultMaven.execute(DefaultMaven.java:107)
	at org.apache.maven.cli.MavenCli.execute(MavenCli.java:993)
	at org.apache.maven.cli.MavenCli.doMain(MavenCli.java:345)
	at org.apache.maven.cli.MavenCli.main(MavenCli.java:191)
	at java.base/jdk.internal.reflect.NativeMethodAccessorImpl.invoke0(Native Method)
	at java.base/jdk.internal.reflect.NativeMethodAccessorImpl.invoke(NativeMethodAccessorImpl.java:62)
	at java.base/jdk.internal.reflect.DelegatingMethodAccessorImpl.invoke(DelegatingMethodAccessorImpl.java:43)
	at java.base/java.lang.reflect.Method.invoke(Method.java:564)
	at org.codehaus.plexus.classworlds.launcher.Launcher.launchEnhanced(Launcher.java:289)
	at org.codehaus.plexus.classworlds.launcher.Launcher.launch(Launcher.java:229)
	at org.codehaus.plexus.classworlds.launcher.Launcher.mainWithExitCode(Launcher.java:415)
	at org.codehaus.plexus.classworlds.launcher.Launcher.main(Launcher.java:356)
Caused by: org.apache.maven.plugin.compiler.CompilationFailureException: Compilation failure
	at org.apache.maven.plugin.compiler.AbstractCompilerMojo.execute(AbstractCompilerMojo.java:858)
	at org.apache.maven.plugin.compiler.CompilerMojo.execute(CompilerMojo.java:129)
	at org.apache.maven.plugin.DefaultBuildPluginManager.executeMojo(DefaultBuildPluginManager.java:134)
	at org.apache.maven.lifecycle.internal.MojoExecutor.execute(MojoExecutor.java:208)
	... 20 more
[ERROR] 
[ERROR] Re-run Maven using the -X switch to enable full debug logging.
[ERROR] 
[ERROR] For more information about the errors and possible solutions, please read the following articles:
[ERROR] [Help 1] http://cwiki.apache.org/confluence/display/MAVEN/MojoFailureException
[ERROR] 
[ERROR] After correcting the problems, you can resume the build with the command
[ERROR]   mvn <goals> -rf :deficient-dep

	at org.apache.maven.plugin.resources.remote.it.IT_SupplementalArtifact.test(IT_SupplementalArtifact.java:50)




Build log:
[...truncated 1.92 MB...]
[linux-jdk7] [TASKS] Computing warning deltas based on reference build #2
[linux-jdk7] [withMaven] artifactsPublisher - Archive artifact m/target/test-classes/run-only-at-execution-root/resource-projects/release/pom.xml under org/apache/maven/plugin/rresource/it/mrr41/release/1.0/release-1.0.pom
[linux-jdk7] [withMaven] artifactsPublisher - Archive artifact m/target/test-classes/run-only-at-execution-root/resource-projects/release/target/release-1.0.jar under org/apache/maven/plugin/rresource/it/mrr41/release/1.0/release-1.0.jar
[linux-jdk7] [withMaven] artifactsPublisher - Archive artifact m/target/test-classes/run-only-at-execution-root/resource-projects/snapshot/pom.xml under org/apache/maven/plugin/rresource/it/mrr41/snapshot/1.0-SNAPSHOT/snapshot-1.0-SNAPSHOT.pom
[linux-jdk7] [withMaven] artifactsPublisher - Archive artifact m/target/test-classes/run-only-at-execution-root/resource-projects/snapshot/target/snapshot-1.0-SNAPSHOT.jar under org/apache/maven/plugin/rresource/it/mrr41/snapshot/1.0-SNAPSHOT/snapshot-1.0-SNAPSHOT.jar
[linux-jdk7] [withMaven] artifactsPublisher - Archive artifact m/target/test-classes/run-only-at-execution-root/resource-projects/pom.xml under org/apache/maven/plugin/rresource/it/mrr41/aggregator/1.0/aggregator-1.0.pom
[linux-jdk7] [withMaven] junitPublisher - Archive test results for Maven artifact org.apache.maven.plugin.rresource.it.mrr41:release:1.0 generated by maven-surefire-plugin:test (default-test): m/target/test-classes/run-only-at-execution-root/resource-projects/release/target/surefire-reports/*.xml
[linux-jdk7] [withMaven] junitPublisher - Jenkins JUnit Attachments Plugin not found, can't publish test attachments.Recording test results
[linux-jdk7] None of the test reports contained any result
[linux-jdk7] [withMaven] junitPublisher - Archive test results for Maven artifact org.apache.maven.plugin.rresource.it.mrr41:snapshot:1.0-SNAPSHOT generated by maven-surefire-plugin:test (default-test): m/target/test-classes/run-only-at-execution-root/resource-projects/snapshot/target/surefire-reports/*.xml
[linux-jdk7] [withMaven] junitPublisher - Jenkins JUnit Attachments Plugin not found, can't publish test attachments.Recording test results
[linux-jdk7] None of the test reports contained any result
[linux-jdk7] [withMaven] artifactsPublisher - Archive artifact m/target/test-classes/run-only-at-execution-root/pom.xml under org/apache/maven/plugin/rresource/it/mrr41/parent/1.6-SNAPSHOT/parent-1.6-SNAPSHOT.pom
[linux-jdk7] [withMaven] artifactsPublisher - Archive artifact m/target/test-classes/run-only-at-execution-root/child1/pom.xml under org/apache/maven/plugin/rresource/it/mrr41/child-1/1.6-SNAPSHOT/child-1-1.6-SNAPSHOT.pom
[linux-jdk7] [withMaven] artifactsPublisher - Archive artifact m/target/test-classes/run-only-at-execution-root/child2/pom.xml under org/apache/maven/plugin/rresource/it/mrr41/child-2/1.6-SNAPSHOT/child-2-1.6-SNAPSHOT.pom
[linux-jdk7] [withMaven] artifactsPublisher - Archive artifact m/target/test-classes/generate-from-bundle/pom.xml under org/apache/maven/plugin/rresource/it/generate-from-bundle/1.6-SNAPSHOT/generate-from-bundle-1.6-SNAPSHOT.pom
[linux-jdk7] [withMaven] openTasksPublisher - Scan Tasks for Maven artifact org.apache.maven.plugin.rresource.it:generate-from-bundle:1.6-SNAPSHOT in source directory m/target/test-classes/generate-from-bundle/src/main/java
[linux-jdk7] [TASKS] Scanning folder '/home/jenkins/jenkins-slave/workspace/ote-resources-plugin_master-FTEJEAA7J3RSA3RGNRQRTOLNK5IUQ7QP3AJQZXDE4RWB3DK3KFPQ' for files matching the pattern 'm/target/test-classes/generate-from-bundle/src/main/java/**/*' - excludes: null
[linux-jdk7] [TASKS] Found 1 files to scan for tasks
[linux-jdk7] [TASKS] Found 0 open tasks.
[linux-jdk7] Skipping warnings blame since pipelines do not have an SCM link.%n
[linux-jdk7] [TASKS] Computing warning deltas based on reference build #2
[linux-jdk7] [withMaven] artifactsPublisher - Archive artifact m/target/test-classes/generate-from-bundle-with-type-and-classifier/pom.xml under org/apache/maven/plugin/rresource/it/generate-from-bundle-with-type-and-classifier/1.6-SNAPSHOT/generate-from-bundle-with-type-and-classifier-1.6-SNAPSHOT.pom
[linux-jdk7] [withMaven] openTasksPublisher - Scan Tasks for Maven artifact org.apache.maven.plugin.rresource.it:generate-from-bundle-with-type-and-classifier:1.6-SNAPSHOT in source directory m/target/test-classes/generate-from-bundle-with-type-and-classifier/src/main/java
[linux-jdk7] [TASKS] Scanning folder '/home/jenkins/jenkins-slave/workspace/ote-resources-plugin_master-FTEJEAA7J3RSA3RGNRQRTOLNK5IUQ7QP3AJQZXDE4RWB3DK3KFPQ' for files matching the pattern 'm/target/test-classes/generate-from-bundle-with-type-and-classifier/src/main/java/**/*' - excludes: null
[linux-jdk7] [TASKS] Found 1 files to scan for tasks
[linux-jdk7] [TASKS] Found 0 open tasks.
[linux-jdk7] Skipping warnings blame since pipelines do not have an SCM link.%n
[linux-jdk7] [TASKS] Computing warning deltas based on reference build #2
[linux-jdk7] [withMaven] artifactsPublisher - Archive artifact m/target/test-classes/get-dependency-projects/release/pom.xml under org/apache/maven/plugin/rresource/it/gdp/release/1.0/release-1.0.pom
[linux-jdk7] [withMaven] artifactsPublisher - Archive artifact m/target/test-classes/get-dependency-projects/release/target/release-1.0.jar under org/apache/maven/plugin/rresource/it/gdp/release/1.0/release-1.0.jar
[linux-jdk7] [withMaven] artifactsPublisher - Archive artifact m/target/test-classes/get-dependency-projects/snapshot/pom.xml under org/apache/maven/plugin/rresource/it/gdp/snapshot/1.0-SNAPSHOT/snapshot-1.0-SNAPSHOT.pom
[linux-jdk7] [withMaven] artifactsPublisher - Archive artifact m/target/test-classes/get-dependency-projects/snapshot/target/snapshot-1.0-SNAPSHOT.jar under org/apache/maven/plugin/rresource/it/gdp/snapshot/1.0-SNAPSHOT/snapshot-1.0-SNAPSHOT.jar
[linux-jdk7] [withMaven] artifactsPublisher - Archive artifact m/target/test-classes/get-dependency-projects/pom.xml under org/apache/maven/plugin/rresource/it/aggregator/1.0/aggregator-1.0.pom
[linux-jdk7] [withMaven] junitPublisher - Archive test results for Maven artifact org.apache.maven.plugin.rresource.it.gdp:release:1.0 generated by maven-surefire-plugin:test (default-test): m/target/test-classes/get-dependency-projects/release/target/surefire-reports/*.xml
[linux-jdk7] [withMaven] junitPublisher - Jenkins JUnit Attachments Plugin not found, can't publish test attachments.Recording test results
[linux-jdk7] None of the test reports contained any result
[linux-jdk7] [withMaven] junitPublisher - Archive test results for Maven artifact org.apache.maven.plugin.rresource.it.gdp:snapshot:1.0-SNAPSHOT generated by maven-surefire-plugin:test (default-test): m/target/test-classes/get-dependency-projects/snapshot/target/surefire-reports/*.xml
[linux-jdk7] [withMaven] junitPublisher - Jenkins JUnit Attachments Plugin not found, can't publish test attachments.Recording test results
[linux-jdk7] None of the test reports contained any result
[linux-jdk7] [withMaven] artifactsPublisher - Archive artifact m/target/test-classes/get-dependency-projects/project/pom.xml under org/apache/maven/plugin/rresource/it/get-dependency-projects/1.6-SNAPSHOT/get-dependency-projects-1.6-SNAPSHOT.pom
[linux-jdk7] [withMaven] artifactsPublisher - Archive artifact m/target/test-classes/custom-filter-delim/pom.xml under org/apache/maven/plugin/rresource/it/custom-filter-delim/1.6-SNAPSHOT/custom-filter-delim-1.6-SNAPSHOT.pom
[linux-jdk7] [withMaven] openTasksPublisher - Scan Tasks for Maven artifact org.apache.maven.plugin.rresource.it:custom-filter-delim:1.6-SNAPSHOT in source directory m/target/test-classes/custom-filter-delim/src/main/java
[linux-jdk7] [TASKS] Scanning folder '/home/jenkins/jenkins-slave/workspace/ote-resources-plugin_master-FTEJEAA7J3RSA3RGNRQRTOLNK5IUQ7QP3AJQZXDE4RWB3DK3KFPQ' for files matching the pattern 'm/target/test-classes/custom-filter-delim/src/main/java/**/*' - excludes: null
[linux-jdk7] [TASKS] Found 1 files to scan for tasks
[linux-jdk7] [TASKS] Found 0 open tasks.
[linux-jdk7] Skipping warnings blame since pipelines do not have an SCM link.%n
[linux-jdk7] [TASKS] Computing warning deltas based on reference build #2
[linux-jdk7] [withMaven] artifactsPublisher - Archive artifact m/target/test-classes/filter-local-override/pom.xml under org/apache/maven/plugin/rresource/it/filter-local-override/1.6-SNAPSHOT/filter-local-override-1.6-SNAPSHOT.pom
[linux-jdk7] [withMaven] openTasksPublisher - Scan Tasks for Maven artifact org.apache.maven.plugin.rresource.it:filter-local-override:1.6-SNAPSHOT in source directory m/target/test-classes/filter-local-override/src/main/java
[linux-jdk7] [TASKS] Scanning folder '/home/jenkins/jenkins-slave/workspace/ote-resources-plugin_master-FTEJEAA7J3RSA3RGNRQRTOLNK5IUQ7QP3AJQZXDE4RWB3DK3KFPQ' for files matching the pattern 'm/target/test-classes/filter-local-override/src/main/java/**/*' - excludes: null
[linux-jdk7] [TASKS] Found 1 files to scan for tasks
[linux-jdk7] [TASKS] Found 0 open tasks.
[linux-jdk7] Skipping warnings blame since pipelines do not have an SCM link.%n
[linux-jdk7] [TASKS] Computing warning deltas based on reference build #2
[linux-jdk7] [withMaven] artifactsPublisher - Archive artifact m/target/test-classes/bad-dependency-poms/pom.xml under org/apache/maven/plugin/rresource/it/test/1.0/test-1.0.pom
[linux-jdk7] [withMaven] artifactsPublisher - Archive artifact m/target/it/maven-remote-resources-test/pom.xml under org/apache/maven/maven-remote-resources-test/1.0-SNAPSHOT/maven-remote-resources-test-1.0-SNAPSHOT.pom
[linux-jdk7] [withMaven] artifactsPublisher - Archive artifact m/target/it/maven-remote-resources-test/target/maven-remote-resources-test-1.0-SNAPSHOT.jar under org/apache/maven/maven-remote-resources-test/1.0-SNAPSHOT/maven-remote-resources-test-1.0-SNAPSHOT.jar
[linux-jdk7] [withMaven] junitPublisher - Archive test results for Maven artifact org.apache.maven:maven-remote-resources-test:1.0-SNAPSHOT generated by maven-surefire-plugin:test (default-test): m/target/it/maven-remote-resources-test/target/surefire-reports/*.xml
[linux-jdk7] [withMaven] junitPublisher - Jenkins JUnit Attachments Plugin not found, can't publish test attachments.Recording test results
[linux-jdk7] None of the test reports contained any result
[linux-jdk7] [withMaven] openTasksPublisher - Scan Tasks for Maven artifact org.apache.maven:maven-remote-resources-test:1.0-SNAPSHOT in source directory m/target/it/maven-remote-resources-test/src/main/java
[linux-jdk7] [TASKS] Scanning folder '/home/jenkins/jenkins-slave/workspace/ote-resources-plugin_master-FTEJEAA7J3RSA3RGNRQRTOLNK5IUQ7QP3AJQZXDE4RWB3DK3KFPQ' for files matching the pattern 'm/target/it/maven-remote-resources-test/src/main/java/**/*' - excludes: null
[linux-jdk7] [TASKS] Found 1 files to scan for tasks
[linux-jdk7] [TASKS] Found 0 open tasks.
[linux-jdk7] Skipping warnings blame since pipelines do not have an SCM link.%n
[linux-jdk7] [TASKS] Computing warning deltas based on reference build #2
[Pipeline] [linux-jdk8] }
[linux-jdk8] [withMaven] junitPublisher - Archive test results for Maven artifact org.apache.maven.plugins:maven-remote-resources-plugin:1.6-SNAPSHOT generated by maven-surefire-plugin:test (default-test): m/target/surefire-reports/*.xml
[linux-jdk8] [withMaven] junitPublisher - Jenkins JUnit Attachments Plugin not found, can't publish test attachments.Recording test results
[linux-jdk8] [withMaven] junitPublisher - Archive test results for Maven artifact org.apache.maven.plugins:maven-remote-resources-plugin:1.6-SNAPSHOT generated by maven-failsafe-plugin:integration-test (integration-tests): m/target/failsafe-reports/*.xml
[linux-jdk8] [withMaven] junitPublisher - Jenkins JUnit Attachments Plugin not found, can't publish test attachments.Recording test results
[linux-jdk8] [withMaven] junitPublisher - Archive test results for Maven artifact org.apache.maven.plugin.rresource.it:resource-bundle-with-template:1.6-SNAPSHOT generated by maven-surefire-plugin:test (default-test): m/target/test-classes/bootstrap/resource-bundle-with-template/target/surefire-reports/*.xml
[linux-jdk8] [withMaven] junitPublisher - Jenkins JUnit Attachments Plugin not found, can't publish test attachments.Recording test results
[linux-jdk8] None of the test reports contained any result
[linux-jdk8] [withMaven] junitPublisher - Archive test results for Maven artifact org.apache.maven.plugin.rresource.it:resource-bundle-with-org-processing:1.6-SNAPSHOT generated by maven-surefire-plugin:test (default-test): m/target/test-classes/bootstrap/resource-bundle-with-org-processing/target/surefire-reports/*.xml
[linux-jdk8] [withMaven] junitPublisher - Jenkins JUnit Attachments Plugin not found, can't publish test attachments.Recording test results
[linux-jdk8] None of the test reports contained any result
[linux-jdk8] [withMaven] junitPublisher - Archive test results for Maven artifact org.apache.maven.plugin.rresource.it:resource-bundle-with-type-and-classifier:1.6-SNAPSHOT generated by maven-surefire-plugin:test (default-test): m/target/test-classes/bootstrap/resource-bundle-with-type-and-classifier/target/surefire-reports/*.xml
[linux-jdk8] [withMaven] junitPublisher - Jenkins JUnit Attachments Plugin not found, can't publish test attachments.Recording test results
[linux-jdk8] None of the test reports contained any result
[linux-jdk8] [withMaven] junitPublisher - Archive test results for Maven artifact org.apache.maven.plugin.rresource.it.mrr41:release:1.0 generated by maven-surefire-plugin:test (default-test): m/target/test-classes/run-only-at-execution-root/resource-projects/release/target/surefire-reports/*.xml
[linux-jdk8] [withMaven] junitPublisher - Jenkins JUnit Attachments Plugin not found, can't publish test attachments.Recording test results
[linux-jdk8] None of the test reports contained any result
[linux-jdk8] [withMaven] junitPublisher - Archive test results for Maven artifact org.apache.maven.plugin.rresource.it.mrr41:snapshot:1.0-SNAPSHOT generated by maven-surefire-plugin:test (default-test): m/target/test-classes/run-only-at-execution-root/resource-projects/snapshot/target/surefire-reports/*.xml
[linux-jdk8] [withMaven] junitPublisher - Jenkins JUnit Attachments Plugin not found, can't publish test attachments.Recording test results
[linux-jdk8] None of the test reports contained any result
[linux-jdk8] [withMaven] junitPublisher - Archive test results for Maven artifact org.apache.maven.plugin.rresource.it.gdp:release:1.0 generated by maven-surefire-plugin:test (default-test): m/target/test-classes/get-dependency-projects/release/target/surefire-reports/*.xml
[linux-jdk8] [withMaven] junitPublisher - Jenkins JUnit Attachments Plugin not found, can't publish test attachments.Recording test results
[linux-jdk8] None of the test reports contained any result
[linux-jdk8] [withMaven] junitPublisher - Archive test results for Maven artifact org.apache.maven.plugin.rresource.it.gdp:snapshot:1.0-SNAPSHOT generated by maven-surefire-plugin:test (default-test): m/target/test-classes/get-dependency-projects/snapshot/target/surefire-reports/*.xml
[linux-jdk8] [withMaven] junitPublisher - Jenkins JUnit Attachments Plugin not found, can't publish test attachments.Recording test results
[linux-jdk8] None of the test reports contained any result
[linux-jdk8] [withMaven] junitPublisher - Archive test results for Maven artifact org.apache.maven.plugin.rresource.it.mrr43:supplemental-models:1 generated by maven-surefire-plugin:test (default-test): m/target/test-classes/supplemental-artifact/resource-projects/supplemental-models/target/surefire-reports/*.xml
[linux-jdk8] [withMaven] junitPublisher - Jenkins JUnit Attachments Plugin not found, can't publish test attachments.Recording test results
[linux-jdk8] None of the test reports contained any result
[linux-jdk8] [withMaven] junitPublisher - Archive test results for Maven artifact org.apache.maven.plugin.rresource.it.mrr43:deficient-dep:1 generated by maven-surefire-plugin:test (default-test): m/target/test-classes/supplemental-artifact/resource-projects/deficient-dep/target/surefire-reports/*.xml
[linux-jdk8] [withMaven] junitPublisher - Jenkins JUnit Attachments Plugin not found, can't publish test attachments.Recording test results
[linux-jdk8] None of the test reports contained any result
[linux-jdk8] [withMaven] junitPublisher - Archive test results for Maven artifact org.apache.maven:maven-remote-resources-test:1.0-SNAPSHOT generated by maven-surefire-plugin:test (default-test): m/target/it/maven-remote-resources-test/target/surefire-reports/*.xml
[linux-jdk8] [withMaven] junitPublisher - Jenkins JUnit Attachments Plugin not found, can't publish test attachments.Recording test results
[linux-jdk8] None of the test reports contained any result
[Pipeline] [linux-jdk9] // node
[Pipeline] [linux-jdk7] // withMaven
[Pipeline] [linux-jdk8] // withMaven
[Pipeline] [linux-jdk9] }
[Pipeline] [windows-jdk9] }
[Pipeline] [windows-jdk8] }
[Pipeline] [linux-jdk7] }
[Pipeline] [linux-jdk8] }
[Pipeline] [windows-jdk7] }
[Pipeline] [windows-jdk9] // dir
[Pipeline] [windows-jdk8] // dir
[Pipeline] [linux-jdk7] // stage
[Pipeline] [linux-jdk8] // stage
[Pipeline] [windows-jdk7] // dir
[Pipeline] [linux-jdk7] }
[Pipeline] [linux-jdk8] }
[Pipeline] [windows-jdk9] }
[windows-jdk9] [withMaven] junitPublisher - Archive test results for Maven artifact org.apache.maven.plugins:maven-remote-resources-plugin:1.6-SNAPSHOT generated by maven-surefire-plugin:test (default-test): m\target\surefire-reports\*.xml
[windows-jdk9] [withMaven] junitPublisher - Jenkins JUnit Attachments Plugin not found, can't publish test attachments.Recording test results
[windows-jdk9] [withMaven] junitPublisher - Archive test results for Maven artifact org.apache.maven.plugins:maven-remote-resources-plugin:1.6-SNAPSHOT generated by maven-failsafe-plugin:integration-test (integration-tests): m\target\failsafe-reports\*.xml
[windows-jdk9] [withMaven] junitPublisher - Jenkins JUnit Attachments Plugin not found, can't publish test attachments.Recording test results
[windows-jdk9] [withMaven] junitPublisher - Archive test results for Maven artifact org.apache.maven.plugin.rresource.it:resource-bundle-with-template:1.6-SNAPSHOT generated by maven-surefire-plugin:test (default-test): m\target\test-classes\bootstrap\resource-bundle-with-template\target\surefire-reports\*.xml
[windows-jdk9] [withMaven] junitPublisher - Jenkins JUnit Attachments Plugin not found, can't publish test attachments.Recording test results
[windows-jdk9] None of the test reports contained any result
[windows-jdk9] [withMaven] junitPublisher - Archive test results for Maven artifact org.apache.maven.plugin.rresource.it:resource-bundle-with-org-processing:1.6-SNAPSHOT generated by maven-surefire-plugin:test (default-test): m\target\test-classes\bootstrap\resource-bundle-with-org-processing\target\surefire-reports\*.xml
[windows-jdk9] [withMaven] junitPublisher - Jenkins JUnit Attachments Plugin not found, can't publish test attachments.Recording test results
[windows-jdk9] None of the test reports contained any result
[windows-jdk9] [withMaven] junitPublisher - Archive test results for Maven artifact org.apache.maven.plugin.rresource.it:resource-bundle-with-type-and-classifier:1.6-SNAPSHOT generated by maven-surefire-plugin:test (default-test): m\target\test-classes\bootstrap\resource-bundle-with-type-and-classifier\target\surefire-reports\*.xml
[windows-jdk9] [withMaven] junitPublisher - Jenkins JUnit Attachments Plugin not found, can't publish test attachments.Recording test results
[windows-jdk9] None of the test reports contained any result
[windows-jdk9] [withMaven] junitPublisher - Archive test results for Maven artifact org.apache.maven.plugin.rresource.it.gdp:release:1.0 generated by maven-surefire-plugin:test (default-test): m\target\test-classes\get-dependency-projects\release\target\surefire-reports\*.xml
[windows-jdk9] [withMaven] junitPublisher - Jenkins JUnit Attachments Plugin not found, can't publish test attachments.Recording test results
[windows-jdk9] None of the test reports contained any result
[windows-jdk9] [withMaven] junitPublisher - Archive test results for Maven artifact org.apache.maven.plugin.rresource.it.gdp:snapshot:1.0-SNAPSHOT generated by maven-surefire-plugin:test (default-test): m\target\test-classes\get-dependency-projects\snapshot\target\surefire-reports\*.xml
[windows-jdk9] [withMaven] junitPublisher - Jenkins JUnit Attachments Plugin not found, can't publish test attachments.Recording test results
[windows-jdk9] None of the test reports contained any result
[windows-jdk9] [withMaven] junitPublisher - Archive test results for Maven artifact org.apache.maven.plugin.rresource.it.mrr41:release:1.0 generated by maven-surefire-plugin:test (default-test): m\target\test-classes\run-only-at-execution-root\resource-projects\release\target\surefire-reports\*.xml
[windows-jdk9] [withMaven] junitPublisher - Jenkins JUnit Attachments Plugin not found, can't publish test attachments.Recording test results
[windows-jdk9] None of the test reports contained any result
[windows-jdk9] [withMaven] junitPublisher - Archive test results for Maven artifact org.apache.maven.plugin.rresource.it.mrr41:snapshot:1.0-SNAPSHOT generated by maven-surefire-plugin:test (default-test): m\target\test-classes\run-only-at-execution-root\resource-projects\snapshot\target\surefire-reports\*.xml
[windows-jdk9] [withMaven] junitPublisher - Jenkins JUnit Attachments Plugin not found, can't publish test attachments.Recording test results
[windows-jdk9] None of the test reports contained any result
[windows-jdk9] [withMaven] junitPublisher - Archive test results for Maven artifact org.apache.maven.plugin.rresource.it.mrr43:supplemental-models:1 generated by maven-surefire-plugin:test (default-test): m\target\test-classes\supplemental-artifact\resource-projects\supplemental-models\target\surefire-reports\*.xml
[windows-jdk9] [withMaven] junitPublisher - Jenkins JUnit Attachments Plugin not found, can't publish test attachments.Recording test results
[windows-jdk9] None of the test reports contained any result
[windows-jdk9] [withMaven] junitPublisher - Archive test results for Maven artifact org.apache.maven:maven-remote-resources-test:1.0-SNAPSHOT generated by maven-surefire-plugin:test (default-test): m\target\it\maven-remote-resources-test\target\surefire-reports\*.xml
[windows-jdk9] [withMaven] junitPublisher - Jenkins JUnit Attachments Plugin not found, can't publish test attachments.Recording test results
[windows-jdk9] None of the test reports contained any result
[Pipeline] [windows-jdk8] }
[windows-jdk8] [withMaven] junitPublisher - Archive test results for Maven artifact org.apache.maven.plugins:maven-remote-resources-plugin:1.6-SNAPSHOT generated by maven-surefire-plugin:test (default-test): m\target\surefire-reports\*.xml
[windows-jdk8] [withMaven] junitPublisher - Jenkins JUnit Attachments Plugin not found, can't publish test attachments.Recording test results
[windows-jdk8] [withMaven] junitPublisher - Archive test results for Maven artifact org.apache.maven.plugins:maven-remote-resources-plugin:1.6-SNAPSHOT generated by maven-failsafe-plugin:integration-test (integration-tests): m\target\failsafe-reports\*.xml
[windows-jdk8] [withMaven] junitPublisher - Jenkins JUnit Attachments Plugin not found, can't publish test attachments.Recording test results
[windows-jdk8] [withMaven] junitPublisher - Archive test results for Maven artifact org.apache.maven.plugin.rresource.it:resource-bundle-with-template:1.6-SNAPSHOT generated by maven-surefire-plugin:test (default-test): m\target\test-classes\bootstrap\resource-bundle-with-template\target\surefire-reports\*.xml
[windows-jdk8] [withMaven] junitPublisher - Jenkins JUnit Attachments Plugin not found, can't publish test attachments.Recording test results
[windows-jdk8] None of the test reports contained any result
[windows-jdk8] [withMaven] junitPublisher - Archive test results for Maven artifact org.apache.maven.plugin.rresource.it:resource-bundle-with-org-processing:1.6-SNAPSHOT generated by maven-surefire-plugin:test (default-test): m\target\test-classes\bootstrap\resource-bundle-with-org-processing\target\surefire-reports\*.xml
[windows-jdk8] [withMaven] junitPublisher - Jenkins JUnit Attachments Plugin not found, can't publish test attachments.Recording test results
[windows-jdk8] None of the test reports contained any result
[windows-jdk8] [withMaven] junitPublisher - Archive test results for Maven artifact org.apache.maven.plugin.rresource.it:resource-bundle-with-type-and-classifier:1.6-SNAPSHOT generated by maven-surefire-plugin:test (default-test): m\target\test-classes\bootstrap\resource-bundle-with-type-and-classifier\target\surefire-reports\*.xml
[windows-jdk8] [withMaven] junitPublisher - Jenkins JUnit Attachments Plugin not found, can't publish test attachments.Recording test results
[windows-jdk8] None of the test reports contained any result
[windows-jdk8] [withMaven] junitPublisher - Archive test results for Maven artifact org.apache.maven.plugin.rresource.it.gdp:release:1.0 generated by maven-surefire-plugin:test (default-test): m\target\test-classes\get-dependency-projects\release\target\surefire-reports\*.xml
[windows-jdk8] [withMaven] junitPublisher - Jenkins JUnit Attachments Plugin not found, can't publish test attachments.Recording test results
[windows-jdk8] None of the test reports contained any result
[windows-jdk8] [withMaven] junitPublisher - Archive test results for Maven artifact org.apache.maven.plugin.rresource.it.gdp:snapshot:1.0-SNAPSHOT generated by maven-surefire-plugin:test (default-test): m\target\test-classes\get-dependency-projects\snapshot\target\surefire-reports\*.xml
[windows-jdk8] [withMaven] junitPublisher - Jenkins JUnit Attachments Plugin not found, can't publish test attachments.Recording test results
[windows-jdk8] None of the test reports contained any result
[windows-jdk8] [withMaven] junitPublisher - Archive test results for Maven artifact org.apache.maven.plugin.rresource.it.mrr41:release:1.0 generated by maven-surefire-plugin:test (default-test): m\target\test-classes\run-only-at-execution-root\resource-projects\release\target\surefire-reports\*.xml
[windows-jdk8] [withMaven] junitPublisher - Jenkins JUnit Attachments Plugin not found, can't publish test attachments.Recording test results
[windows-jdk8] None of the test reports contained any result
[windows-jdk8] [withMaven] junitPublisher - Archive test results for Maven artifact org.apache.maven.plugin.rresource.it.mrr41:snapshot:1.0-SNAPSHOT generated by maven-surefire-plugin:test (default-test): m\target\test-classes\run-only-at-execution-root\resource-projects\snapshot\target\surefire-reports\*.xml
[windows-jdk8] [withMaven] junitPublisher - Jenkins JUnit Attachments Plugin not found, can't publish test attachments.Recording test results
[windows-jdk8] None of the test reports contained any result
[windows-jdk8] [withMaven] junitPublisher - Archive test results for Maven artifact org.apache.maven.plugin.rresource.it.mrr43:supplemental-models:1 generated by maven-surefire-plugin:test (default-test): m\target\test-classes\supplemental-artifact\resource-projects\supplemental-models\target\surefire-reports\*.xml
[windows-jdk8] [withMaven] junitPublisher - Jenkins JUnit Attachments Plugin not found, can't publish test attachments.Recording test results
[windows-jdk8] None of the test reports contained any result
[windows-jdk8] [withMaven] junitPublisher - Archive test results for Maven artifact org.apache.maven.plugin.rresource.it.mrr43:deficient-dep:1 generated by maven-surefire-plugin:test (default-test): m\target\test-classes\supplemental-artifact\resource-projects\deficient-dep\target\surefire-reports\*.xml
[windows-jdk8] [withMaven] junitPublisher - Jenkins JUnit Attachments Plugin not found, can't publish test attachments.Recording test results
[windows-jdk8] None of the test reports contained any result
[windows-jdk8] [withMaven] junitPublisher - Archive test results for Maven artifact org.apache.maven:maven-remote-resources-test:1.0-SNAPSHOT generated by maven-surefire-plugin:test (default-test): m\target\it\maven-remote-resources-test\target\surefire-reports\*.xml
[windows-jdk8] [withMaven] junitPublisher - Jenkins JUnit Attachments Plugin not found, can't publish test attachments.Recording test results
[windows-jdk8] None of the test reports contained any result
[Pipeline] [windows-jdk7] }
[windows-jdk7] [withMaven] junitPublisher - Archive test results for Maven artifact org.apache.maven.plugins:maven-remote-resources-plugin:1.6-SNAPSHOT generated by maven-surefire-plugin:test (default-test): m\target\surefire-reports\*.xml
[windows-jdk7] [withMaven] junitPublisher - Jenkins JUnit Attachments Plugin not found, can't publish test attachments.Recording test results
[windows-jdk7] [withMaven] junitPublisher - Archive test results for Maven artifact org.apache.maven.plugins:maven-remote-resources-plugin:1.6-SNAPSHOT generated by maven-failsafe-plugin:integration-test (integration-tests): m\target\failsafe-reports\*.xml
[windows-jdk7] [withMaven] junitPublisher - Jenkins JUnit Attachments Plugin not found, can't publish test attachments.Recording test results
[windows-jdk7] [withMaven] junitPublisher - Archive test results for Maven artifact org.apache.maven.plugin.rresource.it:resource-bundle-with-template:1.6-SNAPSHOT generated by maven-surefire-plugin:test (default-test): m\target\test-classes\bootstrap\resource-bundle-with-template\target\surefire-reports\*.xml
[windows-jdk7] [withMaven] junitPublisher - Jenkins JUnit Attachments Plugin not found, can't publish test attachments.Recording test results
[windows-jdk7] None of the test reports contained any result
[windows-jdk7] [withMaven] junitPublisher - Archive test results for Maven artifact org.apache.maven.plugin.rresource.it:resource-bundle-with-org-processing:1.6-SNAPSHOT generated by maven-surefire-plugin:test (default-test): m\target\test-classes\bootstrap\resource-bundle-with-org-processing\target\surefire-reports\*.xml
[windows-jdk7] [withMaven] junitPublisher - Jenkins JUnit Attachments Plugin not found, can't publish test attachments.Recording test results
[windows-jdk7] None of the test reports contained any result
[windows-jdk7] [withMaven] junitPublisher - Archive test results for Maven artifact org.apache.maven.plugin.rresource.it:resource-bundle-with-type-and-classifier:1.6-SNAPSHOT generated by maven-surefire-plugin:test (default-test): m\target\test-classes\bootstrap\resource-bundle-with-type-and-classifier\target\surefire-reports\*.xml
[windows-jdk7] [withMaven] junitPublisher - Jenkins JUnit Attachments Plugin not found, can't publish test attachments.Recording test results
[windows-jdk7] None of the test reports contained any result
[windows-jdk7] [withMaven] junitPublisher - Archive test results for Maven artifact org.apache.maven.plugin.rresource.it.gdp:release:1.0 generated by maven-surefire-plugin:test (default-test): m\target\test-classes\get-dependency-projects\release\target\surefire-reports\*.xml
[windows-jdk7] [withMaven] junitPublisher - Jenkins JUnit Attachments Plugin not found, can't publish test attachments.Recording test results
[windows-jdk7] None of the test reports contained any result
[windows-jdk7] [withMaven] junitPublisher - Archive test results for Maven artifact org.apache.maven.plugin.rresource.it.gdp:snapshot:1.0-SNAPSHOT generated by maven-surefire-plugin:test (default-test): m\target\test-classes\get-dependency-projects\snapshot\target\surefire-reports\*.xml
[windows-jdk7] [withMaven] junitPublisher - Jenkins JUnit Attachments Plugin not found, can't publish test attachments.Recording test results
[windows-jdk7] None of the test reports contained any result
[windows-jdk7] [withMaven] junitPublisher - Archive test results for Maven artifact org.apache.maven.plugin.rresource.it.mrr41:release:1.0 generated by maven-surefire-plugin:test (default-test): m\target\test-classes\run-only-at-execution-root\resource-projects\release\target\surefire-reports\*.xml
[windows-jdk7] [withMaven] junitPublisher - Jenkins JUnit Attachments Plugin not found, can't publish test attachments.Recording test results
[windows-jdk7] None of the test reports contained any result
[windows-jdk7] [withMaven] junitPublisher - Archive test results for Maven artifact org.apache.maven.plugin.rresource.it.mrr41:snapshot:1.0-SNAPSHOT generated by maven-surefire-plugin:test (default-test): m\target\test-classes\run-only-at-execution-root\resource-projects\snapshot\target\surefire-reports\*.xml
[windows-jdk7] [withMaven] junitPublisher - Jenkins JUnit Attachments Plugin not found, can't publish test attachments.Recording test results
[windows-jdk7] None of the test reports contained any result
[windows-jdk7] [withMaven] junitPublisher - Archive test results for Maven artifact org.apache.maven.plugin.rresource.it.mrr43:supplemental-models:1 generated by maven-surefire-plugin:test (default-test): m\target\test-classes\supplemental-artifact\resource-projects\supplemental-models\target\surefire-reports\*.xml
[windows-jdk7] [withMaven] junitPublisher - Jenkins JUnit Attachments Plugin not found, can't publish test attachments.Recording test results
[windows-jdk7] None of the test reports contained any result
[windows-jdk7] [withMaven] junitPublisher - Archive test results for Maven artifact org.apache.maven.plugin.rresource.it.mrr43:deficient-dep:1 generated by maven-surefire-plugin:test (default-test): m\target\test-classes\supplemental-artifact\resource-projects\deficient-dep\target\surefire-reports\*.xml
[windows-jdk7] [withMaven] junitPublisher - Jenkins JUnit Attachments Plugin not found, can't publish test attachments.Recording test results
[windows-jdk7] None of the test reports contained any result
[windows-jdk7] [withMaven] junitPublisher - Archive test results for Maven artifact org.apache.maven:maven-remote-resources-test:1.0-SNAPSHOT generated by maven-surefire-plugin:test (default-test): m\target\it\maven-remote-resources-test\target\surefire-reports\*.xml
[windows-jdk7] [withMaven] junitPublisher - Jenkins JUnit Attachments Plugin not found, can't publish test attachments.Recording test results
[windows-jdk7] None of the test reports contained any result
[Pipeline] [linux-jdk7] // node
[Pipeline] [linux-jdk8] // node
[Pipeline] [windows-jdk9] // withMaven
[Pipeline] [windows-jdk8] // withMaven
[Pipeline] [windows-jdk7] // withMaven
[Pipeline] [linux-jdk7] }
[Pipeline] [linux-jdk8] }
[Pipeline] [windows-jdk9] }
[Pipeline] [windows-jdk8] }
[Pipeline] [windows-jdk7] }
[Pipeline] [windows-jdk9] // stage
[Pipeline] [windows-jdk8] // stage
[Pipeline] [windows-jdk7] // stage
[Pipeline] [windows-jdk7] }
[Pipeline] [windows-jdk8] }
[Pipeline] [windows-jdk9] }
[Pipeline] [windows-jdk7] // node
[Pipeline] [windows-jdk8] // node
[Pipeline] [windows-jdk9] // node
[Pipeline] [windows-jdk7] }
[Pipeline] [windows-jdk8] }
[Pipeline] [windows-jdk9] }
[Pipeline] // parallel
[Pipeline] stage
[Pipeline] { (Notifications)
[Pipeline] echo
Build result: UNSTABLE
[Pipeline] jiraIssueSelector
[Pipeline] emailext
Mime
  • Unnamed multipart/mixed (inline, None, 0 bytes)
View raw message