maven-notifications mailing list archives

Site index · List index
Message view « Date » · « Thread »
Top « Date » · « Thread »
From Apache Jenkins Server <jenk...@builds.apache.org>
Subject Build failed in Jenkins: Maven TLP » maven-javadoc-plugin » MJAVADOC-521 #9
Date Sun, 01 Apr 2018 23:17:10 GMT
See https://builds.apache.org/job/maven-box/job/maven-javadoc-plugin/job/MJAVADOC-521/9/

No changes.

No tests ran.

Build log:
[...truncated 741.87 KB...]
[linux-jdk8] [INFO] --- maven-jar-plugin:3.0.2:jar (default-jar) @ maven-javadoc-plugin ---
[linux-jdk8] [INFO] Building jar: /home/jenkins/jenkins-slave/workspace/javadoc-plugin_MJAVADOC-521-4VCCRI6KPRH73A3RWPEXQVQHXBYIUVYDLQPEN3Z2IPPUYMQWLG3Q/m/target/maven-javadoc-plugin-3.0.1-SNAPSHOT.jar
[linux-jdk8] [INFO] 
[linux-jdk8] [INFO] --- maven-plugin-plugin:3.5:addPluginArtifactMetadata (default-addPluginArtifactMetadata)
@ maven-javadoc-plugin ---
[linux-jdk8] [INFO] 
[linux-jdk8] [INFO] --- maven-site-plugin:3.7:attach-descriptor (attach-descriptor) @ maven-javadoc-plugin
---
[linux-jdk8] Terminated
[linux-jdk9] Sending interrupt signal to process
[windows-jdk8] [INFO] Downloaded: https://repo.maven.apache.org/maven2/org/apache/maven/surefire/surefire-junit4/2.21.0/surefire-junit4-2.21.0.jar
(85 kB at 5.0 MB/s)
[windows-jdk8] [INFO] 
[windows-jdk8] [INFO] -------------------------------------------------------
[windows-jdk8] [INFO]  T E S T S
[windows-jdk8] [INFO] -------------------------------------------------------
[windows-jdk8] [INFO] Running org.apache.maven.plugins.javadoc.AbstractFixJavadocMojoTest
[windows-jdk8] [INFO] Tests run: 10, Failures: 0, Errors: 0, Skipped: 0, Time elapsed: 0.133
s - in org.apache.maven.plugins.javadoc.AbstractFixJavadocMojoTest
[windows-jdk8] [INFO] Running org.apache.maven.plugins.javadoc.AbstractJavadocMojoTest
[windows-jdk9] [INFO] Using 'UTF-8' encoding to copy filtered resources.
[windows-jdk9] [INFO] Copying 22 resources
[windows-jdk9] [INFO] Copying 3 resources
[windows-jdk9] [INFO] 
[windows-jdk9] [INFO] --- maven-compiler-plugin:3.7.0:compile (default-compile) @ maven-javadoc-plugin
---
[windows-jdk9] [INFO] Changes detected - recompiling the module!
[windows-jdk9] [INFO] Compiling 37 source files to f:\jenkins\jenkins-slave\workspace\javadoc-plugin_MJAVADOC-521-4VCCRI6KPRH73A3RWPEXQVQHXBYIUVYDLQPEN3Z2IPPUYMQWLG3Q\m\target\classes
[windows-jdk10] [INFO] Copying 3 resources
[windows-jdk10] [INFO] 
[windows-jdk10] [INFO] --- maven-compiler-plugin:3.7.0:compile (default-compile) @ maven-javadoc-plugin
---
[windows-jdk10] [INFO] Changes detected - recompiling the module!
[windows-jdk10] [INFO] Compiling 37 source files to f:\jenkins\jenkins-slave\workspace\javadoc-plugin_MJAVADOC-521-4VCCRI6KPRH73A3RWPEXQVQHXBYIUVYDLQPEN3Z2IPPUYMQWLG3Q@2\m\target\classes
[linux-jdk10] [INFO] 
[linux-jdk10] 1 warning
[linux-jdk10] [WARNING] Javadoc Warnings
[linux-jdk10] [WARNING] Picked up JAVA_TOOL_OPTIONS: -Dmaven.ext.class.path="/home/jenkins/jenkins-slave/workspace/javadoc-plugin_MJAVADOC-521-4VCCRI6KPRH73A3RWPEXQVQHXBYIUVYDLQPEN3Z2IPPUYMQWLG3Q@tmp/withMaven4801b1a7/pipeline-maven-spy.jar"
-Dorg.jenkinsci.plugins.pipeline.maven.reportsFolder="/home/jenkins/jenkins-slave/workspace/javadoc-plugin_MJAVADOC-521-4VCCRI6KPRH73A3RWPEXQVQHXBYIUVYDLQPEN3Z2IPPUYMQWLG3Q@tmp/withMaven4801b1a7"
[linux-jdk10] [WARNING] javadoc: warning - You have not specified the version of HTML to use.
[linux-jdk10] [WARNING] The default is currently HTML 4.01, but this will change to HTML5
[linux-jdk10] [WARNING] in a future release. To suppress this warning, please specify the
[linux-jdk10] [WARNING] version of HTML used in your documentation comments and to be
[linux-jdk10] [WARNING] generated by this doclet, using the -html4 or -html5 options.
[linux-jdk10] [ERROR] ProjectBuildingException for Mock for Artifact, hashCode: 1964864549:
Error resolving project artifact: Could not find artifact commons-logging:commons-logging:pom:1.1.1
for project null
[linux-jdk9] Terminated
[linux-jdk10] Sending interrupt signal to process
[windows-jdk8] Sending interrupt signal to process
[windows-jdk8] [INFO] Tests run: 1, Failures: 0, Errors: 0, Skipped: 0, Time elapsed: 1.071
s - in org.apache.maven.plugins.javadoc.AbstractJavadocMojoTest
[windows-jdk8] [INFO] Running org.apache.maven.plugins.javadoc.AggregatorJavadocReportTest
[windows-jdk8] [INFO] 
[windows-jdk8] [INFO] Results:
[windows-jdk8] [INFO] 
[windows-jdk8] [INFO] Tests run: 11, Failures: 0, Errors: 0, Skipped: 0
[windows-jdk8] [INFO] 
[windows-jdk9] Sending interrupt signal to process
[linux-jdk10] [WARNING] Source files encoding has not been set, using platform encoding ISO-8859-1,
i.e. build is platform dependent!
[linux-jdk10] [WARNING] Source files encoding has not been set, using platform encoding ISO-8859-1,
i.e. build is platform dependent!
[linux-jdk10] Terminated
[windows-jdk9] After 10s process did not stop
[windows-jdk10] Sending interrupt signal to process
[windows-jdk10] [INFO] /f:/jenkins/jenkins-slave/workspace/javadoc-plugin_MJAVADOC-521-4VCCRI6KPRH73A3RWPEXQVQHXBYIUVYDLQPEN3Z2IPPUYMQWLG3Q@2/m/src/main/java/org/apache/maven/plugins/javadoc/JavadocReport.java:
Some input files use or override a deprecated API.
[windows-jdk10] [INFO] /f:/jenkins/jenkins-slave/workspace/javadoc-plugin_MJAVADOC-521-4VCCRI6KPRH73A3RWPEXQVQHXBYIUVYDLQPEN3Z2IPPUYMQWLG3Q@2/m/src/main/java/org/apache/maven/plugins/javadoc/JavadocReport.java:
Recompile with -Xlint:deprecation for details.
[windows-jdk10] [INFO] /f:/jenkins/jenkins-slave/workspace/javadoc-plugin_MJAVADOC-521-4VCCRI6KPRH73A3RWPEXQVQHXBYIUVYDLQPEN3Z2IPPUYMQWLG3Q@2/m/src/main/java/org/apache/maven/plugins/javadoc/AbstractJavadocMojo.java:
Some input files use unchecked or unsafe operations.
[windows-jdk10] [INFO] /f:/jenkins/jenkins-slave/workspace/javadoc-plugin_MJAVADOC-521-4VCCRI6KPRH73A3RWPEXQVQHXBYIUVYDLQPEN3Z2IPPUYMQWLG3Q@2/m/src/main/java/org/apache/maven/plugins/javadoc/AbstractJavadocMojo.java:
Recompile with -Xlint:unchecked for details.
[windows-jdk10] [INFO] 
[windows-jdk10] [INFO] --- maven-plugin-plugin:3.5:descriptor (default-descriptor) @ maven-javadoc-plugin
---
[windows-jdk10] [INFO] Using 'UTF-8' encoding to read mojo source files.
[windows-jdk10] [INFO] java-javadoc mojo extractor found 0 mojo descriptor.
[windows-jdk10] [INFO] java-annotations mojo extractor found 15 mojo descriptors.
[windows-jdk10] [INFO] 
[windows-jdk10] [INFO] --- plexus-component-metadata:1.7.1:generate-metadata (default) @ maven-javadoc-plugin
---
[windows-jdk10] [INFO] Discovered 1 component descriptors(s)
[windows-jdk10] [INFO] 
[windows-jdk10] [INFO] --- maven-resources-plugin:3.0.2:testResources (default-testResources)
@ maven-javadoc-plugin ---
[windows-jdk10] [INFO] Using 'UTF-8' encoding to copy filtered resources.
[windows-jdk10] [INFO] Copying 192 resources
[windows-jdk10] [INFO] Copying 3 resources
[windows-jdk10] [INFO] 
[windows-jdk10] [INFO] --- maven-compiler-plugin:3.7.0:testCompile (default-testCompile) @
maven-javadoc-plugin ---
[windows-jdk10] [INFO] Changes detected - recompiling the module!
[windows-jdk10] [INFO] Compiling 50 source files to f:\jenkins\jenkins-slave\workspace\javadoc-plugin_MJAVADOC-521-4VCCRI6KPRH73A3RWPEXQVQHXBYIUVYDLQPEN3Z2IPPUYMQWLG3Q@2\m\target\test-classes
[windows-jdk10] [INFO] /f:/jenkins/jenkins-slave/workspace/javadoc-plugin_MJAVADOC-521-4VCCRI6KPRH73A3RWPEXQVQHXBYIUVYDLQPEN3Z2IPPUYMQWLG3Q@2/m/src/test/java/org/apache/maven/plugins/javadoc/stubs/StylesheetFileMavenProjectStub.java:
Some input files use or override a deprecated API.
[windows-jdk10] [INFO] /f:/jenkins/jenkins-slave/workspace/javadoc-plugin_MJAVADOC-521-4VCCRI6KPRH73A3RWPEXQVQHXBYIUVYDLQPEN3Z2IPPUYMQWLG3Q@2/m/src/test/java/org/apache/maven/plugins/javadoc/stubs/StylesheetFileMavenProjectStub.java:
Recompile with -Xlint:deprecation for details.
[windows-jdk10] [INFO] 
[windows-jdk10] [INFO] --- plexus-component-metadata:1.7.1:generate-test-metadata (default)
@ maven-javadoc-plugin ---
[windows-jdk10] [INFO] 
[windows-jdk10] [INFO] --- maven-surefire-plugin:2.21.0:test (default-test) @ maven-javadoc-plugin
---
[windows-jdk10] [INFO] 
[windows-jdk10] [INFO] -------------------------------------------------------
[windows-jdk10] [INFO]  T E S T S
[windows-jdk10] [INFO] -------------------------------------------------------
[windows-jdk10] [INFO] Running org.apache.maven.plugins.javadoc.AbstractFixJavadocMojoTest
[windows-jdk10] [INFO] Tests run: 10, Failures: 0, Errors: 0, Skipped: 0, Time elapsed: 0.136
s - in org.apache.maven.plugins.javadoc.AbstractFixJavadocMojoTest
[windows-jdk10] [INFO] Running org.apache.maven.plugins.javadoc.AbstractJavadocMojoTest
[windows-jdk10] [INFO] Tests run: 1, Failures: 0, Errors: 0, Skipped: 0, Time elapsed: 0.853
s - in org.apache.maven.plugins.javadoc.AbstractJavadocMojoTest
[windows-jdk10] [INFO] Running org.apache.maven.plugins.javadoc.AggregatorJavadocReportTest
[windows-jdk10] [INFO] 
[windows-jdk10] [INFO] Results:
[windows-jdk10] [INFO] 
[windows-jdk10] [INFO] Tests run: 11, Failures: 0, Errors: 0, Skipped: 0
[windows-jdk10] [INFO] 
[windows-jdk10] [ERROR] There are test failures.
[windows-jdk10] 
[windows-jdk10] Please refer to f:\jenkins\jenkins-slave\workspace\javadoc-plugin_MJAVADOC-521-4VCCRI6KPRH73A3RWPEXQVQHXBYIUVYDLQPEN3Z2IPPUYMQWLG3Q@2\m\target\surefire-reports
for the individual test results.
[windows-jdk10] Please refer to dump files (if any exist) [date]-jvmRun[N].dump, [date].dumpstream
and [date]-jvmRun[N].dumpstream.
[windows-jdk10] The forked VM terminated without properly saying goodbye. VM crash or System.exit
called?
[windows-jdk10] Command was cmd.exe /X /C "F:\jenkins\tools\java\jdk10_46\bin\java -jar C:\Users\jenkins\AppData\Local\Temp\1\surefire15191420120598335478\surefirebooter17881224999207662797.jar
C:\Users\jenkins\AppData\Local\Temp\1\surefire15191420120598335478 2018-04-01T23-16-57_332-jvmRun1
surefire756043767162507440tmp surefire_018265846115306511907tmp"
[windows-jdk10] Error occurred in starting fork, check output in log
[windows-jdk10] Process Exit Code: -1
[windows-jdk10] Crashed tests:
[windows-jdk10] org.apache.maven.plugins.javadoc.AggregatorJavadocReportTest
[windows-jdk10] org.apache.maven.surefire.booter.SurefireBooterForkException: The forked VM
terminated without properly saying goodbye. VM crash or System.exit called?
[windows-jdk10] Command was cmd.exe /X /C "F:\jenkins\tools\java\jdk10_46\bin\java -jar C:\Users\jenkins\AppData\Local\Temp\1\surefire15191420120598335478\surefirebooter17881224999207662797.jar
C:\Users\jenkins\AppData\Local\Temp\1\surefire15191420120598335478 2018-04-01T23-16-57_332-jvmRun1
surefire756043767162507440tmp surefire_018265846115306511907tmp"
[windows-jdk10] Error occurred in starting fork, check output in log
[windows-jdk10] Process Exit Code: -1
[windows-jdk10] Crashed tests:
[windows-jdk10] org.apache.maven.plugins.javadoc.AggregatorJavadocReportTest
[windows-jdk10] 	at org.apache.maven.plugin.surefire.booterclient.ForkStarter.fork(ForkStarter.java:671)
[windows-jdk10] 	at org.apache.maven.plugin.surefire.booterclient.ForkStarter.fork(ForkStarter.java:533)
[windows-jdk10] 	at org.apache.maven.plugin.surefire.booterclient.ForkStarter.run(ForkStarter.java:278)
[windows-jdk10] 	at org.apache.maven.plugin.surefire.booterclient.ForkStarter.run(ForkStarter.java:244)
[windows-jdk10] 	at org.apache.maven.plugin.surefire.AbstractSurefireMojo.executeProvider(AbstractSurefireMojo.java:1149)
[windows-jdk10] 	at org.apache.maven.plugin.surefire.AbstractSurefireMojo.executeAfterPreconditionsChecked(AbstractSurefireMojo.java:978)
[windows-jdk10] 	at org.apache.maven.plugin.surefire.AbstractSurefireMojo.execute(AbstractSurefireMojo.java:854)
[windows-jdk10] 	at org.apache.maven.plugin.DefaultBuildPluginManager.executeMojo(DefaultBuildPluginManager.java:134)
[windows-jdk10] 	at org.apache.maven.lifecycle.internal.MojoExecutor.execute(MojoExecutor.java:208)
[windows-jdk10] 	at org.apache.maven.lifecycle.internal.MojoExecutor.execute(MojoExecutor.java:154)
[windows-jdk10] 	at org.apache.maven.lifecycle.internal.MojoExecutor.execute(MojoExecutor.java:146)
[windows-jdk10] 	at org.apache.maven.lifecycle.internal.LifecycleModuleBuilder.buildProject(LifecycleModuleBuilder.java:117)
[windows-jdk10] 	at org.apache.maven.lifecycle.internal.LifecycleModuleBuilder.buildProject(LifecycleModuleBuilder.java:81)
[windows-jdk10] 	at org.apache.maven.lifecycle.internal.builder.singlethreaded.SingleThreadedBuilder.build(SingleThreadedBuilder.java:51)
[windows-jdk10] 	at org.apache.maven.lifecycle.internal.LifecycleStarter.execute(LifecycleStarter.java:128)
[windows-jdk10] 	at org.apache.maven.DefaultMaven.doExecute(DefaultMaven.java:309)
[windows-jdk10] 	at org.apache.maven.DefaultMaven.doExecute(DefaultMaven.java:194)
[windows-jdk10] 	at org.apache.maven.DefaultMaven.execute(DefaultMaven.java:107)
[windows-jdk10] 	at org.apache.maven.cli.MavenCli.execute(MavenCli.java:993)
[windows-jdk10] 	at org.apache.maven.cli.MavenCli.doMain(MavenCli.java:345)
[windows-jdk10] 	at org.apache.maven.cli.MavenCli.main(MavenCli.java:191)
[windows-jdk10] 	at java.base/jdk.internal.reflect.NativeMethodAccessorImpl.invoke0(Native
Method)
[windows-jdk10] 	at java.base/jdk.internal.reflect.NativeMethodAccessorImpl.invoke(NativeMethodAccessorImpl.java:62)
[windows-jdk10] 	at java.base/jdk.internal.reflect.DelegatingMethodAccessorImpl.invoke(DelegatingMethodAccessorImpl.java:43)
[windows-jdk10] 	at java.base/java.lang.reflect.Method.invoke(Method.java:564)
[windows-jdk10] 	at org.codehaus.plexus.classworlds.launcher.Launcher.launchEnhanced(Launcher.java:289)
[windows-jdk10] 	at org.codehaus.plexus.classworlds.launcher.Launcher.launch(Launcher.java:229)
[windows-jdk10] 	at org.codehaus.plexus.classworlds.launcher.Launcher.mainWithExitCode(Launcher.java:415)
[windows-jdk10] 	at org.codehaus.plexus.classworlds.launcher.Launcher.main(Launcher.java:356)
[windows-jdk10] 
[windows-jdk10] [INFO] 
[windows-jdk10] [INFO] --- maven-jar-plugin:3.0.2:jar (default-jar) @ maven-javadoc-plugin
---
[windows-jdk10] [INFO] Building jar: f:\jenkins\jenkins-slave\workspace\javadoc-plugin_MJAVADOC-521-4VCCRI6KPRH73A3RWPEXQVQHXBYIUVYDLQPEN3Z2IPPUYMQWLG3Q@2\m\target\maven-javadoc-plugin-3.0.1-SNAPSHOT.jar
[windows-jdk10] [INFO] 
[windows-jdk10] [INFO] --- maven-plugin-plugin:3.5:addPluginArtifactMetadata (default-addPluginArtifactMetadata)
@ maven-javadoc-plugin ---
[windows-jdk10] [INFO] 
[windows-jdk10] [INFO] --- maven-site-plugin:3.7:attach-descriptor (attach-descriptor) @ maven-javadoc-plugin
---
[windows-jdk10] [INFO] Skipping because packaging 'maven-plugin' is not pom.
[windows-jdk10] [INFO] 
[windows-jdk10] [INFO] --- maven-invoker-plugin:3.0.1:install (integration-test) @ maven-javadoc-plugin
---
[Pipeline] [linux-jdk10] }
[Pipeline] [linux-jdk7] }
[Pipeline] [linux-jdk8] }
[Pipeline] [linux-jdk9] }
[Pipeline] [windows-jdk8] }
[Pipeline] [windows-jdk9] }
[Pipeline] [linux-jdk10] // dir
[Pipeline] [linux-jdk7] // dir
[Pipeline] [linux-jdk8] // dir
[Pipeline] [linux-jdk9] // dir
[Pipeline] [windows-jdk8] // dir
[Pipeline] [windows-jdk9] // dir
[Pipeline] [linux-jdk10] }
[linux-jdk10] [withMaven] One or multiple Maven executions have been ignored by the Jenkins
Pipeline Maven Plugin because they have been interrupted before completion (1). See Pipeline
Maven Plugin FAQ for more details.
[Pipeline] [linux-jdk7] }
[linux-jdk7] [withMaven] One or multiple Maven executions have been ignored by the Jenkins
Pipeline Maven Plugin because they have been interrupted before completion (1). See Pipeline
Maven Plugin FAQ for more details.
[Pipeline] [linux-jdk8] }
[linux-jdk8] [withMaven] One or multiple Maven executions have been ignored by the Jenkins
Pipeline Maven Plugin because they have been interrupted before completion (1). See Pipeline
Maven Plugin FAQ for more details.
[Pipeline] [linux-jdk9] }
[linux-jdk9] [withMaven] One or multiple Maven executions have been ignored by the Jenkins
Pipeline Maven Plugin because they have been interrupted before completion (1). See Pipeline
Maven Plugin FAQ for more details.
[Pipeline] [windows-jdk8] }
[windows-jdk8] [withMaven] One or multiple Maven executions have been ignored by the Jenkins
Pipeline Maven Plugin because they have been interrupted before completion (1). See Pipeline
Maven Plugin FAQ for more details.
[Pipeline] [windows-jdk9] }
[windows-jdk9] [withMaven] One or multiple Maven executions have been ignored by the Jenkins
Pipeline Maven Plugin because they have been interrupted before completion (1). See Pipeline
Maven Plugin FAQ for more details.
[Pipeline] [linux-jdk10] // withMaven
[Pipeline] [linux-jdk7] // withMaven
[Pipeline] [linux-jdk8] // withMaven
[Pipeline] [linux-jdk9] // withMaven
[Pipeline] [windows-jdk8] // withMaven
[Pipeline] [windows-jdk9] // withMaven
[Pipeline] [linux-jdk10] echo
[linux-jdk10] [FAIL FAST] windows-jdk7 had first failure, ignoring script returned exit code
143
[Pipeline] [linux-jdk10] }
[Pipeline] [linux-jdk7] echo
[linux-jdk7] [FAIL FAST] windows-jdk7 had first failure, ignoring script returned exit code
143
[Pipeline] [linux-jdk7] }
[Pipeline] [linux-jdk8] echo
[linux-jdk8] [FAIL FAST] windows-jdk7 had first failure, ignoring script returned exit code
143
[Pipeline] [linux-jdk8] }
[Pipeline] [linux-jdk9] echo
[linux-jdk9] [FAIL FAST] windows-jdk7 had first failure, ignoring script returned exit code
143
[Pipeline] [linux-jdk9] }
[Pipeline] [windows-jdk8] echo
[windows-jdk8] [FAIL FAST] windows-jdk7 had first failure, ignoring script returned exit code
-1
[Pipeline] [windows-jdk8] }
[Pipeline] [windows-jdk9] echo
[windows-jdk9] [FAIL FAST] windows-jdk7 had first failure, ignoring null
[Pipeline] [windows-jdk9] }
[Pipeline] [linux-jdk10] // stage
[Pipeline] [linux-jdk7] // stage
[Pipeline] [linux-jdk8] // stage
[Pipeline] [linux-jdk9] // stage
[Pipeline] [windows-jdk8] // stage
[Pipeline] [windows-jdk9] // stage
[Pipeline] [linux-jdk7] }
[Pipeline] [linux-jdk8] }
[Pipeline] [linux-jdk9] }
[Pipeline] [linux-jdk10] }
[Pipeline] [windows-jdk8] }
[Pipeline] [windows-jdk9] }
[Pipeline] [linux-jdk7] // node
[Pipeline] [linux-jdk8] // node
[Pipeline] [linux-jdk9] // node
[Pipeline] [linux-jdk10] // node
[Pipeline] [windows-jdk8] // node
[Pipeline] [windows-jdk9] // node
[Pipeline] [linux-jdk7] }
[Pipeline] [linux-jdk8] }
[Pipeline] [linux-jdk9] }
[Pipeline] [linux-jdk10] }
[Pipeline] [windows-jdk8] }
[Pipeline] [windows-jdk9] }
[windows-jdk10] After 10s process did not stop
[Pipeline] [windows-jdk10] }
[Pipeline] [windows-jdk10] // dir
[Pipeline] [windows-jdk10] }
[windows-jdk10] [withMaven] One or multiple Maven executions have been ignored by the Jenkins
Pipeline Maven Plugin because they have been interrupted before completion (1). See Pipeline
Maven Plugin FAQ for more details.
[Pipeline] [windows-jdk10] // withMaven
[Pipeline] [windows-jdk10] echo
[windows-jdk10] [FAIL FAST] windows-jdk7 had first failure, ignoring null
[Pipeline] [windows-jdk10] }
[Pipeline] [windows-jdk10] // stage
[Pipeline] [windows-jdk10] }
[Pipeline] [windows-jdk10] // node
[Pipeline] [windows-jdk10] }
[Pipeline] // parallel
[Pipeline] echo
***** FAST FAILURE *****

Fast failure triggered by windows-jdk7

***** FAST FAILURE *****
[Pipeline] stage
[Pipeline] { (Notifications)
[Pipeline] echo
Build result: FAILURE
[Pipeline] jiraIssueSelector
[Pipeline] emailext
Mime
  • Unnamed multipart/mixed (inline, None, 0 bytes)
View raw message