maven-notifications mailing list archives

Site index · List index
Message view « Date » · « Thread »
Top « Date » · « Thread »
From Apache Jenkins Server <jenk...@builds.apache.org>
Subject Build failed in Jenkins: Maven TLP » maven-wagon » master #6
Date Thu, 05 Apr 2018 20:09:27 GMT
See https://builds.apache.org/job/maven-box/job/maven-wagon/job/master/6/

Changes:

* [WAGON-482] Use sparse files in HugeFileDownloadTest with Java 7
* [WAGON-482] Use sparse files in HugeFileDownloadTest with Java 7
* [WAGON-482] Use sparse files in HugeFileDownloadTest with Java 7
* [WAGON-482] Use sparse files in HugeFileDownloadTest with Java 7
* [WAGON-482] Use sparse files in HugeFileDownloadTest with Java 7
* [WAGON-482] Use sparse files in HugeFileDownloadTest with Java 7
* [WAGON-482] Use sparse files in HugeFileDownloadTest with Java 7

No tests ran.

Build log:
[...truncated 883.87 KB...]
[windows-jdk9] [INFO] Downloading: https://repo.maven.apache.org/maven2/commons-io/commons-io/2.5/commons-io-2.5.pom
[windows-jdk9] [INFO] Downloaded: https://repo.maven.apache.org/maven2/commons-io/commons-io/2.5/commons-io-2.5.pom
(13 kB at 2.7 MB/s)
[windows-jdk9] [INFO] Downloading: https://repo.maven.apache.org/maven2/org/apache/commons/commons-parent/39/commons-parent-39.pom
[windows-jdk9] [INFO] Downloaded: https://repo.maven.apache.org/maven2/org/apache/commons/commons-parent/39/commons-parent-39.pom
(62 kB at 5.6 MB/s)
[windows-jdk9] [INFO] Downloading: https://repo.maven.apache.org/maven2/commons-net/commons-net/3.5/commons-net-3.5.jar
[windows-jdk9] [INFO] Downloading: https://repo.maven.apache.org/maven2/org/apache/ftpserver/ftpserver-core/1.0.6/ftpserver-core-1.0.6.jar
[windows-jdk9] [INFO] Downloading: https://repo.maven.apache.org/maven2/org/apache/ftpserver/ftplet-api/1.0.6/ftplet-api-1.0.6.jar
[windows-jdk9] [INFO] Downloading: https://repo.maven.apache.org/maven2/org/apache/mina/mina-core/2.0.4/mina-core-2.0.4.jar
[windows-jdk9] [INFO] Downloading: https://repo.maven.apache.org/maven2/commons-io/commons-io/2.5/commons-io-2.5.jar
[windows-jdk9] [INFO] Downloaded: https://repo.maven.apache.org/maven2/org/apache/ftpserver/ftplet-api/1.0.6/ftplet-api-1.0.6.jar
(21 kB at 1.0 MB/s)
[windows-jdk9] [INFO] Downloaded: https://repo.maven.apache.org/maven2/commons-io/commons-io/2.5/commons-io-2.5.jar
(209 kB at 7.5 MB/s)
[windows-jdk9] [INFO] Downloaded: https://repo.maven.apache.org/maven2/commons-net/commons-net/3.5/commons-net-3.5.jar
(304 kB at 9.5 MB/s)
[windows-jdk9] [INFO] Downloaded: https://repo.maven.apache.org/maven2/org/apache/ftpserver/ftpserver-core/1.0.6/ftpserver-core-1.0.6.jar
(296 kB at 8.7 MB/s)
[windows-jdk9] [INFO] Downloaded: https://repo.maven.apache.org/maven2/org/apache/mina/mina-core/2.0.4/mina-core-2.0.4.jar
(645 kB at 16 MB/s)
[windows-jdk9] [INFO] 
[windows-jdk9] [INFO] --- maven-clean-plugin:2.5:clean (default-clean) @ wagon-ftp ---
[windows-jdk9] [INFO] 
[windows-jdk9] [INFO] --- maven-enforcer-plugin:1.3.1:enforce (enforce-bytecode-version) @
wagon-ftp ---
[windows-jdk7] [INFO] 
[windows-jdk7] [INFO] --- maven-resources-plugin:2.7:testResources (default-testResources)
@ wagon-provider-test ---
[windows-jdk7] [INFO] Using 'UTF-8' encoding to copy filtered resources.
[windows-jdk7] [INFO] skip non existing resourceDirectory F:\jenkins\jenkins-slave\workspace\aven-box_maven-wagon_master-XZVDTOWPBGAU5B2ZTHNA6F4MQMMNHGQARGBUDFHBYYQHQ7B4WPHA\m\wagon-provider-test\src\test\resources
[windows-jdk7] [INFO] Copying 3 resources
[windows-jdk7] [INFO] 
[windows-jdk7] [INFO] --- maven-compiler-plugin:3.2:testCompile (default-testCompile) @ wagon-provider-test
---
[windows-jdk7] [INFO] No sources to compile
[windows-jdk7] [INFO] 
[windows-jdk7] [INFO] --- maven-surefire-plugin:2.20:test (default-test) @ wagon-provider-test
---
[windows-jdk7] [INFO] 
[windows-jdk7] [INFO] --- maven-jar-plugin:2.5:jar (default-jar) @ wagon-provider-test ---
[windows-jdk7] [INFO] Building jar: F:\jenkins\jenkins-slave\workspace\aven-box_maven-wagon_master-XZVDTOWPBGAU5B2ZTHNA6F4MQMMNHGQARGBUDFHBYYQHQ7B4WPHA\m\wagon-provider-test\target\wagon-provider-test-3.0.1-SNAPSHOT.jar
[windows-jdk7] [INFO] 
[windows-jdk7] [INFO] --- maven-site-plugin:3.4:attach-descriptor (attach-descriptor) @ wagon-provider-test
---
[windows-jdk7] [INFO] 
[windows-jdk7] [INFO] --- maven-checkstyle-plugin:2.15:check (checkstyle-check) @ wagon-provider-test
---
[windows-jdk7] Sending interrupt signal to process
[windows-jdk7] [INFO] There is 1 error reported by Checkstyle 6.1.1 with config/maven_checks.xml
ruleset.
[windows-jdk7] [INFO] Ignored 1 error, 0 violation remaining.
[windows-jdk7] [INFO] 
[windows-jdk7] [INFO] ------------------------------------------------------------------------
[windows-jdk7] [INFO] Building Apache Maven Wagon :: Providers 3.0.1-SNAPSHOT
[windows-jdk7] [INFO] ------------------------------------------------------------------------
[windows-jdk7] [INFO] 
[windows-jdk7] [INFO] --- maven-clean-plugin:2.5:clean (default-clean) @ wagon-providers ---
[windows-jdk7] [INFO] 
[windows-jdk7] [INFO] --- maven-enforcer-plugin:1.3.1:enforce (enforce-bytecode-version) @
wagon-providers ---
[linux-jdk10] Sending interrupt signal to process
[windows-jdk8] [INFO] 
[windows-jdk8] [INFO] ------------------------------------------------------------------------
[windows-jdk8] [INFO] Building Apache Maven Wagon :: Providers :: File Provider 3.0.1-SNAPSHOT
[windows-jdk8] [INFO] ------------------------------------------------------------------------
[windows-jdk8] [INFO] Downloading: https://repo.maven.apache.org/maven2/org/slf4j/slf4j-simple/1.7.22/slf4j-simple-1.7.22.pom
[windows-jdk8] [INFO] Downloaded: https://repo.maven.apache.org/maven2/org/slf4j/slf4j-simple/1.7.22/slf4j-simple-1.7.22.pom
(1.0 kB at 56 kB/s)
[windows-jdk8] [INFO] Downloading: https://repo.maven.apache.org/maven2/org/slf4j/slf4j-simple/1.7.22/slf4j-simple-1.7.22.jar
[windows-jdk8] [INFO] Downloaded: https://repo.maven.apache.org/maven2/org/slf4j/slf4j-simple/1.7.22/slf4j-simple-1.7.22.jar
(11 kB at 1.2 MB/s)
[windows-jdk8] [INFO] 
[windows-jdk8] [INFO] --- maven-clean-plugin:2.5:clean (default-clean) @ wagon-file ---
[windows-jdk8] [INFO] 
[windows-jdk8] [INFO] --- maven-enforcer-plugin:1.3.1:enforce (enforce-bytecode-version) @
wagon-file ---
[windows-jdk8] [INFO] 
[windows-jdk8] [INFO] --- maven-enforcer-plugin:1.3.1:enforce (ban-known-bad-maven-versions)
@ wagon-file ---
[windows-jdk8] [INFO] 
[windows-jdk8] [INFO] --- maven-enforcer-plugin:1.3.1:enforce (default) @ wagon-file ---
[windows-jdk8] [INFO] 
[windows-jdk8] [INFO] --- apache-rat-plugin:0.11:check (rat-check) @ wagon-file ---
[windows-jdk8] [INFO] 51 implicit excludes (use -debug for more details).
[windows-jdk8] [INFO] Exclude: .checkstyle
[windows-jdk8] [INFO] Exclude: **/*.odg
[windows-jdk8] [INFO] Exclude: src/test/resources/**
[windows-jdk8] [INFO] Exclude: src/main/resources/default-server-root/**
[windows-jdk8] [INFO] Exclude: src/main/resources/ssh-keys/**
[windows-jdk8] [INFO] Exclude: src/test/ssh-keys/**
[windows-jdk8] [INFO] Exclude: .repository/**
[windows-jdk8] [INFO] Exclude: out/**
[windows-jdk8] [INFO] Exclude: DEPENDENCIES
[windows-jdk8] [INFO] 5 resources included (use -debug for more details)
[windows-jdk8] [INFO] Rat check: Summary of files. Unapproved: 0 unknown: 0 generated: 0 approved:
5 licence.
[windows-jdk8] [INFO] 
[windows-jdk8] [INFO] --- maven-remote-resources-plugin:1.5:process (default) @ wagon-file
---
[windows-jdk8] [INFO] 
[windows-jdk8] [INFO] --- maven-resources-plugin:2.7:resources (default-resources) @ wagon-file
---
[windows-jdk8] [INFO] Using 'UTF-8' encoding to copy filtered resources.
[windows-jdk8] [INFO] skip non existing resourceDirectory F:\jenkins\jenkins-slave\workspace\aven-box_maven-wagon_master-XZVDTOWPBGAU5B2ZTHNA6F4MQMMNHGQARGBUDFHBYYQHQ7B4WPHA@2\m\wagon-providers\wagon-file\src\main\resources
[windows-jdk8] [INFO] Copying 3 resources
[windows-jdk8] [INFO] 
[windows-jdk8] [INFO] --- maven-compiler-plugin:3.2:compile (default-compile) @ wagon-file
---
[windows-jdk8] [INFO] Changes detected - recompiling the module!
[windows-jdk8] [INFO] Compiling 1 source file to F:\jenkins\jenkins-slave\workspace\aven-box_maven-wagon_master-XZVDTOWPBGAU5B2ZTHNA6F4MQMMNHGQARGBUDFHBYYQHQ7B4WPHA@2\m\wagon-providers\wagon-file\target\classes
[windows-jdk8] [INFO] 
[windows-jdk8] [INFO] --- plexus-component-metadata:1.5.5:generate-metadata (generate) @ wagon-file
---
[windows-jdk8] [INFO] Discovered 1 component descriptors(s)
[windows-jdk8] [INFO] 
[windows-jdk8] [INFO] --- animal-sniffer-maven-plugin:1.15:check (check-java-1.7-compat) @
wagon-file ---
[windows-jdk8] [INFO] Checking unresolved references to org.codehaus.mojo.signature:java17:1.0
[windows-jdk8] [INFO] 
[windows-jdk8] [INFO] --- maven-resources-plugin:2.7:testResources (default-testResources)
@ wagon-file ---
[windows-jdk8] [INFO] Using 'UTF-8' encoding to copy filtered resources.
[windows-jdk8] [INFO] skip non existing resourceDirectory F:\jenkins\jenkins-slave\workspace\aven-box_maven-wagon_master-XZVDTOWPBGAU5B2ZTHNA6F4MQMMNHGQARGBUDFHBYYQHQ7B4WPHA@2\m\wagon-providers\wagon-file\src\test\resources
[windows-jdk8] [INFO] Copying 3 resources
[windows-jdk8] [INFO] 
[windows-jdk8] [INFO] --- maven-compiler-plugin:3.2:testCompile (default-testCompile) @ wagon-file
---
[windows-jdk8] [INFO] Changes detected - recompiling the module!
[windows-jdk8] [INFO] Compiling 1 source file to F:\jenkins\jenkins-slave\workspace\aven-box_maven-wagon_master-XZVDTOWPBGAU5B2ZTHNA6F4MQMMNHGQARGBUDFHBYYQHQ7B4WPHA@2\m\wagon-providers\wagon-file\target\test-classes
[windows-jdk8] [INFO] /F:/jenkins/jenkins-slave/workspace/aven-box_maven-wagon_master-XZVDTOWPBGAU5B2ZTHNA6F4MQMMNHGQARGBUDFHBYYQHQ7B4WPHA@2/m/wagon-providers/wagon-file/src/test/java/org/apache/maven/wagon/providers/file/FileWagonTest.java:
F:\jenkins\jenkins-slave\workspace\aven-box_maven-wagon_master-XZVDTOWPBGAU5B2ZTHNA6F4MQMMNHGQARGBUDFHBYYQHQ7B4WPHA@2\m\wagon-providers\wagon-file\src\test\java\org\apache\maven\wagon\providers\file\FileWagonTest.java
uses or overrides a deprecated API.
[windows-jdk8] [INFO] /F:/jenkins/jenkins-slave/workspace/aven-box_maven-wagon_master-XZVDTOWPBGAU5B2ZTHNA6F4MQMMNHGQARGBUDFHBYYQHQ7B4WPHA@2/m/wagon-providers/wagon-file/src/test/java/org/apache/maven/wagon/providers/file/FileWagonTest.java:
Recompile with -Xlint:deprecation for details.
[windows-jdk8] [INFO] 
[windows-jdk8] [INFO] --- maven-surefire-plugin:2.20:test (default-test) @ wagon-file ---
[windows-jdk8] [INFO] 
[windows-jdk8] [INFO] -------------------------------------------------------
[windows-jdk8] [INFO]  T E S T S
[windows-jdk8] [INFO] -------------------------------------------------------
[windows-jdk8] [INFO] Running org.apache.maven.wagon.providers.file.FileWagonTest
[windows-jdk9] [INFO] 
[windows-jdk9] [INFO] --- maven-enforcer-plugin:1.3.1:enforce (ban-known-bad-maven-versions)
@ wagon-ftp ---
[windows-jdk9] [INFO] 
[windows-jdk9] [INFO] --- maven-enforcer-plugin:1.3.1:enforce (default) @ wagon-ftp ---
[windows-jdk9] [INFO] 
[windows-jdk9] [INFO] --- apache-rat-plugin:0.11:check (rat-check) @ wagon-ftp ---
[windows-jdk9] [INFO] 51 implicit excludes (use -debug for more details).
[windows-jdk9] [INFO] Exclude: .checkstyle
[windows-jdk9] [INFO] Exclude: **/*.odg
[windows-jdk9] [INFO] Exclude: src/test/resources/**
[windows-jdk9] [INFO] Exclude: src/main/resources/default-server-root/**
[windows-jdk9] [INFO] Exclude: src/main/resources/ssh-keys/**
[windows-jdk9] [INFO] Exclude: src/test/ssh-keys/**
[windows-jdk9] [INFO] Exclude: .repository/**
[windows-jdk9] [INFO] Exclude: out/**
[windows-jdk9] [INFO] Exclude: DEPENDENCIES
[windows-jdk9] [INFO] 7 resources included (use -debug for more details)
[windows-jdk9] [INFO] Rat check: Summary of files. Unapproved: 0 unknown: 0 generated: 0 approved:
7 licence.
[windows-jdk9] [INFO] 
[windows-jdk9] [INFO] --- maven-remote-resources-plugin:1.5:process (default) @ wagon-ftp
---
[windows-jdk9] [INFO] 
[windows-jdk9] [INFO] --- maven-resources-plugin:2.7:resources (default-resources) @ wagon-ftp
---
[windows-jdk9] Sending interrupt signal to process
[windows-jdk9] [INFO] Using 'UTF-8' encoding to copy filtered resources.
[windows-jdk9] [INFO] skip non existing resourceDirectory F:\jenkins\jenkins-slave\workspace\aven-box_maven-wagon_master-XZVDTOWPBGAU5B2ZTHNA6F4MQMMNHGQARGBUDFHBYYQHQ7B4WPHA\m\wagon-providers\wagon-ftp\src\main\resources
[windows-jdk9] [INFO] Copying 3 resources
[windows-jdk9] [INFO] 
[windows-jdk9] [INFO] --- maven-compiler-plugin:3.2:compile (default-compile) @ wagon-ftp
---
[windows-jdk9] [INFO] Changes detected - recompiling the module!
[windows-jdk9] [INFO] Compiling 3 source files to F:\jenkins\jenkins-slave\workspace\aven-box_maven-wagon_master-XZVDTOWPBGAU5B2ZTHNA6F4MQMMNHGQARGBUDFHBYYQHQ7B4WPHA\m\wagon-providers\wagon-ftp\target\classes
[windows-jdk9] [INFO] /F:/jenkins/jenkins-slave/workspace/aven-box_maven-wagon_master-XZVDTOWPBGAU5B2ZTHNA6F4MQMMNHGQARGBUDFHBYYQHQ7B4WPHA/m/wagon-providers/wagon-ftp/src/main/java/org/apache/maven/wagon/providers/ftp/FtpWagon.java:
F:\jenkins\jenkins-slave\workspace\aven-box_maven-wagon_master-XZVDTOWPBGAU5B2ZTHNA6F4MQMMNHGQARGBUDFHBYYQHQ7B4WPHA\m\wagon-providers\wagon-ftp\src\main\java\org\apache\maven\wagon\providers\ftp\FtpWagon.java
uses or overrides a deprecated API.
[windows-jdk9] [INFO] /F:/jenkins/jenkins-slave/workspace/aven-box_maven-wagon_master-XZVDTOWPBGAU5B2ZTHNA6F4MQMMNHGQARGBUDFHBYYQHQ7B4WPHA/m/wagon-providers/wagon-ftp/src/main/java/org/apache/maven/wagon/providers/ftp/FtpWagon.java:
Recompile with -Xlint:deprecation for details.
[windows-jdk9] [INFO] 
[windows-jdk9] [INFO] --- plexus-component-metadata:1.5.5:generate-metadata (generate) @ wagon-ftp
---
[windows-jdk9] [INFO] Discovered 3 component descriptors(s)
[windows-jdk9] [INFO] 
[windows-jdk9] [INFO] --- animal-sniffer-maven-plugin:1.15:check (check-java-1.7-compat) @
wagon-ftp ---
[windows-jdk9] [INFO] Checking unresolved references to org.codehaus.mojo.signature:java17:1.0
[windows-jdk8] Sending interrupt signal to process
[Pipeline] [windows-jdk8] }
[Pipeline] [linux-jdk9] }
[Pipeline] [linux-jdk7] }
[Pipeline] [linux-jdk8] }
[Pipeline] [linux-jdk10] }
[Pipeline] [windows-jdk8] // dir
[Pipeline] [linux-jdk9] // dir
[Pipeline] [linux-jdk7] // dir
[Pipeline] [linux-jdk8] // dir
[Pipeline] [linux-jdk10] // dir
[Pipeline] [windows-jdk8] }
[windows-jdk8] [withMaven] One or multiple Maven executions have been ignored by the Jenkins
Pipeline Maven Plugin because they have been interrupted before completion (1). See Pipeline
Maven Plugin FAQ for more details.
[Pipeline] [linux-jdk9] }
[linux-jdk9] [withMaven] One or multiple Maven executions have been ignored by the Jenkins
Pipeline Maven Plugin because they have been interrupted before completion (1). See Pipeline
Maven Plugin FAQ for more details.
[Pipeline] [linux-jdk7] }
[linux-jdk7] [withMaven] One or multiple Maven executions have been ignored by the Jenkins
Pipeline Maven Plugin because they have been interrupted before completion (1). See Pipeline
Maven Plugin FAQ for more details.
[Pipeline] [linux-jdk8] }
[linux-jdk8] [withMaven] One or multiple Maven executions have been ignored by the Jenkins
Pipeline Maven Plugin because they have been interrupted before completion (1). See Pipeline
Maven Plugin FAQ for more details.
[Pipeline] [linux-jdk10] }
[Pipeline] [windows-jdk8] // withMaven
[Pipeline] [linux-jdk9] // withMaven
[Pipeline] [linux-jdk7] // withMaven
[Pipeline] [linux-jdk8] // withMaven
[Pipeline] [linux-jdk10] // withMaven
[Pipeline] [windows-jdk8] echo
[windows-jdk8] [FAIL FAST] windows-jdk10 had first failure, ignoring script returned exit
code -1
[Pipeline] [windows-jdk8] }
[Pipeline] [linux-jdk9] echo
[linux-jdk9] [FAIL FAST] windows-jdk10 had first failure, ignoring null
[Pipeline] [linux-jdk9] }
[Pipeline] [linux-jdk7] echo
[linux-jdk7] [FAIL FAST] windows-jdk10 had first failure, ignoring script returned exit code
143
[Pipeline] [linux-jdk7] }
[Pipeline] [linux-jdk8] echo
[linux-jdk8] [FAIL FAST] windows-jdk10 had first failure, ignoring script returned exit code
143
[Pipeline] [linux-jdk8] }
[Pipeline] [linux-jdk10] echo
[linux-jdk10] [FAIL FAST] windows-jdk10 had first failure, ignoring script returned exit code
1
[Pipeline] [linux-jdk10] }
[Pipeline] [windows-jdk8] // stage
[Pipeline] [linux-jdk9] // stage
[Pipeline] [linux-jdk7] // stage
[Pipeline] [linux-jdk8] // stage
[Pipeline] [linux-jdk10] // stage
[Pipeline] [linux-jdk7] }
[Pipeline] [linux-jdk9] }
[Pipeline] [linux-jdk8] }
[Pipeline] [linux-jdk10] }
[Pipeline] [windows-jdk8] }
[Pipeline] [linux-jdk7] // node
[Pipeline] [linux-jdk9] // node
[Pipeline] [linux-jdk8] // node
[Pipeline] [linux-jdk10] // node
[Pipeline] [windows-jdk8] // node
[Pipeline] [linux-jdk7] }
[Pipeline] [linux-jdk8] }
[Pipeline] [linux-jdk9] }
[Pipeline] [linux-jdk10] }
[Pipeline] [windows-jdk8] }
[windows-jdk7] After 10s process did not stop
[Pipeline] [windows-jdk7] }
[Pipeline] [windows-jdk7] // dir
[Pipeline] [windows-jdk7] }
[windows-jdk7] [withMaven] One or multiple Maven executions have been ignored by the Jenkins
Pipeline Maven Plugin because they have been interrupted before completion (1). See Pipeline
Maven Plugin FAQ for more details.
[Pipeline] [windows-jdk7] // withMaven
[Pipeline] [windows-jdk7] echo
[windows-jdk7] [FAIL FAST] windows-jdk10 had first failure, ignoring null
[Pipeline] [windows-jdk7] }
[Pipeline] [windows-jdk7] // stage
[Pipeline] [windows-jdk7] }
[Pipeline] [windows-jdk7] // node
[Pipeline] [windows-jdk7] }
[windows-jdk9] After 10s process did not stop
[Pipeline] [windows-jdk9] }
[Pipeline] [windows-jdk9] // dir
[Pipeline] [windows-jdk9] }
[windows-jdk9] [withMaven] One or multiple Maven executions have been ignored by the Jenkins
Pipeline Maven Plugin because they have been interrupted before completion (1). See Pipeline
Maven Plugin FAQ for more details.
[Pipeline] [windows-jdk9] // withMaven
[Pipeline] [windows-jdk9] echo
[windows-jdk9] [FAIL FAST] windows-jdk10 had first failure, ignoring null
[Pipeline] [windows-jdk9] }
[Pipeline] [windows-jdk9] // stage
[Pipeline] [windows-jdk9] }
[Pipeline] [windows-jdk9] // node
[Pipeline] [windows-jdk9] }
[Pipeline] // parallel
[Pipeline] echo
***** FAST FAILURE *****

Fast failure triggered by windows-jdk10

***** FAST FAILURE *****
[Pipeline] stage
[Pipeline] { (Notifications)
[Pipeline] echo
Build result: FAILURE
[Pipeline] jiraIssueSelector
[Pipeline] emailext
Mime
  • Unnamed multipart/mixed (inline, None, 0 bytes)
View raw message