maven-notifications mailing list archives

Site index · List index
Message view « Date » · « Thread »
Top « Date » · « Thread »
From Apache Jenkins Server <jenk...@builds.apache.org>
Subject Build failed in Jenkins: Maven TLP » maven-checkstyle-plugin » master #13
Date Sat, 07 Apr 2018 13:47:44 GMT
See https://builds.apache.org/job/maven-box/job/maven-checkstyle-plugin/job/master/13/

Changes:

* auto deploy if we are currently on master branch
* revert as it seems to fail on jenkins asf
* revert this one as well
* [MCHECKSTYLE-347] StringIndexOutOfBoundsException when
* [MCHECKSTYLE-347] StringIndexOutOfBoundsException when
* [MCHECKSTYLE-347] StringIndexOutOfBoundsException when
* [MCHECKSTYLE-347] StringIndexOutOfBoundsException when

No tests ran.

Build log:
[...truncated 592.37 KB...]
[linux-jdk10] [INFO] --- plexus-component-metadata:1.7.1:generate-metadata (default) @ maven-checkstyle-plugin
---
[linux-jdk10] [INFO] Downloading from central: https://repo.maven.apache.org/maven2/org/codehaus/plexus/plexus-container-default/1.7.1/plexus-container-default-1.7.1.pom
[linux-jdk10] [INFO] Downloaded from central: https://repo.maven.apache.org/maven2/org/codehaus/plexus/plexus-container-default/1.7.1/plexus-container-default-1.7.1.pom
(2.8 kB at 230 kB/s)
[linux-jdk10] [INFO] Downloading from central: https://repo.maven.apache.org/maven2/org/codehaus/plexus/plexus-classworlds/2.5.1/plexus-classworlds-2.5.1.pom
[linux-jdk10] [INFO] Downloaded from central: https://repo.maven.apache.org/maven2/org/codehaus/plexus/plexus-classworlds/2.5.1/plexus-classworlds-2.5.1.pom
(5.0 kB at 417 kB/s)
[linux-jdk10] [INFO] Downloading from central: https://repo.maven.apache.org/maven2/org/apache/xbean/xbean-reflect/3.7/xbean-reflect-3.7.pom
[linux-jdk10] [INFO] Downloaded from central: https://repo.maven.apache.org/maven2/org/apache/xbean/xbean-reflect/3.7/xbean-reflect-3.7.pom
(5.1 kB at 463 kB/s)
[linux-jdk10] [INFO] Downloading from central: https://repo.maven.apache.org/maven2/org/apache/xbean/xbean/3.7/xbean-3.7.pom
[linux-jdk10] [INFO] Downloaded from central: https://repo.maven.apache.org/maven2/org/apache/xbean/xbean/3.7/xbean-3.7.pom
(15 kB at 1.4 MB/s)
[linux-jdk10] [INFO] Downloading from central: https://repo.maven.apache.org/maven2/org/apache/geronimo/genesis/genesis-java5-flava/2.0/genesis-java5-flava-2.0.pom
[linux-jdk10] [INFO] Downloaded from central: https://repo.maven.apache.org/maven2/org/apache/geronimo/genesis/genesis-java5-flava/2.0/genesis-java5-flava-2.0.pom
(5.5 kB at 457 kB/s)
[linux-jdk10] [INFO] Downloading from central: https://repo.maven.apache.org/maven2/org/apache/geronimo/genesis/genesis-default-flava/2.0/genesis-default-flava-2.0.pom
[linux-jdk10] [INFO] Downloaded from central: https://repo.maven.apache.org/maven2/org/apache/geronimo/genesis/genesis-default-flava/2.0/genesis-default-flava-2.0.pom
(18 kB at 1.4 MB/s)
[linux-jdk10] [INFO] Downloading from central: https://repo.maven.apache.org/maven2/org/apache/geronimo/genesis/genesis/2.0/genesis-2.0.pom
[linux-jdk10] [INFO] Downloaded from central: https://repo.maven.apache.org/maven2/org/apache/geronimo/genesis/genesis/2.0/genesis-2.0.pom
(18 kB at 1.7 MB/s)
[linux-jdk10] [INFO] Downloading from central: https://repo.maven.apache.org/maven2/org/codehaus/plexus/plexus-component-annotations/1.7.1/plexus-component-annotations-1.7.1.pom
[linux-jdk10] [INFO] Downloaded from central: https://repo.maven.apache.org/maven2/org/codehaus/plexus/plexus-component-annotations/1.7.1/plexus-component-annotations-1.7.1.pom
(770 B at 64 kB/s)
[linux-jdk10] [INFO] Downloading from central: https://repo.maven.apache.org/maven2/com/thoughtworks/qdox/qdox/2.0-M2/qdox-2.0-M2.pom
[linux-jdk10] [INFO] Downloaded from central: https://repo.maven.apache.org/maven2/com/thoughtworks/qdox/qdox/2.0-M2/qdox-2.0-M2.pom
(18 kB at 1.5 MB/s)
[linux-jdk10] [INFO] Downloading from central: https://repo.maven.apache.org/maven2/org/jdom/jdom2/2.0.6/jdom2-2.0.6.pom
[linux-jdk10] [INFO] Downloaded from central: https://repo.maven.apache.org/maven2/org/jdom/jdom2/2.0.6/jdom2-2.0.6.pom
(4.6 kB at 383 kB/s)
[linux-jdk10] [INFO] Downloading from central: https://repo.maven.apache.org/maven2/org/apache/maven/maven-plugin-api/2.0.9/maven-plugin-api-2.0.9.pom
[linux-jdk10] [INFO] Downloaded from central: https://repo.maven.apache.org/maven2/org/apache/maven/maven-plugin-api/2.0.9/maven-plugin-api-2.0.9.pom
(1.5 kB at 136 kB/s)
[linux-jdk10] [INFO] Downloading from central: https://repo.maven.apache.org/maven2/org/apache/maven/maven-project/2.0.9/maven-project-2.0.9.pom
[linux-jdk10] [INFO] Downloaded from central: https://repo.maven.apache.org/maven2/org/apache/maven/maven-project/2.0.9/maven-project-2.0.9.pom
(2.7 kB at 246 kB/s)
[linux-jdk10] [INFO] Downloading from central: https://repo.maven.apache.org/maven2/org/apache/maven/maven-settings/2.0.9/maven-settings-2.0.9.pom
[linux-jdk10] [INFO] Downloaded from central: https://repo.maven.apache.org/maven2/org/apache/maven/maven-settings/2.0.9/maven-settings-2.0.9.pom
(2.1 kB at 172 kB/s)
[linux-jdk10] [INFO] Downloading from central: https://repo.maven.apache.org/maven2/org/apache/maven/maven-profile/2.0.9/maven-profile-2.0.9.pom
[linux-jdk10] [INFO] Downloaded from central: https://repo.maven.apache.org/maven2/org/apache/maven/maven-profile/2.0.9/maven-profile-2.0.9.pom
(2.0 kB at 171 kB/s)
[linux-jdk10] [INFO] Downloading from central: https://repo.maven.apache.org/maven2/org/apache/maven/maven-artifact-manager/2.0.9/maven-artifact-manager-2.0.9.pom
[linux-jdk9] [INFO] Starting audit...
[linux-jdk9] [WARN] /home/jenkins/jenkins-slave/workspace/en-checkstyle-plugin_master-6DNBLC4MMIUMS5G3LAT6DLZEJTJFDWHANNB7EQVCGNVHOCTJQXVA/m/src/test/test-sources/TestJavaObject.java:21:
'method def modifier' have incorrect indentation level 4, expected level should be 2. [Indentation]
[linux-jdk9] [WARN] /home/jenkins/jenkins-slave/workspace/en-checkstyle-plugin_master-6DNBLC4MMIUMS5G3LAT6DLZEJTJFDWHANNB7EQVCGNVHOCTJQXVA/m/src/test/test-sources/TestJavaObject.java:23:
'method def rcurly' have incorrect indentation level 4, expected level should be 2. [Indentation]
[linux-jdk9] [WARN] /home/jenkins/jenkins-slave/workspace/en-checkstyle-plugin_master-6DNBLC4MMIUMS5G3LAT6DLZEJTJFDWHANNB7EQVCGNVHOCTJQXVA/m/src/test/test-sources/TestJavaObject.java:25:
'method def modifier' have incorrect indentation level 4, expected level should be 2. [Indentation]
[linux-jdk9] [WARN] /home/jenkins/jenkins-slave/workspace/en-checkstyle-plugin_master-6DNBLC4MMIUMS5G3LAT6DLZEJTJFDWHANNB7EQVCGNVHOCTJQXVA/m/src/test/test-sources/TestJavaObject.java:27:
'method def rcurly' have incorrect indentation level 4, expected level should be 2. [Indentation]
[linux-jdk9] Audit done.
[linux-jdk9] [INFO] There are 5 errors reported by Checkstyle 6.18 with sun_checks.xml ruleset.
[linux-jdk10] [INFO] Downloaded from central: https://repo.maven.apache.org/maven2/org/apache/maven/maven-artifact-manager/2.0.9/maven-artifact-manager-2.0.9.pom
(2.7 kB at 208 kB/s)
[linux-jdk10] [INFO] Downloading from central: https://repo.maven.apache.org/maven2/org/apache/maven/maven-repository-metadata/2.0.9/maven-repository-metadata-2.0.9.pom
[linux-jdk10] [INFO] Downloaded from central: https://repo.maven.apache.org/maven2/org/apache/maven/maven-repository-metadata/2.0.9/maven-repository-metadata-2.0.9.pom
(1.9 kB at 158 kB/s)
[linux-jdk10] [INFO] Downloading from central: https://repo.maven.apache.org/maven2/org/apache/maven/maven-artifact/2.0.9/maven-artifact-2.0.9.pom
[linux-jdk10] [INFO] Downloaded from central: https://repo.maven.apache.org/maven2/org/apache/maven/maven-artifact/2.0.9/maven-artifact-2.0.9.pom
(1.6 kB at 125 kB/s)
[linux-jdk10] [INFO] Downloading from central: https://repo.maven.apache.org/maven2/org/apache/maven/maven-plugin-registry/2.0.9/maven-plugin-registry-2.0.9.pom
[linux-jdk10] [INFO] Downloaded from central: https://repo.maven.apache.org/maven2/org/apache/maven/maven-plugin-registry/2.0.9/maven-plugin-registry-2.0.9.pom
(2.0 kB at 131 kB/s)
[linux-jdk10] [INFO] Downloading from central: https://repo.maven.apache.org/maven2/org/codehaus/plexus/plexus-cli/1.6/plexus-cli-1.6.pom
[linux-jdk10] [INFO] Downloaded from central: https://repo.maven.apache.org/maven2/org/codehaus/plexus/plexus-cli/1.6/plexus-cli-1.6.pom
(1.4 kB at 101 kB/s)
[linux-jdk10] [INFO] Downloading from central: https://repo.maven.apache.org/maven2/org/ow2/asm/asm-all/5.1/asm-all-5.1.pom
[linux-jdk10] [INFO] Downloaded from central: https://repo.maven.apache.org/maven2/org/ow2/asm/asm-all/5.1/asm-all-5.1.pom
(2.0 kB at 151 kB/s)
[linux-jdk10] [INFO] Downloading from central: https://repo.maven.apache.org/maven2/org/ow2/asm/asm-parent/5.1/asm-parent-5.1.pom
[linux-jdk10] [INFO] Downloaded from central: https://repo.maven.apache.org/maven2/org/ow2/asm/asm-parent/5.1/asm-parent-5.1.pom
(5.5 kB at 423 kB/s)
[linux-jdk10] [INFO] Downloading from central: https://repo.maven.apache.org/maven2/org/codehaus/plexus/plexus-container-default/1.7.1/plexus-container-default-1.7.1.jar
[linux-jdk10] [INFO] Downloading from central: https://repo.maven.apache.org/maven2/org/apache/xbean/xbean-reflect/3.7/xbean-reflect-3.7.jar
[linux-jdk10] [INFO] Downloading from central: https://repo.maven.apache.org/maven2/org/codehaus/plexus/plexus-classworlds/2.5.1/plexus-classworlds-2.5.1.jar
[linux-jdk10] [INFO] Downloading from central: https://repo.maven.apache.org/maven2/com/google/collections/google-collections/1.0/google-collections-1.0.jar
[linux-jdk10] [INFO] Downloading from central: https://repo.maven.apache.org/maven2/org/codehaus/plexus/plexus-component-annotations/1.7.1/plexus-component-annotations-1.7.1.jar
[linux-jdk10] [INFO] Downloaded from central: https://repo.maven.apache.org/maven2/org/codehaus/plexus/plexus-component-annotations/1.7.1/plexus-component-annotations-1.7.1.jar
(4.3 kB at 226 kB/s)
[linux-jdk10] [INFO] Downloading from central: https://repo.maven.apache.org/maven2/com/thoughtworks/qdox/qdox/2.0-M2/qdox-2.0-M2.jar
[linux-jdk10] [INFO] Downloaded from central: https://repo.maven.apache.org/maven2/org/codehaus/plexus/plexus-classworlds/2.5.1/plexus-classworlds-2.5.1.jar
(50 kB at 2.3 MB/s)
[linux-jdk10] [INFO] Downloading from central: https://repo.maven.apache.org/maven2/org/jdom/jdom2/2.0.6/jdom2-2.0.6.jar
[linux-jdk10] [INFO] Downloaded from central: https://repo.maven.apache.org/maven2/org/codehaus/plexus/plexus-container-default/1.7.1/plexus-container-default-1.7.1.jar
(231 kB at 9.6 MB/s)
[linux-jdk10] [INFO] Downloading from central: https://repo.maven.apache.org/maven2/org/apache/maven/maven-plugin-api/2.0.9/maven-plugin-api-2.0.9.jar
[linux-jdk10] [INFO] Downloaded from central: https://repo.maven.apache.org/maven2/org/apache/xbean/xbean-reflect/3.7/xbean-reflect-3.7.jar
(148 kB at 6.2 MB/s)
[linux-jdk10] [INFO] Downloading from central: https://repo.maven.apache.org/maven2/org/apache/maven/maven-project/2.0.9/maven-project-2.0.9.jar
[linux-jdk10] [INFO] Downloaded from central: https://repo.maven.apache.org/maven2/org/apache/maven/maven-plugin-api/2.0.9/maven-plugin-api-2.0.9.jar
(13 kB at 339 kB/s)
[linux-jdk10] [INFO] Downloading from central: https://repo.maven.apache.org/maven2/org/apache/maven/maven-settings/2.0.9/maven-settings-2.0.9.jar
[linux-jdk10] [INFO] Downloaded from central: https://repo.maven.apache.org/maven2/org/apache/maven/maven-project/2.0.9/maven-project-2.0.9.jar
(122 kB at 3.1 MB/s)
[linux-jdk10] [INFO] Downloading from central: https://repo.maven.apache.org/maven2/org/apache/maven/maven-profile/2.0.9/maven-profile-2.0.9.jar
[linux-jdk10] [INFO] Downloaded from central: https://repo.maven.apache.org/maven2/com/google/collections/google-collections/1.0/google-collections-1.0.jar
(640 kB at 16 MB/s)
[linux-jdk10] [INFO] Downloading from central: https://repo.maven.apache.org/maven2/org/apache/maven/maven-artifact-manager/2.0.9/maven-artifact-manager-2.0.9.jar
[linux-jdk10] [INFO] Downloaded from central: https://repo.maven.apache.org/maven2/org/jdom/jdom2/2.0.6/jdom2-2.0.6.jar
(305 kB at 7.6 MB/s)
[linux-jdk10] [INFO] Downloading from central: https://repo.maven.apache.org/maven2/org/apache/maven/maven-repository-metadata/2.0.9/maven-repository-metadata-2.0.9.jar
[linux-jdk10] [INFO] Downloaded from central: https://repo.maven.apache.org/maven2/com/thoughtworks/qdox/qdox/2.0-M2/qdox-2.0-M2.jar
(292 kB at 6.6 MB/s)
[linux-jdk10] [INFO] Downloading from central: https://repo.maven.apache.org/maven2/org/apache/maven/maven-plugin-registry/2.0.9/maven-plugin-registry-2.0.9.jar
[linux-jdk10] [INFO] Downloaded from central: https://repo.maven.apache.org/maven2/org/apache/maven/maven-settings/2.0.9/maven-settings-2.0.9.jar
(49 kB at 963 kB/s)
[linux-jdk10] [INFO] Downloaded from central: https://repo.maven.apache.org/maven2/org/apache/maven/maven-profile/2.0.9/maven-profile-2.0.9.jar
(35 kB at 693 kB/s)
[linux-jdk10] [INFO] Downloading from central: https://repo.maven.apache.org/maven2/org/apache/maven/maven-artifact/2.0.9/maven-artifact-2.0.9.jar
[linux-jdk10] [INFO] Downloading from central: https://repo.maven.apache.org/maven2/org/codehaus/plexus/plexus-cli/1.6/plexus-cli-1.6.jar
[linux-jdk10] [INFO] Downloaded from central: https://repo.maven.apache.org/maven2/org/apache/maven/maven-repository-metadata/2.0.9/maven-repository-metadata-2.0.9.jar
(25 kB at 472 kB/s)
[linux-jdk10] [INFO] Downloading from central: https://repo.maven.apache.org/maven2/org/ow2/asm/asm-all/5.1/asm-all-5.1.jar
[linux-jdk10] [INFO] Downloaded from central: https://repo.maven.apache.org/maven2/org/apache/maven/maven-artifact-manager/2.0.9/maven-artifact-manager-2.0.9.jar
(58 kB at 1.1 MB/s)
[linux-jdk10] [INFO] Downloaded from central: https://repo.maven.apache.org/maven2/org/apache/maven/maven-plugin-registry/2.0.9/maven-plugin-registry-2.0.9.jar
(29 kB at 501 kB/s)
[linux-jdk10] [INFO] Downloaded from central: https://repo.maven.apache.org/maven2/org/codehaus/plexus/plexus-cli/1.6/plexus-cli-1.6.jar
(7.4 kB at 115 kB/s)
[linux-jdk10] [INFO] Downloaded from central: https://repo.maven.apache.org/maven2/org/apache/maven/maven-artifact/2.0.9/maven-artifact-2.0.9.jar
(89 kB at 1.4 MB/s)
[linux-jdk10] [INFO] Downloaded from central: https://repo.maven.apache.org/maven2/org/ow2/asm/asm-all/5.1/asm-all-5.1.jar
(248 kB at 3.5 MB/s)
[linux-jdk10] [INFO] Discovered 3 component descriptors(s)
[linux-jdk10] [INFO] 
[linux-jdk10] [INFO] --- maven-resources-plugin:2.7:testResources (default-testResources)
@ maven-checkstyle-plugin ---
[linux-jdk10] [INFO] Using 'UTF-8' encoding to copy filtered resources.
[linux-jdk10] [INFO] skip non existing resourceDirectory /home/jenkins/jenkins-slave/workspace/en-checkstyle-plugin_master-6DNBLC4MMIUMS5G3LAT6DLZEJTJFDWHANNB7EQVCGNVHOCTJQXVA@2/m/src/test/resources
[linux-jdk10] [INFO] Copying 3 resources
[linux-jdk10] [INFO] 
[linux-jdk10] [INFO] --- maven-compiler-plugin:3.5.1:testCompile (default-testCompile) @ maven-checkstyle-plugin
---
[linux-jdk10] [INFO] Changes detected - recompiling the module!
[linux-jdk10] [INFO] Compiling 12 source files to /home/jenkins/jenkins-slave/workspace/en-checkstyle-plugin_master-6DNBLC4MMIUMS5G3LAT6DLZEJTJFDWHANNB7EQVCGNVHOCTJQXVA@2/m/target/test-classes
[linux-jdk9] [INFO] There are 5 errors reported by Checkstyle 6.18 with sun_checks.xml ruleset.
[linux-jdk9] [INFO] There are 5 errors reported by Checkstyle 6.18 with sun_checks.xml ruleset.
[linux-jdk10] [INFO] 
[linux-jdk10] [INFO] --- maven-surefire-plugin:2.19.1:test (default-test) @ maven-checkstyle-plugin
---
[linux-jdk10] [INFO] Downloading from central: https://repo.maven.apache.org/maven2/org/apache/maven/plugin-tools/maven-plugin-annotations/3.3/maven-plugin-annotations-3.3.pom
[linux-jdk10] [INFO] Downloaded from central: https://repo.maven.apache.org/maven2/org/apache/maven/plugin-tools/maven-plugin-annotations/3.3/maven-plugin-annotations-3.3.pom
(1.6 kB at 125 kB/s)
[linux-jdk10] [INFO] Downloading from central: https://repo.maven.apache.org/maven2/org/apache/maven/plugin-tools/maven-plugin-tools/3.3/maven-plugin-tools-3.3.pom
[linux-jdk10] [INFO] Downloaded from central: https://repo.maven.apache.org/maven2/org/apache/maven/plugin-tools/maven-plugin-tools/3.3/maven-plugin-tools-3.3.pom
(13 kB at 1.1 MB/s)
[linux-jdk10] [INFO] Downloading from central: https://repo.maven.apache.org/maven2/junit/junit/4.12/junit-4.12.pom
[linux-jdk10] [INFO] Downloaded from central: https://repo.maven.apache.org/maven2/junit/junit/4.12/junit-4.12.pom
(24 kB at 1.8 MB/s)
[linux-jdk10] [INFO] Downloading from central: https://repo.maven.apache.org/maven2/junit/junit/4.12/junit-4.12.jar
[linux-jdk10] [INFO] Downloading from central: https://repo.maven.apache.org/maven2/org/apache/maven/plugin-tools/maven-plugin-annotations/3.3/maven-plugin-annotations-3.3.jar
[linux-jdk10] [INFO] Downloaded from central: https://repo.maven.apache.org/maven2/org/apache/maven/plugin-tools/maven-plugin-annotations/3.3/maven-plugin-annotations-3.3.jar
(14 kB at 1.0 MB/s)
[linux-jdk10] [INFO] Downloaded from central: https://repo.maven.apache.org/maven2/junit/junit/4.12/junit-4.12.jar
(315 kB at 13 MB/s)
[linux-jdk10] [INFO] Downloading from central: https://repo.maven.apache.org/maven2/org/apache/maven/surefire/surefire-junit4/2.19.1/surefire-junit4-2.19.1.pom
[linux-jdk10] [INFO] Downloaded from central: https://repo.maven.apache.org/maven2/org/apache/maven/surefire/surefire-junit4/2.19.1/surefire-junit4-2.19.1.pom
(3.3 kB at 272 kB/s)
[linux-jdk10] [INFO] Downloading from central: https://repo.maven.apache.org/maven2/org/apache/maven/surefire/surefire-providers/2.19.1/surefire-providers-2.19.1.pom
[linux-jdk10] [INFO] Downloaded from central: https://repo.maven.apache.org/maven2/org/apache/maven/surefire/surefire-providers/2.19.1/surefire-providers-2.19.1.pom
(2.6 kB at 214 kB/s)
[linux-jdk10] [INFO] Downloading from central: https://repo.maven.apache.org/maven2/org/apache/maven/surefire/surefire-junit4/2.19.1/surefire-junit4-2.19.1.jar
[linux-jdk10] [INFO] Downloaded from central: https://repo.maven.apache.org/maven2/org/apache/maven/surefire/surefire-junit4/2.19.1/surefire-junit4-2.19.1.jar
(75 kB at 4.7 MB/s)
[linux-jdk10] 
[linux-jdk10] -------------------------------------------------------
[linux-jdk10]  T E S T S
[linux-jdk10] -------------------------------------------------------
[linux-jdk10] Picked up JAVA_TOOL_OPTIONS: -Dmaven.ext.class.path="/home/jenkins/jenkins-slave/workspace/en-checkstyle-plugin_master-6DNBLC4MMIUMS5G3LAT6DLZEJTJFDWHANNB7EQVCGNVHOCTJQXVA@2@tmp/withMaven6f443b5c/pipeline-maven-spy.jar"
-Dorg.jenkinsci.plugins.pipeline.maven.reportsFolder="/home/jenkins/jenkins-slave/workspace/en-checkstyle-plugin_master-6DNBLC4MMIUMS5G3LAT6DLZEJTJFDWHANNB7EQVCGNVHOCTJQXVA@2@tmp/withMaven6f443b5c"

[linux-jdk10] Running org.apache.maven.plugins.checkstyle.RuleUtilTest
[linux-jdk10] Tests run: 4, Failures: 0, Errors: 0, Skipped: 0, Time elapsed: 0.038 sec -
in org.apache.maven.plugins.checkstyle.RuleUtilTest
[linux-jdk10] Running org.apache.maven.plugins.checkstyle.exec.CheckstyleResultsTest
[linux-jdk10] Tests run: 2, Failures: 0, Errors: 0, Skipped: 0, Time elapsed: 0.001 sec -
in org.apache.maven.plugins.checkstyle.exec.CheckstyleResultsTest
[linux-jdk10] Running org.apache.maven.plugins.checkstyle.exec.CheckstyleReportListenerTest
[linux-jdk10] Tests run: 1, Failures: 0, Errors: 0, Skipped: 0, Time elapsed: 0 sec - in org.apache.maven.plugins.checkstyle.exec.CheckstyleReportListenerTest
[linux-jdk10] Running org.apache.maven.plugins.checkstyle.exec.CheckstyleReportListenerMultiSourceTest
[linux-jdk10] Tests run: 1, Failures: 0, Errors: 0, Skipped: 0, Time elapsed: 0 sec - in org.apache.maven.plugins.checkstyle.exec.CheckstyleReportListenerMultiSourceTest
[linux-jdk10] Running org.apache.maven.plugins.checkstyle.CheckstyleReportTest
[linux-jdk9] [INFO] There are 5 errors reported by Checkstyle 6.18 with sun_checks.xml ruleset.
[linux-jdk9] [INFO] There are 5 errors reported by Checkstyle 6.18 with sun_checks.xml ruleset.
[linux-jdk9] [INFO] There are 5 errors reported by Checkstyle 6.18 with sun_checks.xml ruleset.
[linux-jdk9] [INFO] There are 5 errors reported by Checkstyle 6.18 with sun_checks.xml ruleset.
[linux-jdk9] [INFO] There are 5 errors reported by Checkstyle 6.18 with sun_checks.xml ruleset.
[linux-jdk9] [INFO] There are 5 errors reported by Checkstyle 6.18 with sun_checks.xml ruleset.
[linux-jdk9] [INFO] There are 5 errors reported by Checkstyle 6.18 with sun_checks.xml ruleset.
[linux-jdk9] Tests run: 10, Failures: 0, Errors: 0, Skipped: 0, Time elapsed: 10.504 sec -
in org.apache.maven.plugins.checkstyle.CheckstyleReportTest
[linux-jdk9] Running org.apache.maven.plugins.checkstyle.CheckstyleViolationCheckMojoTest
[linux-jdk9] Sending interrupt signal to process
[linux-jdk10] Sending interrupt signal to process
[linux-jdk9] [INFO] Unable to perform checkstyle:check, unable to find checkstyle:checkstyle
outputFile.
[linux-jdk9] 
[linux-jdk9] Results :
[linux-jdk9] 
[linux-jdk9] Tests run: 18, Failures: 0, Errors: 0, Skipped: 0
[linux-jdk9] 
[linux-jdk9] [INFO] ------------------------------------------------------------------------
[linux-jdk9] [INFO] BUILD FAILURE
[linux-jdk9] [INFO] ------------------------------------------------------------------------
[linux-jdk9] [INFO] Total time: 37.933 s
[linux-jdk9] [INFO] Finished at: 2018-04-07T13:46:56Z
[linux-jdk10] [INFO] There are 5 errors reported by Checkstyle 6.18 with sun_checks.xml ruleset.
[linux-jdk10] 
[linux-jdk10] Results :
[linux-jdk10] 
[linux-jdk10] Tests run: 8, Failures: 0, Errors: 0, Skipped: 0
[linux-jdk10] 
[linux-jdk10] [INFO] ------------------------------------------------------------------------
[linux-jdk10] [INFO] BUILD FAILURE
[linux-jdk10] [INFO] ------------------------------------------------------------------------
[linux-jdk10] [INFO] Total time: 32.267 s
[linux-jdk10] [INFO] Finished at: 2018-04-07T13:46:57Z
[linux-jdk10] Terminated
[linux-jdk9] Terminated
[linux-jdk9] [INFO] Final Memory: 76M/244M
[linux-jdk9] [INFO] ------------------------------------------------------------------------
[linux-jdk10] [INFO] Final Memory: 42M/228M
[linux-jdk10] [INFO] ------------------------------------------------------------------------
[Pipeline] [windows-jdk8] // stage
[Pipeline] [windows-jdk8] }
[Pipeline] [windows-jdk7] // node
[Pipeline] [windows-jdk7] }
[Pipeline] [linux-jdk9] }
[Pipeline] [linux-jdk7] }
[Pipeline] [linux-jdk10] }
[Pipeline] [windows-jdk9] }
[Pipeline] [windows-jdk10] }
[Pipeline] [windows-jdk8] // node
[Pipeline] [windows-jdk8] }
[Pipeline] [linux-jdk9] // dir
[Pipeline] [linux-jdk7] // dir
[Pipeline] [linux-jdk10] // dir
[Pipeline] [windows-jdk9] // dir
[Pipeline] [windows-jdk10] // dir
[Pipeline] [linux-jdk9] }
[linux-jdk9] [withMaven] One or multiple Maven executions have been ignored by the Jenkins
Pipeline Maven Plugin because they have been interrupted before completion (1). See Pipeline
Maven Plugin FAQ for more details.
[Pipeline] [linux-jdk7] }
[linux-jdk7] [withMaven] One or multiple Maven executions have been ignored by the Jenkins
Pipeline Maven Plugin because they have been interrupted before completion (1). See Pipeline
Maven Plugin FAQ for more details.
[Pipeline] [linux-jdk10] }
[linux-jdk10] [withMaven] One or multiple Maven executions have been ignored by the Jenkins
Pipeline Maven Plugin because they have been interrupted before completion (1). See Pipeline
Maven Plugin FAQ for more details.
[Pipeline] [windows-jdk9] }
[Pipeline] [windows-jdk10] }
[Pipeline] [linux-jdk9] // withMaven
[Pipeline] [linux-jdk7] // withMaven
[Pipeline] [linux-jdk10] // withMaven
[Pipeline] [windows-jdk9] // stage
[Pipeline] [windows-jdk10] // stage
[Pipeline] [linux-jdk9] echo
[linux-jdk9] [FAIL FAST] linux-jdk8 had first failure, ignoring script returned exit code
143
[Pipeline] [linux-jdk9] }
[Pipeline] [linux-jdk7] echo
[linux-jdk7] [FAIL FAST] linux-jdk8 had first failure, ignoring null
[Pipeline] [linux-jdk7] }
[Pipeline] [linux-jdk10] echo
[linux-jdk10] [FAIL FAST] linux-jdk8 had first failure, ignoring script returned exit code
143
[Pipeline] [linux-jdk10] }
[Pipeline] [windows-jdk9] stage
[Pipeline] [windows-jdk9] { (Build windows-jdk9)
[Pipeline] [windows-jdk10] stage
[Pipeline] [windows-jdk10] { (Build windows-jdk10)
[Pipeline] [windows-jdk9] echo
[windows-jdk9] [FAIL FAST] linux-jdk8 has failed. Skipping windows-jdk9.
[Pipeline] [windows-jdk9] }
[Pipeline] [windows-jdk10] echo
[windows-jdk10] [FAIL FAST] linux-jdk8 has failed. Skipping windows-jdk10.
[Pipeline] [windows-jdk10] }
[Pipeline] [linux-jdk9] // stage
[Pipeline] [linux-jdk7] // stage
[Pipeline] [linux-jdk10] // stage
[Pipeline] [linux-jdk7] }
[Pipeline] [linux-jdk9] }
[Pipeline] [linux-jdk10] }
[Pipeline] [windows-jdk9] // stage
[Pipeline] [windows-jdk10] // stage
[Pipeline] [windows-jdk9] }
[Pipeline] [windows-jdk10] }
[Pipeline] [linux-jdk7] // node
[Pipeline] [linux-jdk9] // node
[Pipeline] [linux-jdk10] // node
[Pipeline] [linux-jdk7] }
[Pipeline] [linux-jdk9] }
[Pipeline] [linux-jdk10] }
[Pipeline] [windows-jdk9] // node
[Pipeline] [windows-jdk10] // node
[Pipeline] [windows-jdk9] }
[Pipeline] [windows-jdk10] }
[Pipeline] // parallel
[Pipeline] echo
***** FAST FAILURE *****

Fast failure triggered by linux-jdk8

***** FAST FAILURE *****
[Pipeline] stage
[Pipeline] { (Notifications)
[Pipeline] echo
Build result: FAILURE
[Pipeline] jiraIssueSelector
[Pipeline] jiraComment
[Pipeline] emailext
Mime
  • Unnamed multipart/mixed (inline, None, 0 bytes)
View raw message