maven-notifications mailing list archives

Site index · List index
Message view « Date » · « Thread »
Top « Date » · « Thread »
From Apache Jenkins Server <jenk...@builds.apache.org>
Subject Build unstable in Jenkins: Maven TLP » maven-dependency-plugin » MDEP-604 #1
Date Mon, 02 Apr 2018 11:13:50 GMT
See https://builds.apache.org/job/maven-box/job/maven-dependency-plugin/job/MDEP-604/1/

No changes.

32 tests failed.
FAILED:  org.apache.maven.plugins.dependency.fromConfiguration.TestCopyMojo.testCopyOverWriteReleases

Error Message:
null

Stack Trace:
junit.framework.AssertionFailedError
	at org.apache.maven.plugins.dependency.fromConfiguration.TestCopyMojo.testCopyOverWriteReleases(TestCopyMojo.java:694)


FAILED:  org.apache.maven.plugins.dependency.fromConfiguration.TestCopyMojo.testCopyOverWriteSnapshot

Error Message:
null

Stack Trace:
junit.framework.AssertionFailedError
	at org.apache.maven.plugins.dependency.fromConfiguration.TestCopyMojo.testCopyOverWriteSnapshot(TestCopyMojo.java:723)


FAILED:  org.apache.maven.plugins.dependency.fromConfiguration.TestCopyMojo.testCopyOverWriteReleases

Error Message:
null

Stack Trace:
junit.framework.AssertionFailedError
	at org.apache.maven.plugins.dependency.fromConfiguration.TestCopyMojo.testCopyOverWriteReleases(TestCopyMojo.java:694)


FAILED:  org.apache.maven.plugins.dependency.fromConfiguration.TestCopyMojo.testCopyOverWriteSnapshot

Error Message:
null

Stack Trace:
junit.framework.AssertionFailedError
	at org.apache.maven.plugins.dependency.fromConfiguration.TestCopyMojo.testCopyOverWriteSnapshot(TestCopyMojo.java:723)


FAILED:  org.apache.maven.plugins.dependency.fromConfiguration.TestCopyMojo.testCopyOverWriteReleases

Error Message:
null

Stack Trace:
junit.framework.AssertionFailedError
	at org.apache.maven.plugins.dependency.fromConfiguration.TestCopyMojo.testCopyOverWriteReleases(TestCopyMojo.java:694)


FAILED:  org.apache.maven.plugins.dependency.fromConfiguration.TestCopyMojo.testCopyOverWriteSnapshot

Error Message:
null

Stack Trace:
junit.framework.AssertionFailedError
	at org.apache.maven.plugins.dependency.fromConfiguration.TestCopyMojo.testCopyOverWriteSnapshot(TestCopyMojo.java:723)


FAILED:  org.apache.maven.plugins.dependency.fromConfiguration.TestCopyMojo.testCopyOverWriteReleases

Error Message:
null

Stack Trace:
junit.framework.AssertionFailedError
	at org.apache.maven.plugins.dependency.fromConfiguration.TestCopyMojo.testCopyOverWriteReleases(TestCopyMojo.java:694)


FAILED:  org.apache.maven.plugins.dependency.fromConfiguration.TestCopyMojo.testCopyOverWriteSnapshot

Error Message:
null

Stack Trace:
junit.framework.AssertionFailedError
	at org.apache.maven.plugins.dependency.fromConfiguration.TestCopyMojo.testCopyOverWriteSnapshot(TestCopyMojo.java:723)


FAILED:  org.apache.maven.plugins.dependency.fromConfiguration.TestCopyMojo.testCopyOverWriteReleases

Error Message:
null

Stack Trace:
junit.framework.AssertionFailedError
	at org.apache.maven.plugins.dependency.fromConfiguration.TestCopyMojo.testCopyOverWriteReleases(TestCopyMojo.java:694)


FAILED:  org.apache.maven.plugins.dependency.fromConfiguration.TestCopyMojo.testCopyOverWriteSnapshot

Error Message:
null

Stack Trace:
junit.framework.AssertionFailedError
	at org.apache.maven.plugins.dependency.fromConfiguration.TestCopyMojo.testCopyOverWriteSnapshot(TestCopyMojo.java:723)


FAILED:  org.apache.maven.plugins.dependency.fromConfiguration.TestCopyMojo.testCopyOverWriteReleases

Error Message:
null

Stack Trace:
junit.framework.AssertionFailedError
	at org.apache.maven.plugins.dependency.fromConfiguration.TestCopyMojo.testCopyOverWriteReleases(TestCopyMojo.java:694)


FAILED:  org.apache.maven.plugins.dependency.fromConfiguration.TestCopyMojo.testCopyOverWriteSnapshot

Error Message:
null

Stack Trace:
junit.framework.AssertionFailedError
	at org.apache.maven.plugins.dependency.fromConfiguration.TestCopyMojo.testCopyOverWriteSnapshot(TestCopyMojo.java:723)


FAILED:  org.apache.maven.plugins.dependency.fromConfiguration.TestCopyMojo.testCopyOverWriteReleases

Error Message:
null

Stack Trace:
junit.framework.AssertionFailedError
	at org.apache.maven.plugins.dependency.fromConfiguration.TestCopyMojo.testCopyOverWriteReleases(TestCopyMojo.java:694)


FAILED:  org.apache.maven.plugins.dependency.fromConfiguration.TestCopyMojo.testCopyOverWriteSnapshot

Error Message:
null

Stack Trace:
junit.framework.AssertionFailedError
	at org.apache.maven.plugins.dependency.fromConfiguration.TestCopyMojo.testCopyOverWriteSnapshot(TestCopyMojo.java:723)


FAILED:  org.apache.maven.plugins.dependency.fromConfiguration.TestCopyMojo.testCopyOverWriteReleases

Error Message:
null

Stack Trace:
junit.framework.AssertionFailedError
	at org.apache.maven.plugins.dependency.fromConfiguration.TestCopyMojo.testCopyOverWriteReleases(TestCopyMojo.java:694)


FAILED:  org.apache.maven.plugins.dependency.fromConfiguration.TestCopyMojo.testCopyOverWriteSnapshot

Error Message:
null

Stack Trace:
junit.framework.AssertionFailedError
	at org.apache.maven.plugins.dependency.fromConfiguration.TestCopyMojo.testCopyOverWriteSnapshot(TestCopyMojo.java:723)


FAILED:  org.apache.maven.plugins.dependency.fromDependencies.TestCopyDependenciesMojo.testOverWriteSnap

Error Message:
null

Stack Trace:
junit.framework.AssertionFailedError
	at org.apache.maven.plugins.dependency.fromDependencies.TestCopyDependenciesMojo.testOverWriteSnap(TestCopyDependenciesMojo.java:654)


FAILED:  org.apache.maven.plugins.dependency.fromDependencies.TestCopyDependenciesMojo.testOverWriteRelease

Error Message:
time = 1522666374000 should be < to 1522666372125

Stack Trace:
junit.framework.AssertionFailedError: time = 1522666374000 should be < to 1522666372125
	at org.apache.maven.plugins.dependency.fromDependencies.TestCopyDependenciesMojo.testOverWriteRelease(TestCopyDependenciesMojo.java:585)


FAILED:  org.apache.maven.plugins.dependency.fromDependencies.TestCopyDependenciesMojo.testOverWriteSnap

Error Message:
null

Stack Trace:
junit.framework.AssertionFailedError
	at org.apache.maven.plugins.dependency.fromDependencies.TestCopyDependenciesMojo.testOverWriteSnap(TestCopyDependenciesMojo.java:654)


FAILED:  org.apache.maven.plugins.dependency.fromDependencies.TestCopyDependenciesMojo.testOverWriteRelease

Error Message:
time = 1522666375000 should be < to 1522666373360

Stack Trace:
junit.framework.AssertionFailedError: time = 1522666375000 should be < to 1522666373360
	at org.apache.maven.plugins.dependency.fromDependencies.TestCopyDependenciesMojo.testOverWriteRelease(TestCopyDependenciesMojo.java:585)


FAILED:  org.apache.maven.plugins.dependency.fromDependencies.TestCopyDependenciesMojo.testOverWriteSnap

Error Message:
null

Stack Trace:
junit.framework.AssertionFailedError
	at org.apache.maven.plugins.dependency.fromDependencies.TestCopyDependenciesMojo.testOverWriteSnap(TestCopyDependenciesMojo.java:654)


FAILED:  org.apache.maven.plugins.dependency.fromDependencies.TestCopyDependenciesMojo.testOverWriteRelease

Error Message:
time = 1522666351000 should be < to 1522666349712

Stack Trace:
junit.framework.AssertionFailedError: time = 1522666351000 should be < to 1522666349712
	at org.apache.maven.plugins.dependency.fromDependencies.TestCopyDependenciesMojo.testOverWriteRelease(TestCopyDependenciesMojo.java:585)


FAILED:  org.apache.maven.plugins.dependency.fromDependencies.TestCopyDependenciesMojo.testOverWriteSnap

Error Message:
null

Stack Trace:
junit.framework.AssertionFailedError
	at org.apache.maven.plugins.dependency.fromDependencies.TestCopyDependenciesMojo.testOverWriteSnap(TestCopyDependenciesMojo.java:654)


FAILED:  org.apache.maven.plugins.dependency.fromDependencies.TestCopyDependenciesMojo.testOverWriteRelease

Error Message:
time = 1522666366000 should be < to 1522666364018

Stack Trace:
junit.framework.AssertionFailedError: time = 1522666366000 should be < to 1522666364018
	at org.apache.maven.plugins.dependency.fromDependencies.TestCopyDependenciesMojo.testOverWriteRelease(TestCopyDependenciesMojo.java:585)


FAILED:  org.apache.maven.plugins.dependency.fromDependencies.TestCopyDependenciesMojo.testOverWriteSnap

Error Message:
null

Stack Trace:
junit.framework.AssertionFailedError
	at org.apache.maven.plugins.dependency.fromDependencies.TestCopyDependenciesMojo.testOverWriteSnap(TestCopyDependenciesMojo.java:654)


FAILED:  org.apache.maven.plugins.dependency.fromDependencies.TestCopyDependenciesMojo.testOverWriteRelease

Error Message:
time = 1522666343000 should be < to 1522666341637

Stack Trace:
junit.framework.AssertionFailedError: time = 1522666343000 should be < to 1522666341637
	at org.apache.maven.plugins.dependency.fromDependencies.TestCopyDependenciesMojo.testOverWriteRelease(TestCopyDependenciesMojo.java:585)


FAILED:  org.apache.maven.plugins.dependency.fromDependencies.TestCopyDependenciesMojo.testOverWriteSnap

Error Message:
null

Stack Trace:
junit.framework.AssertionFailedError
	at org.apache.maven.plugins.dependency.fromDependencies.TestCopyDependenciesMojo.testOverWriteSnap(TestCopyDependenciesMojo.java:654)


FAILED:  org.apache.maven.plugins.dependency.fromDependencies.TestCopyDependenciesMojo.testOverWriteRelease

Error Message:
time = 1522666355000 should be < to 1522666353000

Stack Trace:
junit.framework.AssertionFailedError: time = 1522666355000 should be < to 1522666353000
	at org.apache.maven.plugins.dependency.fromDependencies.TestCopyDependenciesMojo.testOverWriteRelease(TestCopyDependenciesMojo.java:585)


FAILED:  org.apache.maven.plugins.dependency.fromDependencies.TestCopyDependenciesMojo.testOverWriteSnap

Error Message:
null

Stack Trace:
junit.framework.AssertionFailedError
	at org.apache.maven.plugins.dependency.fromDependencies.TestCopyDependenciesMojo.testOverWriteSnap(TestCopyDependenciesMojo.java:654)


FAILED:  org.apache.maven.plugins.dependency.fromDependencies.TestCopyDependenciesMojo.testOverWriteRelease

Error Message:
time = 1522666354000 should be < to 1522666352000

Stack Trace:
junit.framework.AssertionFailedError: time = 1522666354000 should be < to 1522666352000
	at org.apache.maven.plugins.dependency.fromDependencies.TestCopyDependenciesMojo.testOverWriteRelease(TestCopyDependenciesMojo.java:585)


FAILED:  org.apache.maven.plugins.dependency.fromDependencies.TestCopyDependenciesMojo.testOverWriteSnap

Error Message:
null

Stack Trace:
junit.framework.AssertionFailedError
	at org.apache.maven.plugins.dependency.fromDependencies.TestCopyDependenciesMojo.testOverWriteSnap(TestCopyDependenciesMojo.java:654)


FAILED:  org.apache.maven.plugins.dependency.fromDependencies.TestCopyDependenciesMojo.testOverWriteRelease

Error Message:
time = 1522666361000 should be < to 1522666358000

Stack Trace:
junit.framework.AssertionFailedError: time = 1522666361000 should be < to 1522666358000
	at org.apache.maven.plugins.dependency.fromDependencies.TestCopyDependenciesMojo.testOverWriteRelease(TestCopyDependenciesMojo.java:585)




Build log:
[...truncated 2.91 MB...]
[linux-jdk8] [INFO] run post-build script verify.bsh
[linux-jdk8] [INFO]           copy-dependencies/pom.xml ........................ SUCCESS (5.6
s)
[linux-jdk8] [INFO] Building: dependency-properties/pom.xml
[linux-jdk9] [INFO] run post-build script verify.bsh
[linux-jdk9] [INFO]           tree-includes/pom.xml ............................ SUCCESS (5.1
s)
[linux-jdk9] [INFO] Building: purge-local-repository-reresolve/pom.xml
[linux-jdk9] [INFO] run post-build script verify.bsh
[linux-jdk9] [INFO]           purge-local-repository-reresolve/pom.xml ......... SUCCESS (5.2
s)
[linux-jdk9] [INFO] Building: build-classpath-output-file-and-property/pom.xml
[linux-jdk8] [INFO] run post-build script verify.bsh
[linux-jdk8] [INFO]           dependency-properties/pom.xml .................... SUCCESS (5.3
s)
[linux-jdk8] [INFO] Building: unpack-cli/pom.xml
[linux-jdk8] [INFO] run post-build script verify.bsh
[linux-jdk8] [INFO]           unpack-cli/pom.xml ............................... SUCCESS (5.1
s)
[linux-jdk8] [INFO] Building: get-artifact/pom.xml
[linux-jdk8] [INFO] run pre-build script setup.bsh
[linux-jdk9] [INFO] run post-build script verify.bsh
[linux-jdk9] [INFO]           build-classpath-output-file-and-property/pom.xml . SUCCESS (6.7
s)
[linux-jdk9] [INFO] Building: mdep-578_display-reason-invalid-module/pom.xml
[linux-jdk8] [INFO] run post-build script verify.bsh
[linux-jdk8] [INFO]           get-artifact/pom.xml ............................. SUCCESS (4.8
s)
[linux-jdk8] [INFO] Building: analyze-multimodule-project/pom.xml
[linux-jdk9] [INFO] run post-build script verify.groovy
[linux-jdk9] [INFO]           mdep-578_display-reason-invalid-module/pom.xml ... SUCCESS (5.2
s)
[linux-jdk9] [INFO] Building: go-offline/pom.xml
[linux-jdk8] [INFO]           analyze-multimodule-project/pom.xml .............. SUCCESS (6.9
s)
[linux-jdk8] [INFO] Building: filterunpack/pom.xml
[linux-jdk9] [INFO]           go-offline/pom.xml ............................... SUCCESS (5.9
s)
[linux-jdk9] [INFO] Building: unpack-from-remote-repository/pom.xml
[linux-jdk9] [INFO] run pre-build script setup.bsh
[linux-jdk8] [INFO] run post-build script verify.groovy
[linux-jdk8] [INFO]           filterunpack/pom.xml ............................. SUCCESS (4.9
s)
[linux-jdk8] [INFO] Building: mdep-506-dependency-without-version-in-depmgt/pom.xml
[linux-jdk9] [INFO] artifact org.apache.maven.its.dependency.fake-remote-unpack:1.0: checking
for updates from central
[linux-jdk9] [INFO] org.apache.maven.its.dependency.fake-remote-unpack.1.0: checking for updates
from central
[linux-jdk9] [INFO] run post-build script verify.bsh
[linux-jdk9] [INFO]           unpack-from-remote-repository/pom.xml ............ SUCCESS (6.0
s)
[linux-jdk9] [INFO] Building: mdep-571-resolve-java9/pom.xml
[linux-jdk8] [INFO]           mdep-506-dependency-without-version-in-depmgt/pom.xml SUCCESS
(6.1 s)
[linux-jdk8] [INFO] Building: get-artifact-no-transitive/pom.xml
[linux-jdk8] [INFO] run pre-build script setup.bsh
[linux-jdk9] [INFO] run post-build script verify.groovy
[linux-jdk9] [INFO]           mdep-571-resolve-java9/pom.xml ................... SUCCESS (5.1
s)
[linux-jdk9] [INFO] Building: purge-local-repository-non-transitive/pom.xml
[linux-jdk8] [INFO] run post-build script verify.bsh
[linux-jdk8] [INFO]           get-artifact-no-transitive/pom.xml ............... SUCCESS (4.7
s)
[linux-jdk8] [INFO] Building: purge-local-repository-without-pom
[linux-jdk8] [INFO] run pre-build script setup.bsh
[linux-jdk9] [INFO] run post-build script verify.bsh
[linux-jdk9] [INFO]           purge-local-repository-non-transitive/pom.xml .... SUCCESS (4.8
s)
[linux-jdk9] [INFO] Building: copy-dependencies/pom.xml
[linux-jdk8] [INFO] run post-build script verify.bsh
[linux-jdk8] [INFO]           purge-local-repository-without-pom ............... SUCCESS (4.6
s)
[linux-jdk8] [INFO] 
[linux-jdk8] [INFO] --- mrm-maven-plugin:1.0.0:stop (default) @ maven-dependency-plugin ---
[linux-jdk8] [INFO] Stopping Mock Repository Manager on http://localhost:44549
[linux-jdk8] [INFO] Mock Repository Manager http://localhost:44549 is stopped.
[linux-jdk8] [INFO] 
[linux-jdk8] [INFO] --- maven-checkstyle-plugin:3.0.0:check (checkstyle-check) @ maven-dependency-plugin
---
[linux-jdk8] [INFO] Downloading from central: https://repo.maven.apache.org/maven2/org/apache/maven/shared/maven-shared-resources/2/maven-shared-resources-2.pom
[linux-jdk8] [INFO] Downloaded from central: https://repo.maven.apache.org/maven2/org/apache/maven/shared/maven-shared-resources/2/maven-shared-resources-2.pom
(3.0 kB at 197 kB/s)
[linux-jdk8] [INFO] Downloading from central: https://repo.maven.apache.org/maven2/org/apache/maven/doxia/doxia-integration-tools/1.6/doxia-integration-tools-1.6.pom
[linux-jdk8] [INFO] Downloaded from central: https://repo.maven.apache.org/maven2/org/apache/maven/doxia/doxia-integration-tools/1.6/doxia-integration-tools-1.6.pom
(7.0 kB at 580 kB/s)
[linux-jdk8] [INFO] Downloading from central: https://repo.maven.apache.org/maven2/org/apache/maven/doxia/doxia-tools/3/doxia-tools-3.pom
[linux-jdk8] [INFO] Downloaded from central: https://repo.maven.apache.org/maven2/org/apache/maven/doxia/doxia-tools/3/doxia-tools-3.pom
(9.9 kB at 827 kB/s)
[linux-jdk8] [INFO] Downloading from central: https://repo.maven.apache.org/maven2/org/codehaus/plexus/plexus-resources/1.1.0/plexus-resources-1.1.0.pom
[linux-jdk8] [INFO] Downloaded from central: https://repo.maven.apache.org/maven2/org/codehaus/plexus/plexus-resources/1.1.0/plexus-resources-1.1.0.pom
(3.2 kB at 265 kB/s)
[linux-jdk8] [INFO] Downloading from central: https://repo.maven.apache.org/maven2/com/puppycrawl/tools/checkstyle/6.18/checkstyle-6.18.pom
[linux-jdk8] [INFO] Downloaded from central: https://repo.maven.apache.org/maven2/com/puppycrawl/tools/checkstyle/6.18/checkstyle-6.18.pom
(71 kB at 3.6 MB/s)
[linux-jdk8] [INFO] Downloading from central: https://repo.maven.apache.org/maven2/antlr/antlr/2.7.7/antlr-2.7.7.pom
[linux-jdk8] [INFO] Downloaded from central: https://repo.maven.apache.org/maven2/antlr/antlr/2.7.7/antlr-2.7.7.pom
(632 B at 57 kB/s)
[linux-jdk8] [INFO] Downloading from central: https://repo.maven.apache.org/maven2/org/antlr/antlr4-runtime/4.5.3/antlr4-runtime-4.5.3.pom
[linux-jdk8] [INFO] Downloaded from central: https://repo.maven.apache.org/maven2/org/antlr/antlr4-runtime/4.5.3/antlr4-runtime-4.5.3.pom
(2.3 kB at 210 kB/s)
[linux-jdk8] [INFO] Downloading from central: https://repo.maven.apache.org/maven2/org/antlr/antlr4-master/4.5.3/antlr4-master-4.5.3.pom
[linux-jdk8] [INFO] Downloaded from central: https://repo.maven.apache.org/maven2/org/antlr/antlr4-master/4.5.3/antlr4-master-4.5.3.pom
(3.7 kB at 335 kB/s)
[linux-jdk8] [INFO] Downloading from central: https://repo.maven.apache.org/maven2/commons-beanutils/commons-beanutils/1.9.2/commons-beanutils-1.9.2.pom
[linux-jdk8] [INFO] Downloaded from central: https://repo.maven.apache.org/maven2/commons-beanutils/commons-beanutils/1.9.2/commons-beanutils-1.9.2.pom
(14 kB at 1.3 MB/s)
[linux-jdk8] [INFO] Downloading from central: https://repo.maven.apache.org/maven2/commons-cli/commons-cli/1.3.1/commons-cli-1.3.1.pom
[linux-jdk8] [INFO] Downloaded from central: https://repo.maven.apache.org/maven2/commons-cli/commons-cli/1.3.1/commons-cli-1.3.1.pom
(10 kB at 866 kB/s)
[linux-jdk8] [INFO] Downloading from central: https://repo.maven.apache.org/maven2/com/google/guava/guava/19.0/guava-19.0.pom
[linux-jdk8] [INFO] Downloaded from central: https://repo.maven.apache.org/maven2/com/google/guava/guava/19.0/guava-19.0.pom
(6.8 kB at 617 kB/s)
[linux-jdk8] [INFO] Downloading from central: https://repo.maven.apache.org/maven2/com/google/guava/guava-parent/19.0/guava-parent-19.0.pom
[linux-jdk8] [INFO] Downloaded from central: https://repo.maven.apache.org/maven2/com/google/guava/guava-parent/19.0/guava-parent-19.0.pom
(9.9 kB at 898 kB/s)
[linux-jdk8] [INFO] Downloading from central: https://repo.maven.apache.org/maven2/org/sonatype/oss/oss-parent/7/oss-parent-7.pom
[linux-jdk8] [INFO] Downloaded from central: https://repo.maven.apache.org/maven2/org/sonatype/oss/oss-parent/7/oss-parent-7.pom
(4.8 kB at 482 kB/s)
[linux-jdk8] [INFO] Downloading from central: https://repo.maven.apache.org/maven2/org/apache/maven/shared/maven-shared-resources/2/maven-shared-resources-2.jar
[linux-jdk8] [INFO] Downloading from central: https://repo.maven.apache.org/maven2/org/apache/maven/doxia/doxia-integration-tools/1.6/doxia-integration-tools-1.6.jar
[linux-jdk8] [INFO] Downloading from central: https://repo.maven.apache.org/maven2/org/codehaus/plexus/plexus-resources/1.1.0/plexus-resources-1.1.0.jar
[linux-jdk8] [INFO] Downloading from central: https://repo.maven.apache.org/maven2/com/puppycrawl/tools/checkstyle/6.18/checkstyle-6.18.jar
[linux-jdk8] [INFO] Downloading from central: https://repo.maven.apache.org/maven2/antlr/antlr/2.7.7/antlr-2.7.7.jar
[linux-jdk8] [INFO] Downloaded from central: https://repo.maven.apache.org/maven2/org/apache/maven/shared/maven-shared-resources/2/maven-shared-resources-2.jar
(13 kB at 933 kB/s)
[linux-jdk8] [INFO] Downloading from central: https://repo.maven.apache.org/maven2/org/antlr/antlr4-runtime/4.5.3/antlr4-runtime-4.5.3.jar
[linux-jdk8] [INFO] Downloaded from central: https://repo.maven.apache.org/maven2/org/apache/maven/doxia/doxia-integration-tools/1.6/doxia-integration-tools-1.6.jar
(45 kB at 2.6 MB/s)
[linux-jdk8] [INFO] Downloading from central: https://repo.maven.apache.org/maven2/commons-beanutils/commons-beanutils/1.9.2/commons-beanutils-1.9.2.jar
[linux-jdk8] [INFO] Downloaded from central: https://repo.maven.apache.org/maven2/org/codehaus/plexus/plexus-resources/1.1.0/plexus-resources-1.1.0.jar
(23 kB at 1.5 MB/s)
[linux-jdk8] [INFO] Downloading from central: https://repo.maven.apache.org/maven2/commons-cli/commons-cli/1.3.1/commons-cli-1.3.1.jar
[linux-jdk8] [INFO] Downloaded from central: https://repo.maven.apache.org/maven2/commons-cli/commons-cli/1.3.1/commons-cli-1.3.1.jar
(53 kB at 1.8 MB/s)
[linux-jdk8] [INFO] Downloading from central: https://repo.maven.apache.org/maven2/com/google/guava/guava/19.0/guava-19.0.jar
[linux-jdk8] [INFO] Downloaded from central: https://repo.maven.apache.org/maven2/commons-beanutils/commons-beanutils/1.9.2/commons-beanutils-1.9.2.jar
(234 kB at 6.3 MB/s)
[linux-jdk8] [INFO] Downloaded from central: https://repo.maven.apache.org/maven2/antlr/antlr/2.7.7/antlr-2.7.7.jar
(445 kB at 12 MB/s)
[linux-jdk8] [INFO] Downloaded from central: https://repo.maven.apache.org/maven2/org/antlr/antlr4-runtime/4.5.3/antlr4-runtime-4.5.3.jar
(302 kB at 6.6 MB/s)
[linux-jdk8] [INFO] Downloaded from central: https://repo.maven.apache.org/maven2/com/puppycrawl/tools/checkstyle/6.18/checkstyle-6.18.jar
(1.2 MB at 14 MB/s)
[linux-jdk8] [INFO] Downloaded from central: https://repo.maven.apache.org/maven2/com/google/guava/guava/19.0/guava-19.0.jar
(2.3 MB at 14 MB/s)
[linux-jdk8] [INFO] There is 1 error reported by Checkstyle 6.18 with config/maven_checks.xml
ruleset.
[linux-jdk8] [INFO] Ignored 1 error, 0 violation remaining.
[linux-jdk8] [INFO] 
[linux-jdk8] [INFO] --- maven-invoker-plugin:3.0.1:verify (integration-test) @ maven-dependency-plugin
---
[linux-jdk8] [INFO] -------------------------------------------------
[linux-jdk8] [INFO] Build Summary:
[linux-jdk8] [INFO]   Passed: 53, Failed: 0, Errors: 0, Skipped: 5
[linux-jdk8] [INFO] -------------------------------------------------
[linux-jdk8] [INFO] ------------------------------------------------------------------------
[linux-jdk8] [INFO] BUILD SUCCESS
[linux-jdk8] [INFO] ------------------------------------------------------------------------
[linux-jdk8] [INFO] Total time: 21:05 min
[linux-jdk8] [INFO] Finished at: 2018-04-02T11:13:00Z
[linux-jdk9] [INFO] run post-build script verify.bsh
[linux-jdk9] [INFO]           copy-dependencies/pom.xml ........................ SUCCESS (5.6
s)
[linux-jdk9] [INFO] Building: dependency-properties/pom.xml
[linux-jdk8] [INFO] Final Memory: 68M/2349M
[linux-jdk8] [INFO] ------------------------------------------------------------------------
[linux-jdk8] [INFO] [jenkins-event-spy] Generated /home/jenkins/jenkins-slave/workspace/-dependency-plugin_MDEP-604-AWP7DREICFLLBGPZGQNAMZ5QMQWASKDP6554RNLNMNFTR2HSS22A@tmp/withMaven278a8715/maven-spy-20180402-105154-417204537751717375333.log
[Pipeline] [linux-jdk8] }
[Pipeline] [linux-jdk8] // dir
[Pipeline] [linux-jdk8] }
[linux-jdk8] [withMaven] junitPublisher - Archive test results for Maven artifact org.apache.maven.plugins:maven-dependency-plugin:3.1.0-SNAPSHOT
generated by maven-surefire-plugin:test (default-test): m/target/surefire-reports/*.xml
[linux-jdk8] [withMaven] junitPublisher - Jenkins JUnit Attachments Plugin not found, can't
publish test attachments.Recording test results
[Pipeline] [linux-jdk8] // withMaven
[Pipeline] [linux-jdk8] }
[Pipeline] [linux-jdk8] // stage
[Pipeline] [linux-jdk8] }
[Pipeline] [linux-jdk8] // node
[Pipeline] [linux-jdk8] }
[linux-jdk9] [INFO] run post-build script verify.bsh
[linux-jdk9] [INFO]           dependency-properties/pom.xml .................... SUCCESS (5.0
s)
[linux-jdk9] [INFO] Building: unpack-cli/pom.xml
[linux-jdk9] [INFO] run post-build script verify.bsh
[linux-jdk9] [INFO]           unpack-cli/pom.xml ............................... SUCCESS (4.6
s)
[linux-jdk9] [INFO] Building: get-artifact/pom.xml
[linux-jdk9] [INFO] run pre-build script setup.bsh
[linux-jdk9] [INFO] run post-build script verify.bsh
[linux-jdk9] [INFO]           get-artifact/pom.xml ............................. SUCCESS (4.7
s)
[linux-jdk9] [INFO] Building: analyze-multimodule-project/pom.xml
[linux-jdk9] [INFO]           analyze-multimodule-project/pom.xml .............. SUCCESS (7.0
s)
[linux-jdk9] [INFO] Building: filterunpack/pom.xml
[linux-jdk9] [INFO] run post-build script verify.groovy
[linux-jdk9] [INFO]           filterunpack/pom.xml ............................. SUCCESS (4.8
s)
[linux-jdk9] [INFO] Building: mdep-506-dependency-without-version-in-depmgt/pom.xml
[linux-jdk9] [INFO]           mdep-506-dependency-without-version-in-depmgt/pom.xml SUCCESS
(5.8 s)
[linux-jdk9] [INFO] Building: get-artifact-no-transitive/pom.xml
[linux-jdk9] [INFO] run pre-build script setup.bsh
[linux-jdk9] [INFO] run post-build script verify.bsh
[linux-jdk9] [INFO]           get-artifact-no-transitive/pom.xml ............... SUCCESS (4.7
s)
[linux-jdk9] [INFO] Building: purge-local-repository-without-pom
[linux-jdk9] [INFO] run pre-build script setup.bsh
[linux-jdk9] [INFO] run post-build script verify.bsh
[linux-jdk9] [INFO]           purge-local-repository-without-pom ............... SUCCESS (4.8
s)
[linux-jdk9] [INFO] 
[linux-jdk9] [INFO] --- mrm-maven-plugin:1.0.0:stop (default) @ maven-dependency-plugin ---
[linux-jdk9] [INFO] Stopping Mock Repository Manager on http://localhost:38707
[linux-jdk9] [INFO] Mock Repository Manager http://localhost:38707 is stopped.
[linux-jdk9] [INFO] 
[linux-jdk9] [INFO] --- maven-checkstyle-plugin:3.0.0:check (checkstyle-check) @ maven-dependency-plugin
---
[linux-jdk9] [INFO] Downloading from central: https://repo.maven.apache.org/maven2/org/apache/maven/shared/maven-shared-resources/2/maven-shared-resources-2.pom
[linux-jdk9] [INFO] Downloaded from central: https://repo.maven.apache.org/maven2/org/apache/maven/shared/maven-shared-resources/2/maven-shared-resources-2.pom
(3.0 kB at 185 kB/s)
[linux-jdk9] [INFO] Downloading from central: https://repo.maven.apache.org/maven2/org/apache/maven/doxia/doxia-integration-tools/1.6/doxia-integration-tools-1.6.pom
[linux-jdk9] [INFO] Downloaded from central: https://repo.maven.apache.org/maven2/org/apache/maven/doxia/doxia-integration-tools/1.6/doxia-integration-tools-1.6.pom
(7.0 kB at 580 kB/s)
[linux-jdk9] [INFO] Downloading from central: https://repo.maven.apache.org/maven2/org/apache/maven/doxia/doxia-tools/3/doxia-tools-3.pom
[linux-jdk9] [INFO] Downloaded from central: https://repo.maven.apache.org/maven2/org/apache/maven/doxia/doxia-tools/3/doxia-tools-3.pom
(9.9 kB at 827 kB/s)
[linux-jdk9] [INFO] Downloading from central: https://repo.maven.apache.org/maven2/org/codehaus/plexus/plexus-resources/1.1.0/plexus-resources-1.1.0.pom
[linux-jdk9] [INFO] Downloaded from central: https://repo.maven.apache.org/maven2/org/codehaus/plexus/plexus-resources/1.1.0/plexus-resources-1.1.0.pom
(3.2 kB at 289 kB/s)
[linux-jdk9] [INFO] Downloading from central: https://repo.maven.apache.org/maven2/com/puppycrawl/tools/checkstyle/6.18/checkstyle-6.18.pom
[linux-jdk9] [INFO] Downloaded from central: https://repo.maven.apache.org/maven2/com/puppycrawl/tools/checkstyle/6.18/checkstyle-6.18.pom
(71 kB at 5.1 MB/s)
[linux-jdk9] [INFO] Downloading from central: https://repo.maven.apache.org/maven2/antlr/antlr/2.7.7/antlr-2.7.7.pom
[linux-jdk9] [INFO] Downloaded from central: https://repo.maven.apache.org/maven2/antlr/antlr/2.7.7/antlr-2.7.7.pom
(632 B at 57 kB/s)
[linux-jdk9] [INFO] Downloading from central: https://repo.maven.apache.org/maven2/org/antlr/antlr4-runtime/4.5.3/antlr4-runtime-4.5.3.pom
[linux-jdk9] [INFO] Downloaded from central: https://repo.maven.apache.org/maven2/org/antlr/antlr4-runtime/4.5.3/antlr4-runtime-4.5.3.pom
(2.3 kB at 210 kB/s)
[linux-jdk9] [INFO] Downloading from central: https://repo.maven.apache.org/maven2/org/antlr/antlr4-master/4.5.3/antlr4-master-4.5.3.pom
[linux-jdk9] [INFO] Downloaded from central: https://repo.maven.apache.org/maven2/org/antlr/antlr4-master/4.5.3/antlr4-master-4.5.3.pom
(3.7 kB at 368 kB/s)
[linux-jdk9] [INFO] Downloading from central: https://repo.maven.apache.org/maven2/commons-beanutils/commons-beanutils/1.9.2/commons-beanutils-1.9.2.pom
[linux-jdk9] [INFO] Downloaded from central: https://repo.maven.apache.org/maven2/commons-beanutils/commons-beanutils/1.9.2/commons-beanutils-1.9.2.pom
(14 kB at 1.3 MB/s)
[linux-jdk9] [INFO] Downloading from central: https://repo.maven.apache.org/maven2/commons-cli/commons-cli/1.3.1/commons-cli-1.3.1.pom
[linux-jdk9] [INFO] Downloaded from central: https://repo.maven.apache.org/maven2/commons-cli/commons-cli/1.3.1/commons-cli-1.3.1.pom
(10 kB at 945 kB/s)
[linux-jdk9] [INFO] Downloading from central: https://repo.maven.apache.org/maven2/com/google/guava/guava/19.0/guava-19.0.pom
[linux-jdk9] [INFO] Downloaded from central: https://repo.maven.apache.org/maven2/com/google/guava/guava/19.0/guava-19.0.pom
(6.8 kB at 679 kB/s)
[linux-jdk9] [INFO] Downloading from central: https://repo.maven.apache.org/maven2/com/google/guava/guava-parent/19.0/guava-parent-19.0.pom
[linux-jdk9] [INFO] Downloaded from central: https://repo.maven.apache.org/maven2/com/google/guava/guava-parent/19.0/guava-parent-19.0.pom
(9.9 kB at 898 kB/s)
[linux-jdk9] [INFO] Downloading from central: https://repo.maven.apache.org/maven2/org/sonatype/oss/oss-parent/7/oss-parent-7.pom
[linux-jdk9] [INFO] Downloaded from central: https://repo.maven.apache.org/maven2/org/sonatype/oss/oss-parent/7/oss-parent-7.pom
(4.8 kB at 482 kB/s)
[linux-jdk9] [INFO] Downloading from central: https://repo.maven.apache.org/maven2/javax/xml/bind/jaxb-api/2.3.0/jaxb-api-2.3.0.pom
[linux-jdk9] [INFO] Downloaded from central: https://repo.maven.apache.org/maven2/javax/xml/bind/jaxb-api/2.3.0/jaxb-api-2.3.0.pom
(23 kB at 1.8 MB/s)
[linux-jdk9] [INFO] Downloading from central: https://repo.maven.apache.org/maven2/javax/xml/bind/jaxb-api-parent/2.3.0/jaxb-api-parent-2.3.0.pom
[linux-jdk9] [INFO] Downloaded from central: https://repo.maven.apache.org/maven2/javax/xml/bind/jaxb-api-parent/2.3.0/jaxb-api-parent-2.3.0.pom
(5.6 kB at 470 kB/s)
[linux-jdk9] [INFO] Downloading from central: https://repo.maven.apache.org/maven2/net/java/jvnet-parent/5/jvnet-parent-5.pom
[linux-jdk9] [INFO] Downloaded from central: https://repo.maven.apache.org/maven2/net/java/jvnet-parent/5/jvnet-parent-5.pom
(8.9 kB at 739 kB/s)
[linux-jdk9] [INFO] Downloading from central: https://repo.maven.apache.org/maven2/org/apache/maven/shared/maven-shared-resources/2/maven-shared-resources-2.jar
[linux-jdk9] [INFO] Downloading from central: https://repo.maven.apache.org/maven2/org/apache/maven/doxia/doxia-integration-tools/1.6/doxia-integration-tools-1.6.jar
[linux-jdk9] [INFO] Downloading from central: https://repo.maven.apache.org/maven2/org/codehaus/plexus/plexus-resources/1.1.0/plexus-resources-1.1.0.jar
[linux-jdk9] [INFO] Downloading from central: https://repo.maven.apache.org/maven2/com/puppycrawl/tools/checkstyle/6.18/checkstyle-6.18.jar
[linux-jdk9] [INFO] Downloading from central: https://repo.maven.apache.org/maven2/antlr/antlr/2.7.7/antlr-2.7.7.jar
[linux-jdk9] [INFO] Downloaded from central: https://repo.maven.apache.org/maven2/org/apache/maven/shared/maven-shared-resources/2/maven-shared-resources-2.jar
(13 kB at 725 kB/s)
[linux-jdk9] [INFO] Downloading from central: https://repo.maven.apache.org/maven2/org/antlr/antlr4-runtime/4.5.3/antlr4-runtime-4.5.3.jar
[linux-jdk9] [INFO] Downloaded from central: https://repo.maven.apache.org/maven2/org/codehaus/plexus/plexus-resources/1.1.0/plexus-resources-1.1.0.jar
(23 kB at 1.3 MB/s)
[linux-jdk9] [INFO] Downloading from central: https://repo.maven.apache.org/maven2/commons-beanutils/commons-beanutils/1.9.2/commons-beanutils-1.9.2.jar
[linux-jdk9] [INFO] Downloaded from central: https://repo.maven.apache.org/maven2/org/apache/maven/doxia/doxia-integration-tools/1.6/doxia-integration-tools-1.6.jar
(45 kB at 2.1 MB/s)
[linux-jdk9] [INFO] Downloading from central: https://repo.maven.apache.org/maven2/commons-cli/commons-cli/1.3.1/commons-cli-1.3.1.jar
[linux-jdk9] [INFO] Downloaded from central: https://repo.maven.apache.org/maven2/commons-cli/commons-cli/1.3.1/commons-cli-1.3.1.jar
(53 kB at 1.7 MB/s)
[linux-jdk9] [INFO] Downloading from central: https://repo.maven.apache.org/maven2/com/google/guava/guava/19.0/guava-19.0.jar
[linux-jdk9] [INFO] Downloaded from central: https://repo.maven.apache.org/maven2/org/antlr/antlr4-runtime/4.5.3/antlr4-runtime-4.5.3.jar
(302 kB at 8.2 MB/s)
[linux-jdk9] [INFO] Downloading from central: https://repo.maven.apache.org/maven2/javax/xml/bind/jaxb-api/2.3.0/jaxb-api-2.3.0.jar
[linux-jdk9] [INFO] Downloaded from central: https://repo.maven.apache.org/maven2/commons-beanutils/commons-beanutils/1.9.2/commons-beanutils-1.9.2.jar
(234 kB at 6.2 MB/s)
[linux-jdk9] [INFO] Downloaded from central: https://repo.maven.apache.org/maven2/antlr/antlr/2.7.7/antlr-2.7.7.jar
(445 kB at 10 MB/s)
[linux-jdk9] [INFO] Downloaded from central: https://repo.maven.apache.org/maven2/javax/xml/bind/jaxb-api/2.3.0/jaxb-api-2.3.0.jar
(126 kB at 2.5 MB/s)
[linux-jdk9] [INFO] Downloaded from central: https://repo.maven.apache.org/maven2/com/puppycrawl/tools/checkstyle/6.18/checkstyle-6.18.jar
(1.2 MB at 19 MB/s)
[linux-jdk9] [INFO] Downloaded from central: https://repo.maven.apache.org/maven2/com/google/guava/guava/19.0/guava-19.0.jar
(2.3 MB at 19 MB/s)
[linux-jdk9] [INFO] There is 1 error reported by Checkstyle 6.18 with config/maven_checks.xml
ruleset.
[linux-jdk9] [INFO] Ignored 1 error, 0 violation remaining.
[linux-jdk9] [INFO] 
[linux-jdk9] [INFO] --- maven-invoker-plugin:3.0.1:verify (integration-test) @ maven-dependency-plugin
---
[linux-jdk9] [INFO] -------------------------------------------------
[linux-jdk9] [INFO] Build Summary:
[linux-jdk9] [INFO]   Passed: 57, Failed: 0, Errors: 0, Skipped: 1
[linux-jdk9] [INFO] -------------------------------------------------
[linux-jdk9] [INFO] ------------------------------------------------------------------------
[linux-jdk9] [INFO] BUILD SUCCESS
[linux-jdk9] [INFO] ------------------------------------------------------------------------
[linux-jdk9] [INFO] Total time: 21:47 min
[linux-jdk9] [INFO] Finished at: 2018-04-02T11:13:43Z
[linux-jdk9] [INFO] Final Memory: 57M/188M
[linux-jdk9] [INFO] ------------------------------------------------------------------------
[linux-jdk9] [INFO] [jenkins-event-spy] Generated /home/jenkins/jenkins-slave/workspace/-dependency-plugin_MDEP-604-AWP7DREICFLLBGPZGQNAMZ5QMQWASKDP6554RNLNMNFTR2HSS22A@2@tmp/withMaven95b08d5e/maven-spy-20180402-105155-99613141312023902771521.log
[Pipeline] [linux-jdk9] }
[Pipeline] [linux-jdk9] // dir
[Pipeline] [linux-jdk9] }
[linux-jdk9] [withMaven] junitPublisher - Archive test results for Maven artifact org.apache.maven.plugins:maven-dependency-plugin:3.1.0-SNAPSHOT
generated by maven-surefire-plugin:test (default-test): m/target/surefire-reports/*.xml
[linux-jdk9] [withMaven] junitPublisher - Jenkins JUnit Attachments Plugin not found, can't
publish test attachments.Recording test results
[Pipeline] [linux-jdk9] // withMaven
[Pipeline] [linux-jdk9] }
[Pipeline] [linux-jdk9] // stage
[Pipeline] [linux-jdk9] }
[Pipeline] [linux-jdk9] // node
[Pipeline] [linux-jdk9] }
[Pipeline] // parallel
[Pipeline] stage
[Pipeline] { (Notifications)
[Pipeline] echo
Build result: UNSTABLE
[Pipeline] jiraIssueSelector
[Pipeline] emailext
Mime
  • Unnamed multipart/mixed (inline, None, 0 bytes)
View raw message