maven-notifications mailing list archives

Site index · List index
Message view « Date » · « Thread »
Top « Date » · « Thread »
From Apache Jenkins Server <jenk...@builds.apache.org>
Subject Build failed in Jenkins: Maven TLP » maven-site-plugin » master #34
Date Mon, 23 Apr 2018 17:41:15 GMT
See https://builds.apache.org/job/maven-box/job/maven-site-plugin/job/master/34/

Changes:

* [MSITE-819] removed confusing locale information in message
* [MSITE-819] removed confusing locale information in message

No tests ran.

Build log:
[...truncated 115.19 KB...]
[Pipeline] [windows-jdk10] // node
[windows-jdk7] [INFO] Building jar: f:\jenkins\jenkins-slave\workspace\ox_maven-site-plugin_master-LZWAKOPRMO5JAZW5HRA2IQ56LLTFU3PLKDIE2JNFFXEGASBYKK3Q\m\target\maven-site-plugin-3.7.1-SNAPSHOT.jar
[Pipeline] [windows-jdk10] }
[windows-jdk10] Failed in branch windows-jdk10
[windows-jdk8] [INFO] Installing f:\jenkins\jenkins-slave\workspace\ox_maven-site-plugin_master-LZWAKOPRMO5JAZW5HRA2IQ56LLTFU3PLKDIE2JNFFXEGASBYKK3Q\m\dependency-reduced-pom.xml
to f:\jenkins\jenkins-slave\workspace\ox_maven-site-plugin_master-LZWAKOPRMO5JAZW5HRA2IQ56LLTFU3PLKDIE2JNFFXEGASBYKK3Q\m\target\local-repo\org\apache\maven\plugins\maven-site-plugin\3.7.1-SNAPSHOT\maven-site-plugin-3.7.1-SNAPSHOT.pom
[windows-jdk8] [INFO] Installing f:\jenkins\jenkins-slave\workspace\ox_maven-site-plugin_master-LZWAKOPRMO5JAZW5HRA2IQ56LLTFU3PLKDIE2JNFFXEGASBYKK3Q\m\target\maven-site-plugin-3.7.1-SNAPSHOT.jar
to f:\jenkins\jenkins-slave\workspace\ox_maven-site-plugin_master-LZWAKOPRMO5JAZW5HRA2IQ56LLTFU3PLKDIE2JNFFXEGASBYKK3Q\m\target\local-repo\org\apache\maven\plugins\maven-site-plugin\3.7.1-SNAPSHOT\maven-site-plugin-3.7.1-SNAPSHOT.jar
[windows-jdk8] [INFO] 
[windows-jdk8] [INFO] --- maven-invoker-plugin:3.0.1:integration-test (integration-test) @
maven-site-plugin ---
[windows-jdk7] Sending interrupt signal to process
[windows-jdk7] [INFO] 
[windows-jdk7] [INFO] --- maven-plugin-plugin:3.5.1:addPluginArtifactMetadata (default-addPluginArtifactMetadata)
@ maven-site-plugin ---
[windows-jdk7] [INFO] 
[windows-jdk7] [INFO] --- maven-shade-plugin:1.4:shade (default) @ maven-site-plugin ---
[windows-jdk7] [INFO] Including org.apache.maven.reporting:maven-reporting-api:jar:3.0 in
the shaded jar.
[windows-jdk7] [INFO] Excluding org.apache.maven.reporting:maven-reporting-exec:jar:1.4 from
the shaded jar.
[windows-jdk7] [INFO] Excluding org.sonatype.aether:aether-util:jar:1.7 from the shaded jar.
[windows-jdk7] [INFO] Excluding org.eclipse.aether:aether-util:jar:0.9.0.M2 from the shaded
jar.
[windows-jdk7] [INFO] Excluding org.apache.maven.shared:maven-shared-utils:jar:3.1.0 from
the shaded jar.
[windows-jdk7] [INFO] Including org.apache.maven:maven-artifact:jar:3.0 in the shaded jar.
[windows-jdk7] [INFO] Excluding org.apache.maven:maven-model-builder:jar:3.0 from the shaded
jar.
[windows-jdk7] [INFO] Excluding org.codehaus.plexus:plexus-interpolation:jar:1.14 from the
shaded jar.
[windows-jdk7] [INFO] Excluding org.codehaus.plexus:plexus-component-annotations:jar:1.7.1
from the shaded jar.
[windows-jdk7] [INFO] Excluding org.apache.maven:maven-core:jar:3.0 from the shaded jar.
[windows-jdk7] [INFO] Excluding org.apache.maven:maven-repository-metadata:jar:3.0 from the
shaded jar.
[windows-jdk7] [INFO] Excluding org.apache.maven:maven-aether-provider:jar:3.0 from the shaded
jar.
[windows-jdk7] [INFO] Excluding org.sonatype.aether:aether-impl:jar:1.7 from the shaded jar.
[windows-jdk7] [INFO] Excluding org.sonatype.aether:aether-spi:jar:1.7 from the shaded jar.
[windows-jdk7] [INFO] Excluding org.sonatype.aether:aether-api:jar:1.7 from the shaded jar.
[windows-jdk7] [INFO] Excluding org.sonatype.plexus:plexus-sec-dispatcher:jar:1.3 from the
shaded jar.
[windows-jdk7] [INFO] Excluding org.sonatype.plexus:plexus-cipher:jar:1.4 from the shaded
jar.
[windows-jdk7] [INFO] Excluding org.apache.maven:maven-model:jar:3.0 from the shaded jar.
[windows-jdk7] [INFO] Excluding org.apache.maven:maven-plugin-api:jar:3.0 from the shaded
jar.
[windows-jdk7] [INFO] Excluding org.apache.maven:maven-settings:jar:3.0 from the shaded jar.
[windows-jdk7] [INFO] Excluding org.apache.maven:maven-settings-builder:jar:3.0 from the shaded
jar.
[windows-jdk7] [INFO] Excluding org.apache.maven:maven-archiver:jar:3.1.1 from the shaded
jar.
[windows-jdk7] [INFO] Excluding org.sonatype.sisu:sisu-inject-plexus:jar:1.4.2 from the shaded
jar.
[windows-jdk7] [INFO] Excluding org.sonatype.sisu:sisu-inject-bean:jar:1.4.2 from the shaded
jar.
[windows-jdk7] [INFO] Excluding org.sonatype.sisu:sisu-guice:jar:noaop:2.1.7 from the shaded
jar.
[windows-jdk7] [INFO] Excluding org.codehaus.plexus:plexus-archiver:jar:3.4 from the shaded
jar.
[windows-jdk7] [INFO] Excluding org.codehaus.plexus:plexus-io:jar:2.7.1 from the shaded jar.
[windows-jdk7] [INFO] Excluding org.apache.commons:commons-compress:jar:1.11 from the shaded
jar.
[windows-jdk7] [INFO] Excluding org.iq80.snappy:snappy:jar:0.4 from the shaded jar.
[windows-jdk7] [INFO] Excluding org.tukaani:xz:jar:1.5 from the shaded jar.
[windows-jdk7] [INFO] Excluding org.codehaus.plexus:plexus-i18n:jar:1.0-beta-10 from the shaded
jar.
[windows-jdk7] [INFO] Excluding org.codehaus.plexus:plexus-utils:jar:3.0.24 from the shaded
jar.
[windows-jdk7] [INFO] Excluding org.codehaus.plexus:plexus-classworlds:jar:2.5.2 from the
shaded jar.
[windows-jdk7] [INFO] Excluding org.apache.maven.doxia:doxia-sink-api:jar:1.8 from the shaded
jar.
[windows-jdk7] [INFO] Excluding org.apache.maven.doxia:doxia-logging-api:jar:1.8 from the
shaded jar.
[windows-jdk7] [INFO] Excluding org.apache.maven.doxia:doxia-module-xhtml:jar:1.8 from the
shaded jar.
[windows-jdk7] [INFO] Excluding org.apache.maven.doxia:doxia-core:jar:1.8 from the shaded
jar.
[windows-jdk7] [INFO] Excluding org.apache.httpcomponents:httpclient:jar:4.0.2 from the shaded
jar.
[windows-jdk7] [INFO] Excluding commons-codec:commons-codec:jar:1.3 from the shaded jar.
[windows-jdk7] [INFO] Excluding org.apache.httpcomponents:httpcore:jar:4.0.1 from the shaded
jar.
[windows-jdk7] [INFO] Excluding org.apache.maven.doxia:doxia-module-apt:jar:1.8 from the shaded
jar.
[windows-jdk7] [INFO] Excluding org.apache.maven.doxia:doxia-module-xdoc:jar:1.8 from the
shaded jar.
[windows-jdk7] [INFO] Excluding org.apache.maven.doxia:doxia-module-fml:jar:1.8 from the shaded
jar.
[windows-jdk7] [INFO] Excluding org.apache.maven.doxia:doxia-module-markdown:jar:1.8 from
the shaded jar.
[windows-jdk7] [INFO] Excluding com.vladsch.flexmark:flexmark-all:jar:0.18.4 from the shaded
jar.
[windows-jdk7] [INFO] Excluding com.vladsch.flexmark:flexmark:jar:0.18.4 from the shaded jar.
[windows-jdk7] [INFO] Excluding com.vladsch.flexmark:flexmark-ext-abbreviation:jar:0.18.4
from the shaded jar.
[windows-jdk7] [INFO] Excluding com.vladsch.flexmark:flexmark-ext-anchorlink:jar:0.18.4 from
the shaded jar.
[windows-jdk7] [INFO] Excluding com.vladsch.flexmark:flexmark-ext-aside:jar:0.18.4 from the
shaded jar.
[windows-jdk7] [INFO] Excluding com.vladsch.flexmark:flexmark-ext-autolink:jar:0.18.4 from
the shaded jar.
[windows-jdk7] [INFO] Excluding org.nibor.autolink:autolink:jar:0.6.0 from the shaded jar.
[windows-jdk7] [INFO] Excluding com.vladsch.flexmark:flexmark-ext-definition:jar:0.18.4 from
the shaded jar.
[windows-jdk7] [INFO] Excluding com.vladsch.flexmark:flexmark-ext-emoji:jar:0.18.4 from the
shaded jar.
[windows-jdk7] [INFO] Excluding com.vladsch.flexmark:flexmark-ext-escaped-character:jar:0.18.4
from the shaded jar.
[windows-jdk7] [INFO] Excluding com.vladsch.flexmark:flexmark-ext-footnotes:jar:0.18.4 from
the shaded jar.
[windows-jdk7] [INFO] Excluding com.vladsch.flexmark:flexmark-ext-gfm-strikethrough:jar:0.18.4
from the shaded jar.
[windows-jdk7] [INFO] Excluding com.vladsch.flexmark:flexmark-ext-gfm-tables:jar:0.18.4 from
the shaded jar.
[windows-jdk7] [INFO] Excluding com.vladsch.flexmark:flexmark-ext-gfm-tasklist:jar:0.18.4
from the shaded jar.
[windows-jdk7] [INFO] Excluding com.vladsch.flexmark:flexmark-ext-jekyll-front-matter:jar:0.18.4
from the shaded jar.
[windows-jdk7] [INFO] Excluding com.vladsch.flexmark:flexmark-ext-jekyll-tag:jar:0.18.4 from
the shaded jar.
[windows-jdk7] [INFO] Excluding com.vladsch.flexmark:flexmark-ext-ins:jar:0.18.4 from the
shaded jar.
[windows-jdk7] [INFO] Excluding com.vladsch.flexmark:flexmark-ext-xwiki-macros:jar:0.18.4
from the shaded jar.
[windows-jdk7] [INFO] Excluding com.vladsch.flexmark:flexmark-ext-spec-example:jar:0.18.4
from the shaded jar.
[windows-jdk7] [INFO] Excluding com.vladsch.flexmark:flexmark-test-util:jar:0.18.4 from the
shaded jar.
[windows-jdk7] [INFO] Excluding com.vladsch.flexmark:flexmark-ext-superscript:jar:0.18.4 from
the shaded jar.
[windows-jdk7] [INFO] Excluding com.vladsch.flexmark:flexmark-ext-tables:jar:0.18.4 from the
shaded jar.
[windows-jdk7] [INFO] Excluding com.vladsch.flexmark:flexmark-ext-toc:jar:0.18.4 from the
shaded jar.
[windows-jdk7] [INFO] Excluding com.vladsch.flexmark:flexmark-ext-typographic:jar:0.18.4 from
the shaded jar.
[windows-jdk7] [INFO] Excluding com.vladsch.flexmark:flexmark-ext-wikilink:jar:0.18.4 from
the shaded jar.
[windows-jdk7] [INFO] Excluding com.vladsch.flexmark:flexmark-ext-yaml-front-matter:jar:0.18.4
from the shaded jar.
[windows-jdk7] [INFO] Excluding com.vladsch.flexmark:flexmark-formatter:jar:0.18.4 from the
shaded jar.
[windows-jdk7] [INFO] Excluding com.vladsch.flexmark:flexmark-html-parser:jar:0.18.4 from
the shaded jar.
[windows-jdk7] [INFO] Excluding com.vladsch.flexmark:flexmark-jira-converter:jar:0.18.4 from
the shaded jar.
[windows-jdk7] [INFO] Excluding com.vladsch.flexmark:flexmark-pdf-converter:jar:0.18.4 from
the shaded jar.
[windows-jdk7] [INFO] Excluding com.openhtmltopdf:openhtmltopdf-core:jar:0.0.1-RC9 from the
shaded jar.
[windows-jdk7] [INFO] Excluding com.openhtmltopdf:openhtmltopdf-pdfbox:jar:0.0.1-RC9 from
the shaded jar.
[windows-jdk7] [INFO] Excluding org.apache.pdfbox:pdfbox:jar:2.0.4 from the shaded jar.
[windows-jdk7] [INFO] Excluding org.apache.pdfbox:fontbox:jar:2.0.4 from the shaded jar.
[windows-jdk7] [INFO] Excluding com.openhtmltopdf:openhtmltopdf-rtl-support:jar:0.0.1-RC9
from the shaded jar.
[windows-jdk7] [INFO] Excluding com.ibm.icu:icu4j:jar:58.1 from the shaded jar.
[windows-jdk7] [INFO] Excluding com.openhtmltopdf:openhtmltopdf-jsoup-dom-converter:jar:0.0.1-RC9
from the shaded jar.
[windows-jdk7] [INFO] Excluding com.vladsch.flexmark:flexmark-profile-pegdown:jar:0.18.4 from
the shaded jar.
[windows-jdk7] [INFO] Excluding com.vladsch.flexmark:flexmark-util:jar:0.18.4 from the shaded
jar.
[windows-jdk7] [INFO] Excluding com.vladsch.flexmark:flexmark-youtrack-converter:jar:0.18.4
from the shaded jar.
[windows-jdk7] [INFO] Excluding javax.servlet:servlet-api:jar:2.5 from the shaded jar.
[windows-jdk7] [INFO] Excluding org.apache.maven.doxia:doxia-decoration-model:jar:1.8.1 from
the shaded jar.
[windows-jdk7] [INFO] Excluding org.apache.maven.doxia:doxia-site-renderer:jar:1.8.1 from
the shaded jar.
[windows-jdk7] [INFO] Excluding org.apache.maven.doxia:doxia-skin-model:jar:1.8.1 from the
shaded jar.
[windows-jdk7] [INFO] Excluding org.codehaus.plexus:plexus-container-default:jar:1.0-alpha-30
from the shaded jar.
[windows-jdk7] [INFO] Excluding org.codehaus.plexus:plexus-velocity:jar:1.2 from the shaded
jar.
[windows-jdk7] [INFO] Excluding org.apache.velocity:velocity:jar:1.7 from the shaded jar.
[windows-jdk7] [INFO] Excluding commons-lang:commons-lang:jar:2.4 from the shaded jar.
[windows-jdk7] [INFO] Excluding org.apache.velocity:velocity-tools:jar:2.0 from the shaded
jar.
[windows-jdk7] [INFO] Excluding commons-beanutils:commons-beanutils:jar:1.7.0 from the shaded
jar.
[windows-jdk7] [INFO] Excluding commons-digester:commons-digester:jar:1.8 from the shaded
jar.
[windows-jdk7] [INFO] Excluding commons-chain:commons-chain:jar:1.1 from the shaded jar.
[windows-jdk7] [INFO] Excluding commons-logging:commons-logging:jar:1.1 from the shaded jar.
[windows-jdk7] [INFO] Excluding commons-validator:commons-validator:jar:1.3.1 from the shaded
jar.
[windows-jdk7] [INFO] Excluding dom4j:dom4j:jar:1.1 from the shaded jar.
[windows-jdk7] [INFO] Excluding oro:oro:jar:2.0.8 from the shaded jar.
[windows-jdk7] [INFO] Excluding sslext:sslext:jar:1.2-0 from the shaded jar.
[windows-jdk7] [INFO] Excluding org.apache.struts:struts-core:jar:1.3.8 from the shaded jar.
[windows-jdk7] [INFO] Excluding antlr:antlr:jar:2.7.2 from the shaded jar.
[windows-jdk7] [INFO] Excluding org.apache.struts:struts-taglib:jar:1.3.8 from the shaded
jar.
[windows-jdk7] [INFO] Excluding org.apache.struts:struts-tiles:jar:1.3.8 from the shaded jar.
[windows-jdk7] [INFO] Excluding commons-collections:commons-collections:jar:3.2.1 from the
shaded jar.
[windows-jdk7] [INFO] Excluding org.apache.maven.doxia:doxia-integration-tools:jar:1.8.1 from
the shaded jar.
[windows-jdk7] [INFO] Excluding org.apache.maven.wagon:wagon-provider-api:jar:1.0 from the
shaded jar.
[windows-jdk7] [INFO] Excluding org.jsoup:jsoup:jar:1.6.1 from the shaded jar.
[windows-jdk7] [INFO] Excluding org.mortbay.jetty:jetty:jar:6.1.25 from the shaded jar.
[windows-jdk7] [INFO] Excluding org.mortbay.jetty:servlet-api:jar:2.5-20081211 from the shaded
jar.
[windows-jdk7] [INFO] Excluding org.mortbay.jetty:jetty-util:jar:6.1.25 from the shaded jar.
[windows-jdk7] [INFO] Excluding org.apache.commons:commons-lang3:jar:3.4 from the shaded jar.
[windows-jdk7] [INFO] Excluding commons-io:commons-io:jar:2.5 from the shaded jar.
[windows-jdk7] [INFO] Replacing original artifact with shaded artifact.
[windows-jdk7] [INFO] Replacing f:\jenkins\jenkins-slave\workspace\ox_maven-site-plugin_master-LZWAKOPRMO5JAZW5HRA2IQ56LLTFU3PLKDIE2JNFFXEGASBYKK3Q\m\target\maven-site-plugin-3.7.1-SNAPSHOT.jar
with f:\jenkins\jenkins-slave\workspace\ox_maven-site-plugin_master-LZWAKOPRMO5JAZW5HRA2IQ56LLTFU3PLKDIE2JNFFXEGASBYKK3Q\m\target\maven-site-plugin-3.7.1-SNAPSHOT-shaded.jar
[windows-jdk8] Sending interrupt signal to process
[windows-jdk9] [INFO] Running org.apache.maven.plugins.site.deploy.SiteDeployMojoTest
[windows-jdk9] Sending interrupt signal to process
[windows-jdk9] [INFO] 
[windows-jdk9] [INFO] Results:
[windows-jdk9] [INFO] 
[windows-jdk9] [INFO] Tests run: 0, Failures: 0, Errors: 0, Skipped: 0
[windows-jdk9] [INFO] 
[windows-jdk9] [ERROR] There are test failures.
[windows-jdk9] 
[windows-jdk9] Please refer to f:\jenkins\jenkins-slave\workspace\ox_maven-site-plugin_master-LZWAKOPRMO5JAZW5HRA2IQ56LLTFU3PLKDIE2JNFFXEGASBYKK3Q\m\target\surefire-reports
for the individual test results.
[windows-jdk9] Please refer to dump files (if any exist) [date]-jvmRun[N].dump, [date].dumpstream
and [date]-jvmRun[N].dumpstream.
[windows-jdk9] The forked VM terminated without properly saying goodbye. VM crash or System.exit
called?
[windows-jdk9] Command was cmd.exe /X /C "f:\jenkins\tools\java\latest9\bin\java --add-modules
java.se.ee -jar C:\Users\jenkins\AppData\Local\Temp\2\surefire12262163167273664517\surefirebooter6702687826485315237.jar
C:\Users\jenkins\AppData\Local\Temp\2\surefire12262163167273664517 2018-04-23T17-40-58_367-jvmRun1
surefire7420582560217469963tmp surefire_09264471561366923577tmp"
[windows-jdk9] Error occurred in starting fork, check output in log
[windows-jdk9] Process Exit Code: -1
[windows-jdk9] Crashed tests:
[windows-jdk9] org.apache.maven.plugins.site.deploy.SiteDeployMojoTest
[windows-jdk9] org.apache.maven.surefire.booter.SurefireBooterForkException: The forked VM
terminated without properly saying goodbye. VM crash or System.exit called?
[windows-jdk9] Command was cmd.exe /X /C "f:\jenkins\tools\java\latest9\bin\java --add-modules
java.se.ee -jar C:\Users\jenkins\AppData\Local\Temp\2\surefire12262163167273664517\surefirebooter6702687826485315237.jar
C:\Users\jenkins\AppData\Local\Temp\2\surefire12262163167273664517 2018-04-23T17-40-58_367-jvmRun1
surefire7420582560217469963tmp surefire_09264471561366923577tmp"
[windows-jdk9] Error occurred in starting fork, check output in log
[windows-jdk9] Process Exit Code: -1
[windows-jdk9] Crashed tests:
[windows-jdk9] org.apache.maven.plugins.site.deploy.SiteDeployMojoTest
[windows-jdk9] 	at org.apache.maven.plugin.surefire.booterclient.ForkStarter.fork(ForkStarter.java:686)
[windows-jdk9] 	at org.apache.maven.plugin.surefire.booterclient.ForkStarter.fork(ForkStarter.java:535)
[windows-jdk9] 	at org.apache.maven.plugin.surefire.booterclient.ForkStarter.run(ForkStarter.java:280)
[windows-jdk9] 	at org.apache.maven.plugin.surefire.booterclient.ForkStarter.run(ForkStarter.java:245)
[windows-jdk9] 	at org.apache.maven.plugin.surefire.AbstractSurefireMojo.executeProvider(AbstractSurefireMojo.java:1124)
[windows-jdk9] 	at org.apache.maven.plugin.surefire.AbstractSurefireMojo.executeAfterPreconditionsChecked(AbstractSurefireMojo.java:954)
[windows-jdk9] 	at org.apache.maven.plugin.surefire.AbstractSurefireMojo.execute(AbstractSurefireMojo.java:832)
[windows-jdk9] 	at org.apache.maven.plugin.DefaultBuildPluginManager.executeMojo(DefaultBuildPluginManager.java:134)
[windows-jdk9] 	at org.apache.maven.lifecycle.internal.MojoExecutor.execute(MojoExecutor.java:208)
[windows-jdk9] 	at org.apache.maven.lifecycle.internal.MojoExecutor.execute(MojoExecutor.java:154)
[windows-jdk9] 	at org.apache.maven.lifecycle.internal.MojoExecutor.execute(MojoExecutor.java:146)
[windows-jdk9] 	at org.apache.maven.lifecycle.internal.LifecycleModuleBuilder.buildProject(LifecycleModuleBuilder.java:117)
[windows-jdk9] 	at org.apache.maven.lifecycle.internal.LifecycleModuleBuilder.buildProject(LifecycleModuleBuilder.java:81)
[windows-jdk9] 	at org.apache.maven.lifecycle.internal.builder.singlethreaded.SingleThreadedBuilder.build(SingleThreadedBuilder.java:51)
[windows-jdk9] 	at org.apache.maven.lifecycle.internal.LifecycleStarter.execute(LifecycleStarter.java:128)
[windows-jdk9] 	at org.apache.maven.DefaultMaven.doExecute(DefaultMaven.java:309)
[windows-jdk9] 	at org.apache.maven.DefaultMaven.doExecute(DefaultMaven.java:194)
[windows-jdk9] 	at org.apache.maven.DefaultMaven.execute(DefaultMaven.java:107)
[windows-jdk9] 	at org.apache.maven.cli.MavenCli.execute(MavenCli.java:993)
[windows-jdk9] 	at org.apache.maven.cli.MavenCli.doMain(MavenCli.java:345)
[windows-jdk9] 	at org.apache.maven.cli.MavenCli.main(MavenCli.java:191)
[windows-jdk9] 	at java.base/jdk.internal.reflect.NativeMethodAccessorImpl.invoke0(Native
Method)
[windows-jdk9] 	at java.base/jdk.internal.reflect.NativeMethodAccessorImpl.invoke(NativeMethodAccessorImpl.java:62)
[windows-jdk9] 	at java.base/jdk.internal.reflect.DelegatingMethodAccessorImpl.invoke(DelegatingMethodAccessorImpl.java:43)
[windows-jdk9] 	at java.base/java.lang.reflect.Method.invoke(Method.java:564)
[windows-jdk9] 	at org.codehaus.plexus.classworlds.launcher.Launcher.launchEnhanced(Launcher.java:289)
[windows-jdk9] 	at org.codehaus.plexus.classworlds.launcher.Launcher.launch(Launcher.java:229)
[windows-jdk9] 	at org.codehaus.plexus.classworlds.launcher.Launcher.mainWithExitCode(Launcher.java:415)
[windows-jdk9] 	at org.codehaus.plexus.classworlds.launcher.Launcher.main(Launcher.java:356)
[windows-jdk9] 
[windows-jdk9] [INFO] 
[windows-jdk9] [INFO] --- maven-jar-plugin:3.0.2:jar (default-jar) @ maven-site-plugin ---
[Pipeline] [linux-jdk7] // node
[Pipeline] [linux-jdk8] // node
[Pipeline] [linux-jdk9] // node
[Pipeline] [linux-jdk10] // node
[Pipeline] [linux-jdk7] }
[linux-jdk7] Failed in branch linux-jdk7
[Pipeline] [linux-jdk8] }
[linux-jdk8] Failed in branch linux-jdk8
[Pipeline] [linux-jdk9] }
[linux-jdk9] Failed in branch linux-jdk9
[Pipeline] [linux-jdk10] }
[linux-jdk10] Failed in branch linux-jdk10
[Pipeline] [windows-jdk9] }
[Pipeline] [windows-jdk9] // dir
[Pipeline] [windows-jdk9] }
[windows-jdk9] [withMaven] One or multiple Maven executions have been ignored by the Jenkins
Pipeline Maven Plugin because they have been interrupted before completion (1). See Pipeline
Maven Plugin FAQ for more details.
[Pipeline] [windows-jdk9] // withMaven
[Pipeline] [windows-jdk9] echo
[windows-jdk9] [FAIL FAST] windows-jdk10 had first failure, ignoring script returned exit
code -1
[Pipeline] [windows-jdk9] }
[Pipeline] [windows-jdk9] // stage
[Pipeline] [windows-jdk9] }
[Pipeline] [windows-jdk9] // node
[Pipeline] [windows-jdk9] }
[windows-jdk7] After 10s process did not stop
[Pipeline] [windows-jdk7] }
[Pipeline] [windows-jdk7] // dir
[windows-jdk8] After 10s process did not stop
[Pipeline] [windows-jdk7] }
[windows-jdk7] [withMaven] One or multiple Maven executions have been ignored by the Jenkins
Pipeline Maven Plugin because they have been interrupted before completion (1). See Pipeline
Maven Plugin FAQ for more details.
[Pipeline] [windows-jdk7] // withMaven
[Pipeline] [windows-jdk8] }
[Pipeline] [windows-jdk7] echo
[windows-jdk7] [FAIL FAST] windows-jdk10 had first failure, ignoring null
[Pipeline] [windows-jdk7] }
[Pipeline] [windows-jdk8] // dir
[Pipeline] [windows-jdk7] // stage
[Pipeline] [windows-jdk7] }
[Pipeline] [windows-jdk8] }
[windows-jdk8] [withMaven] One or multiple Maven executions have been ignored by the Jenkins
Pipeline Maven Plugin because they have been interrupted before completion (1). See Pipeline
Maven Plugin FAQ for more details.
[Pipeline] [windows-jdk7] // node
[Pipeline] [windows-jdk8] // withMaven
[Pipeline] [windows-jdk7] }
[Pipeline] [windows-jdk8] echo
[windows-jdk8] [FAIL FAST] windows-jdk10 had first failure, ignoring null
[Pipeline] [windows-jdk8] }
[Pipeline] [windows-jdk8] // stage
[Pipeline] [windows-jdk8] }
[Pipeline] [windows-jdk8] // node
[Pipeline] [windows-jdk8] }
[Pipeline] // parallel
[Pipeline] echo
***** FAST FAILURE *****

Fast failure triggered by windows-jdk10

***** FAST FAILURE *****
[Pipeline] stage
[Pipeline] { (Notifications)
[Pipeline] echo
Build result: FAILURE
[Pipeline] jiraIssueSelector
[Pipeline] jiraComment
[Pipeline] emailext
Mime
  • Unnamed multipart/mixed (inline, None, 0 bytes)
View raw message