maven-notifications mailing list archives

Site index · List index
Message view « Date » · « Thread »
Top « Date » · « Thread »
From Apache Jenkins Server <jenk...@builds.apache.org>
Subject Build failed in Jenkins: Maven TLP » maven-project-info-reports-plugin » MPIR-366 #12
Date Sun, 01 Apr 2018 13:23:54 GMT
See https://builds.apache.org/job/maven-box/job/maven-project-info-reports-plugin/job/MPIR-366/12/

Changes:

* [MPIR-366] Drop Maven2 support Getting false positives on Jenkins,
* [MPIR-366] Drop Maven2 support Getting false positives on Jenkins,
* [MPIR-366] Drop Maven2 support Getting false positives on Jenkins,
* [MPIR-366] Drop Maven2 support Getting false positives on Jenkins,

All tests passed

Build log:
[...truncated 1.44 MB...]
[linux-jdk10] [INFO] Downloading from central: https://repo.maven.apache.org/maven2/org/abego/treelayout/org.abego.treelayout.core/1.0.1/org.abego.treelayout.core-1.0.1.jar
[linux-jdk10] [INFO] Downloaded from central: https://repo.maven.apache.org/maven2/org/antlr/antlr4-annotations/4.3/antlr4-annotations-4.3.jar
(10 kB at 632 kB/s)
[linux-jdk10] [INFO] Downloading from central: https://repo.maven.apache.org/maven2/com/google/guava/guava/18.0/guava-18.0.jar
[linux-jdk10] [INFO] Downloaded from central: https://repo.maven.apache.org/maven2/org/abego/treelayout/org.abego.treelayout.core/1.0.1/org.abego.treelayout.core-1.0.1.jar
(26 kB at 823 kB/s)
[linux-jdk10] [INFO] Downloaded from central: https://repo.maven.apache.org/maven2/commons-beanutils/commons-beanutils-core/1.8.3/commons-beanutils-core-1.8.3.jar
(207 kB at 11 MB/s)
[linux-jdk10] [INFO] Downloaded from central: https://repo.maven.apache.org/maven2/org/antlr/antlr4-runtime/4.3/antlr4-runtime-4.3.jar
(345 kB at 9.9 MB/s)
[linux-jdk10] [INFO] Downloaded from central: https://repo.maven.apache.org/maven2/com/puppycrawl/tools/checkstyle/6.1.1/checkstyle-6.1.1.jar
(1.0 MB at 20 MB/s)
[linux-jdk10] [INFO] Downloaded from central: https://repo.maven.apache.org/maven2/com/google/guava/guava/18.0/guava-18.0.jar
(2.3 MB at 31 MB/s)
[linux-jdk10] [INFO] There are 10 errors reported by Checkstyle 6.1.1 with config/maven_checks.xml
ruleset.
[linux-jdk10] [INFO] Ignored 10 errors, 0 violation remaining.
[linux-jdk10] [INFO] 
[linux-jdk10] [INFO] --- maven-jarsigner-plugin:1.3.2:verify (verify) @ maven-project-info-reports-plugin
---
[linux-jdk10] [WARNING] Picked up JAVA_TOOL_OPTIONS: -Dmaven.ext.class.path="/home/jenkins/jenkins-slave/workspace/nfo-reports-plugin_MPIR-366-S464FI4ATSVOULE3N7MCKV5FYYG6GVHDD7OLISMYBGUEPLQM2UNA@tmp/withMaven1b21c922/pipeline-maven-spy.jar"
-Dorg.jenkinsci.plugins.pipeline.maven.reportsFolder="/home/jenkins/jenkins-slave/workspace/nfo-reports-plugin_MPIR-366-S464FI4ATSVOULE3N7MCKV5FYYG6GVHDD7OLISMYBGUEPLQM2UNA@tmp/withMaven1b21c922"

[linux-jdk10] [INFO] 1 archive(s) processed
[linux-jdk10] [INFO] 
[linux-jdk10] [INFO] --- maven-invoker-plugin:2.0.0:verify (integration-test) @ maven-project-info-reports-plugin
---
[linux-jdk10] [INFO] -------------------------------------------------
[linux-jdk10] [INFO] Build Summary:
[linux-jdk10] [INFO]   Passed: 4, Failed: 7, Errors: 0, Skipped: 0
[linux-jdk10] [INFO] -------------------------------------------------
[linux-jdk10] [ERROR] The following builds failed:
[linux-jdk10] [ERROR] *  minimal-pom/pom.xml
[linux-jdk10] [ERROR] *  mpir-229/pom.xml
[linux-jdk10] [ERROR] *  multi-module/pom.xml
[linux-jdk10] [ERROR] *  MPIR-242/pom.xml
[linux-jdk10] [ERROR] *  full-pom/pom.xml
[linux-jdk10] [ERROR] *  git/pom.xml
[linux-jdk10] [ERROR] *  dependencies-java-1.7-and-1.8/pom.xml
[linux-jdk10] [INFO] -------------------------------------------------
[linux-jdk10] [INFO] ------------------------------------------------------------------------
[linux-jdk10] [INFO] BUILD FAILURE
[linux-jdk10] [INFO] ------------------------------------------------------------------------
[linux-jdk10] [INFO] Total time: 02:32 min
[linux-jdk10] [INFO] Finished at: 2018-04-01T13:22:11Z
[linux-jdk10] [INFO] Final Memory: 54M/308M
[linux-jdk10] [INFO] ------------------------------------------------------------------------
[linux-jdk10] [INFO] [jenkins-event-spy] Generated /home/jenkins/jenkins-slave/workspace/nfo-reports-plugin_MPIR-366-S464FI4ATSVOULE3N7MCKV5FYYG6GVHDD7OLISMYBGUEPLQM2UNA@tmp/withMaven1b21c922/maven-spy-20180401-131938-6404523363420178267684.log
[linux-jdk10] [ERROR] Failed to execute goal org.apache.maven.plugins:maven-invoker-plugin:2.0.0:verify
(integration-test) on project maven-project-info-reports-plugin: 7 builds failed. See console
output above for details. -> [Help 1]
[linux-jdk10] [ERROR] 
[linux-jdk10] [ERROR] To see the full stack trace of the errors, re-run Maven with the -e
switch.
[linux-jdk10] [ERROR] Re-run Maven using the -X switch to enable full debug logging.
[linux-jdk10] [ERROR] 
[linux-jdk10] [ERROR] For more information about the errors and possible solutions, please
read the following articles:
[linux-jdk10] [ERROR] [Help 1] http://cwiki.apache.org/confluence/display/MAVEN/MojoFailureException
[Pipeline] [linux-jdk10] }
[Pipeline] [linux-jdk10] // dir
[linux-jdk7] [INFO] run script verify.bsh
[linux-jdk7] [INFO] ..SUCCESS (66.8 s)
[linux-jdk7] [INFO] Building: multi-module/pom.xml
[linux-jdk8] [INFO] run script verify.bsh
[linux-jdk8] [INFO] ..SUCCESS (61.2 s)
[linux-jdk8] [INFO] Building: java-version/pom.xml
[linux-jdk8] [INFO] run script verify.groovy
[linux-jdk8] [INFO] ..SUCCESS (3.8 s)
[linux-jdk8] [INFO] Building: mpir-229/pom.xml
[linux-jdk8] [INFO] run script verify.groovy
[linux-jdk8] [INFO] ..SUCCESS (4.0 s)
[linux-jdk8] [INFO] Building: MPIR-242/pom.xml
[linux-jdk8] [INFO] run script verify.groovy
[linux-jdk8] [INFO] ..SUCCESS (4.5 s)
[linux-jdk8] [INFO] Building: MPIR-300/pom.xml
[linux-jdk9] [INFO] run script verify.bsh
[linux-jdk9] [INFO] ..SUCCESS (62.4 s)
[linux-jdk9] [INFO] Building: java-version/pom.xml
[linux-jdk9] [INFO] run script verify.groovy
[linux-jdk9] [INFO] ..SUCCESS (4.5 s)
[linux-jdk9] [INFO] Building: mpir-229/pom.xml
[Pipeline] [linux-jdk10] }
[linux-jdk10] [withMaven] junitPublisher - Archive test results for Maven artifact org.apache.maven.plugins:maven-project-info-reports-plugin:2.10-SNAPSHOT
generated by maven-surefire-plugin:test (default-test): m/target/surefire-reports/*.xml
[linux-jdk10] [withMaven] junitPublisher - Jenkins JUnit Attachments Plugin not found, can't
publish test attachments.Recording test results
[linux-jdk10] [withMaven] junitPublisher - Archive test results for Maven artifact org.apache.maven.plugins.project-info-reports.its:dep:1.0-SNAPSHOT
generated by maven-surefire-plugin:test (default-test): m/target/it/multi-module/dep/target/surefire-reports/*.xml
[linux-jdk10] [withMaven] junitPublisher - Jenkins JUnit Attachments Plugin not found, can't
publish test attachments.Recording test results
[linux-jdk10] None of the test reports contained any result
[linux-jdk10] [withMaven] junitPublisher - Archive test results for Maven artifact org.apache.maven.plugins.project-info-reports.its:main:1.0-SNAPSHOT
generated by maven-surefire-plugin:test (default-test): m/target/it/multi-module/main/target/surefire-reports/*.xml
[linux-jdk10] [withMaven] junitPublisher - Jenkins JUnit Attachments Plugin not found, can't
publish test attachments.Recording test results
[linux-jdk10] None of the test reports contained any result
[Pipeline] [linux-jdk10] // withMaven
[Pipeline] [linux-jdk10] echo
[linux-jdk10] [FAIL FAST] This is the first failure and likely root cause
[Pipeline] [linux-jdk10] }
[Pipeline] [linux-jdk10] // stage
[Pipeline] [linux-jdk10] }
[Pipeline] [linux-jdk10] // node
[Pipeline] [linux-jdk10] }
[linux-jdk7] Sending interrupt signal to process
[linux-jdk10] Failed in branch linux-jdk10
[linux-jdk7] [INFO] ..FAILED (13.0 s)
[linux-jdk7] [INFO]   The build exited with code 143. See /home/jenkins/jenkins-slave/workspace/nfo-reports-plugin_MPIR-366-S464FI4ATSVOULE3N7MCKV5FYYG6GVHDD7OLISMYBGUEPLQM2UNA/m/target/it/multi-module/build.log
for details.
[linux-jdk7] [INFO] Building: MPIR-251/pom.xml
[linux-jdk7] Terminated
[linux-jdk8] Sending interrupt signal to process
[linux-jdk8] [INFO] run script verify.groovy
[linux-jdk8] [INFO] ..SUCCESS (4.1 s)
[linux-jdk8] [INFO] 
[linux-jdk8] [INFO] --- maven-checkstyle-plugin:2.15:check (checkstyle-check) @ maven-project-info-reports-plugin
---
[linux-jdk8] [INFO] Downloading from central: https://repo.maven.apache.org/maven2/org/apache/maven/shared/maven-shared-resources/2/maven-shared-resources-2.pom
[linux-jdk8] [INFO] Downloaded from central: https://repo.maven.apache.org/maven2/org/apache/maven/shared/maven-shared-resources/2/maven-shared-resources-2.pom
(3.0 kB at 197 kB/s)
[linux-jdk8] [INFO] Downloading from central: https://repo.maven.apache.org/maven2/org/codehaus/plexus/plexus-utils/3.0.10/plexus-utils-3.0.10.pom
[linux-jdk8] [INFO] Downloaded from central: https://repo.maven.apache.org/maven2/org/codehaus/plexus/plexus-utils/3.0.10/plexus-utils-3.0.10.pom
(3.1 kB at 286 kB/s)
[linux-jdk8] [INFO] Downloading from central: https://repo.maven.apache.org/maven2/org/codehaus/plexus/plexus-resources/1.0.1/plexus-resources-1.0.1.pom
[linux-jdk9] Sending interrupt signal to process
[linux-jdk8] [INFO] Downloaded from central: https://repo.maven.apache.org/maven2/org/codehaus/plexus/plexus-resources/1.0.1/plexus-resources-1.0.1.pom
(1.3 kB at 120 kB/s)
[linux-jdk8] [INFO] Downloading from central: https://repo.maven.apache.org/maven2/com/puppycrawl/tools/checkstyle/6.1.1/checkstyle-6.1.1.pom
[linux-jdk8] [INFO] Downloaded from central: https://repo.maven.apache.org/maven2/com/puppycrawl/tools/checkstyle/6.1.1/checkstyle-6.1.1.pom
(30 kB at 2.2 MB/s)
[linux-jdk8] [INFO] Downloading from central: https://repo.maven.apache.org/maven2/org/antlr/antlr4-runtime/4.3/antlr4-runtime-4.3.pom
[linux-jdk8] [INFO] Downloaded from central: https://repo.maven.apache.org/maven2/org/antlr/antlr4-runtime/4.3/antlr4-runtime-4.3.pom
(4.8 kB at 399 kB/s)
[linux-jdk8] [INFO] Downloading from central: https://repo.maven.apache.org/maven2/org/antlr/antlr4-master/4.3/antlr4-master-4.3.pom
[linux-jdk8] [INFO] Downloaded from central: https://repo.maven.apache.org/maven2/org/antlr/antlr4-master/4.3/antlr4-master-4.3.pom
(7.9 kB at 721 kB/s)
[linux-jdk8] [INFO] Downloading from central: https://repo.maven.apache.org/maven2/org/abego/treelayout/org.abego.treelayout.core/1.0.1/org.abego.treelayout.core-1.0.1.pom
[linux-jdk8] [INFO] Downloaded from central: https://repo.maven.apache.org/maven2/org/abego/treelayout/org.abego.treelayout.core/1.0.1/org.abego.treelayout.core-1.0.1.pom
(3.1 kB at 282 kB/s)
[linux-jdk8] [INFO] Downloading from central: https://repo.maven.apache.org/maven2/org/antlr/antlr4-annotations/4.3/antlr4-annotations-4.3.pom
[linux-jdk8] [INFO] Downloaded from central: https://repo.maven.apache.org/maven2/org/antlr/antlr4-annotations/4.3/antlr4-annotations-4.3.pom
(1.3 kB at 106 kB/s)
[linux-jdk8] [INFO] Downloading from central: https://repo.maven.apache.org/maven2/commons-beanutils/commons-beanutils-core/1.8.3/commons-beanutils-core-1.8.3.pom
[linux-jdk8] [INFO] Downloaded from central: https://repo.maven.apache.org/maven2/commons-beanutils/commons-beanutils-core/1.8.3/commons-beanutils-core-1.8.3.pom
(1.6 kB at 149 kB/s)
[linux-jdk8] [INFO] Downloading from central: https://repo.maven.apache.org/maven2/com/google/guava/guava/18.0/guava-18.0.pom
[linux-jdk8] [INFO] Downloaded from central: https://repo.maven.apache.org/maven2/com/google/guava/guava/18.0/guava-18.0.pom
(5.7 kB at 515 kB/s)
[linux-jdk8] [INFO] Downloading from central: https://repo.maven.apache.org/maven2/com/google/guava/guava-parent/18.0/guava-parent-18.0.pom
[linux-jdk8] [INFO] Downloaded from central: https://repo.maven.apache.org/maven2/com/google/guava/guava-parent/18.0/guava-parent-18.0.pom
(7.7 kB at 699 kB/s)
[linux-jdk8] [INFO] Downloading from central: https://repo.maven.apache.org/maven2/org/apache/maven/shared/maven-shared-resources/2/maven-shared-resources-2.jar
[linux-jdk8] [INFO] Downloading from central: https://repo.maven.apache.org/maven2/org/codehaus/plexus/plexus-resources/1.0.1/plexus-resources-1.0.1.jar
[linux-jdk8] [INFO] Downloading from central: https://repo.maven.apache.org/maven2/com/puppycrawl/tools/checkstyle/6.1.1/checkstyle-6.1.1.jar
[linux-jdk8] [INFO] Downloading from central: https://repo.maven.apache.org/maven2/org/antlr/antlr4-runtime/4.3/antlr4-runtime-4.3.jar
[linux-jdk8] [INFO] Downloading from central: https://repo.maven.apache.org/maven2/org/abego/treelayout/org.abego.treelayout.core/1.0.1/org.abego.treelayout.core-1.0.1.jar
[linux-jdk8] [INFO] Downloaded from central: https://repo.maven.apache.org/maven2/org/apache/maven/shared/maven-shared-resources/2/maven-shared-resources-2.jar
(13 kB at 816 kB/s)
[linux-jdk8] [INFO] Downloading from central: https://repo.maven.apache.org/maven2/org/antlr/antlr4-annotations/4.3/antlr4-annotations-4.3.jar
[linux-jdk8] [INFO] Downloaded from central: https://repo.maven.apache.org/maven2/org/codehaus/plexus/plexus-resources/1.0.1/plexus-resources-1.0.1.jar
(22 kB at 1.2 MB/s)
[linux-jdk8] [INFO] Downloading from central: https://repo.maven.apache.org/maven2/commons-beanutils/commons-beanutils-core/1.8.3/commons-beanutils-core-1.8.3.jar
[linux-jdk8] [INFO] Downloaded from central: https://repo.maven.apache.org/maven2/org/abego/treelayout/org.abego.treelayout.core/1.0.1/org.abego.treelayout.core-1.0.1.jar
(26 kB at 1.4 MB/s)
[linux-jdk8] [INFO] Downloading from central: https://repo.maven.apache.org/maven2/com/google/guava/guava/18.0/guava-18.0.jar
[linux-jdk8] [INFO] Downloaded from central: https://repo.maven.apache.org/maven2/org/antlr/antlr4-annotations/4.3/antlr4-annotations-4.3.jar
(10 kB at 361 kB/s)
[linux-jdk8] [INFO] Downloaded from central: https://repo.maven.apache.org/maven2/org/antlr/antlr4-runtime/4.3/antlr4-runtime-4.3.jar
(345 kB at 9.3 MB/s)
[linux-jdk8] [INFO] Downloaded from central: https://repo.maven.apache.org/maven2/commons-beanutils/commons-beanutils-core/1.8.3/commons-beanutils-core-1.8.3.jar
(207 kB at 5.0 MB/s)
[linux-jdk8] [INFO] Downloaded from central: https://repo.maven.apache.org/maven2/com/puppycrawl/tools/checkstyle/6.1.1/checkstyle-6.1.1.jar
(1.0 MB at 17 MB/s)
[linux-jdk8] [INFO] Downloaded from central: https://repo.maven.apache.org/maven2/com/google/guava/guava/18.0/guava-18.0.jar
(2.3 MB at 16 MB/s)
[linux-jdk8] Terminated
[linux-jdk9] [INFO] ..FAILED (4.4 s)
[linux-jdk9] [INFO]   The build exited with code 143. See /home/jenkins/jenkins-slave/workspace/nfo-reports-plugin_MPIR-366-S464FI4ATSVOULE3N7MCKV5FYYG6GVHDD7OLISMYBGUEPLQM2UNA@2/m/target/it/mpir-229/build.log
for details.
[linux-jdk9] [INFO] Building: MPIR-242/pom.xml
[Pipeline] [windows-jdk7] // node
[Pipeline] [windows-jdk8] // node
[Pipeline] [windows-jdk9] // node
[Pipeline] [windows-jdk10] // node
[Pipeline] [windows-jdk7] }
[windows-jdk7] Failed in branch windows-jdk7
[Pipeline] [windows-jdk8] }
[windows-jdk8] Failed in branch windows-jdk8
[Pipeline] [windows-jdk9] }
[windows-jdk9] Failed in branch windows-jdk9
[Pipeline] [windows-jdk10] }
[windows-jdk10] Failed in branch windows-jdk10
[Pipeline] [linux-jdk7] }
[Pipeline] [linux-jdk7] // dir
[linux-jdk9] Terminated
[Pipeline] [linux-jdk7] }
[linux-jdk7] [withMaven] artifactsPublisher - Archive artifact m/target/it/MPIR-349/parent/pom.xml
under org/apache/maven/plugins/project-info-reports/its/mpir-349/1.0-SNAPSHOT/mpir-349-1.0-SNAPSHOT.pom
[linux-jdk7] [withMaven] artifactsPublisher - Archive artifact m/target/it/MPIR-349/module-flat/pom.xml
under org/apache/maven/plugins/project-info-reports/its/mpir-349-module-hierarchical/1.0-SNAPSHOT/mpir-349-module-hierarchical-1.0-SNAPSHOT.pom
[linux-jdk7] [withMaven] artifactsPublisher - Archive artifact m/target/it/MPIR-349/parent/module-hierarchical/pom.xml
under org/apache/maven/plugins/project-info-reports/its/mpir-349-module-flat/1.0-SNAPSHOT/mpir-349-module-flat-1.0-SNAPSHOT.pom
[linux-jdk7] [withMaven] artifactsPublisher - Archive artifact m/target/it/MPIR-349/parent/pom.xml
under org/apache/maven/plugins/project-info-reports/its/mpir-349/1.0-SNAPSHOT/mpir-349-1.0-SNAPSHOT.pom
[linux-jdk7] [withMaven] artifactsPublisher - Archive artifact m/target/it/MPIR-349/module-flat/pom.xml
under org/apache/maven/plugins/project-info-reports/its/mpir-349-module-hierarchical/1.0-SNAPSHOT/mpir-349-module-hierarchical-1.0-SNAPSHOT.pom
[linux-jdk7] [withMaven] artifactsPublisher - Archive artifact m/target/it/MPIR-349/parent/module-hierarchical/pom.xml
under org/apache/maven/plugins/project-info-reports/its/mpir-349-module-flat/1.0-SNAPSHOT/mpir-349-module-flat-1.0-SNAPSHOT.pom
[linux-jdk7] [withMaven] artifactsPublisher - Archive artifact m/target/it/MPIR-242/pom.xml
under org/apache/maven/plugins/project-info-reports/its/MPIR-242/1.0-SNAPSHOT/MPIR-242-1.0-SNAPSHOT.pom
[linux-jdk7] [withMaven] artifactsPublisher - Archive artifact m/target/it/MPIR-300/pom.xml
under org/apache/maven/plugins/project-info-reports/its/mpir-300/1.0-SNAPSHOT/mpir-300-1.0-SNAPSHOT.pom
[linux-jdk7] [withMaven] artifactsPublisher - Archive artifact m/target/it/git/pom.xml under
org/apache/maven/plugins/project-info-reports/it/git/parent/1.0-SNAPSHOT/parent-1.0-SNAPSHOT.pom
[linux-jdk7] [withMaven] artifactsPublisher - Archive artifact m/target/it/git/inherited/pom.xml
under org/apache/maven/plugins/project-info-reports/it/git/inherited/1.0-SNAPSHOT/inherited-1.0-SNAPSHOT.pom
[linux-jdk7] [withMaven] artifactsPublisher - Archive artifact m/target/it/git/push/pom.xml
under org/apache/maven/plugins/project-info-reports/it/git/push/push/1.0-SNAPSHOT/push-1.0-SNAPSHOT.pom
[linux-jdk7] [withMaven] artifactsPublisher - Archive artifact m/target/it/git/push/inherited/pom.xml
under org/apache/maven/plugins/project-info-reports/it/git/push/inherited/1.0-SNAPSHOT/inherited-1.0-SNAPSHOT.pom
[linux-jdk7] [withMaven] artifactsPublisher - Archive artifact m/target/it/java-version/pom.xml
under org/apache/maven/plugins/project-info-reports/java-version/1.0-SNAPSHOT/java-version-1.0-SNAPSHOT.pom
[linux-jdk7] [withMaven] artifactsPublisher - Archive artifact m/target/it/java-version/plugin/pom.xml
under org/apache/maven/plugins/project-info-reports/plugin/1.0-SNAPSHOT/plugin-1.0-SNAPSHOT.pom
[linux-jdk7] [withMaven] artifactsPublisher - Archive artifact m/target/it/java-version/pluginManagement/pom.xml
under org/apache/maven/plugins/project-info-reports/pluginManagement/1.0-SNAPSHOT/pluginManagement-1.0-SNAPSHOT.pom
[linux-jdk7] [withMaven] artifactsPublisher - Archive artifact m/target/it/java-version/property/pom.xml
under org/apache/maven/plugins/project-info-reports/property/1.0-SNAPSHOT/property-1.0-SNAPSHOT.pom
[linux-jdk7] [withMaven] artifactsPublisher - Archive artifact m/target/it/minimal-pom/pom.xml
under org/apache/maven/plugins/project-info-reports/minimal-pom/1.0-SNAPSHOT/minimal-pom-1.0-SNAPSHOT.pom
[linux-jdk7] [withMaven] artifactsPublisher - Archive artifact m/target/it/full-pom/pom.xml
under org/apache/maven/plugins/project-info-reports/full-pom/1.0-SNAPSHOT/full-pom-1.0-SNAPSHOT.pom
[linux-jdk7] [withMaven] artifactsPublisher - Archive artifact m/target/it/multi-module/pom.xml
under org/apache/maven/plugins/project-info-reports/its/multi-module/1.0-SNAPSHOT/multi-module-1.0-SNAPSHOT.pom
[linux-jdk7] [withMaven] artifactsPublisher - Archive artifact m/target/it/multi-module/dep/pom.xml
under org/apache/maven/plugins/project-info-reports/its/dep/1.0-SNAPSHOT/dep-1.0-SNAPSHOT.pom
[linux-jdk7] [withMaven] artifactsPublisher - Archive artifact m/target/it/multi-module/dep/target/dep-1.0-SNAPSHOT.jar
under org/apache/maven/plugins/project-info-reports/its/dep/1.0-SNAPSHOT/dep-1.0-SNAPSHOT.jar
[linux-jdk7] [withMaven] artifactsPublisher - Archive artifact m/target/it/multi-module/main/pom.xml
under org/apache/maven/plugins/project-info-reports/its/main/1.0-SNAPSHOT/main-1.0-SNAPSHOT.pom
[linux-jdk7] [withMaven] artifactsPublisher - Archive artifact m/target/it/multi-module/main/target/main-1.0-SNAPSHOT.jar
under org/apache/maven/plugins/project-info-reports/its/main/1.0-SNAPSHOT/main-1.0-SNAPSHOT.jar
[linux-jdk7] [withMaven] junitPublisher - Archive test results for Maven artifact org.apache.maven.plugins.project-info-reports.its:dep:1.0-SNAPSHOT
generated by maven-surefire-plugin:test (default-test): m/target/it/multi-module/dep/target/surefire-reports/*.xml
[linux-jdk7] [withMaven] junitPublisher - Jenkins JUnit Attachments Plugin not found, can't
publish test attachments.Recording test results
[linux-jdk7] None of the test reports contained any result
[linux-jdk7] [withMaven] junitPublisher - Archive test results for Maven artifact org.apache.maven.plugins.project-info-reports.its:main:1.0-SNAPSHOT
generated by maven-surefire-plugin:test (default-test): m/target/it/multi-module/main/target/surefire-reports/*.xml
[linux-jdk7] [withMaven] junitPublisher - Jenkins JUnit Attachments Plugin not found, can't
publish test attachments.Recording test results
[linux-jdk7] None of the test reports contained any result
[linux-jdk7] [withMaven] openTasksPublisher - Scan Tasks for Maven artifact org.apache.maven.plugins.project-info-reports.its:dep:1.0-SNAPSHOT
in source directory m/target/it/multi-module/dep/src/main/java
[linux-jdk7] [withMaven] openTasksPublisher - Scan Tasks for Maven artifact org.apache.maven.plugins.project-info-reports.its:main:1.0-SNAPSHOT
in source directory m/target/it/multi-module/main/src/main/java
[linux-jdk7] [TASKS] Scanning folder '/home/jenkins/jenkins-slave/workspace/nfo-reports-plugin_MPIR-366-S464FI4ATSVOULE3N7MCKV5FYYG6GVHDD7OLISMYBGUEPLQM2UNA'
for files matching the pattern 'm/target/it/multi-module/dep/src/main/java/**/*,m/target/it/multi-module/main/src/main/java/**/*'
- excludes: null
[linux-jdk7] [TASKS] Found 2 files to scan for tasks
[linux-jdk7] [TASKS] Found 0 open tasks.
[linux-jdk7] Skipping warnings blame since pipelines do not have an SCM link.%n
[linux-jdk7] [TASKS] Computing warning deltas based on reference build #11
[linux-jdk7] [withMaven] One or multiple Maven executions have been ignored by the Jenkins
Pipeline Maven Plugin because they have been interrupted before completion (2). See Pipeline
Maven Plugin FAQ for more details.
[Pipeline] [linux-jdk7] // withMaven
[Pipeline] [linux-jdk7] echo
[linux-jdk7] [FAIL FAST] linux-jdk10 had first failure, ignoring script returned exit code
143
[Pipeline] [linux-jdk7] }
[Pipeline] [linux-jdk8] }
[Pipeline] [linux-jdk9] }
[Pipeline] [linux-jdk7] // stage
[Pipeline] [linux-jdk8] // dir
[Pipeline] [linux-jdk9] // dir
[Pipeline] [linux-jdk7] }
[Pipeline] [linux-jdk8] }
[linux-jdk8] [withMaven] junitPublisher - Archive test results for Maven artifact org.apache.maven.plugins.project-info-reports.its:dep:1.0-SNAPSHOT
generated by maven-surefire-plugin:test (default-test): m/target/it/multi-module/dep/target/surefire-reports/*.xml
[linux-jdk8] [withMaven] junitPublisher - Jenkins JUnit Attachments Plugin not found, can't
publish test attachments.Recording test results
[linux-jdk8] None of the test reports contained any result
[linux-jdk8] [withMaven] junitPublisher - Archive test results for Maven artifact org.apache.maven.plugins.project-info-reports.its:main:1.0-SNAPSHOT
generated by maven-surefire-plugin:test (default-test): m/target/it/multi-module/main/target/surefire-reports/*.xml
[linux-jdk8] [withMaven] junitPublisher - Jenkins JUnit Attachments Plugin not found, can't
publish test attachments.Recording test results
[linux-jdk8] None of the test reports contained any result
[linux-jdk8] [withMaven] One or multiple Maven executions have been ignored by the Jenkins
Pipeline Maven Plugin because they have been interrupted before completion (1). See Pipeline
Maven Plugin FAQ for more details.
[Pipeline] [linux-jdk9] }
[linux-jdk9] [withMaven] junitPublisher - Archive test results for Maven artifact org.apache.maven.plugins.project-info-reports.its:dep:1.0-SNAPSHOT
generated by maven-surefire-plugin:test (default-test): m/target/it/multi-module/dep/target/surefire-reports/*.xml
[linux-jdk9] [withMaven] junitPublisher - Jenkins JUnit Attachments Plugin not found, can't
publish test attachments.Recording test results
[linux-jdk9] None of the test reports contained any result
[linux-jdk9] [withMaven] junitPublisher - Archive test results for Maven artifact org.apache.maven.plugins.project-info-reports.its:main:1.0-SNAPSHOT
generated by maven-surefire-plugin:test (default-test): m/target/it/multi-module/main/target/surefire-reports/*.xml
[linux-jdk9] [withMaven] junitPublisher - Jenkins JUnit Attachments Plugin not found, can't
publish test attachments.Recording test results
[linux-jdk9] None of the test reports contained any result
[linux-jdk9] [withMaven] One or multiple Maven executions have been ignored by the Jenkins
Pipeline Maven Plugin because they have been interrupted before completion (2). See Pipeline
Maven Plugin FAQ for more details.
[Pipeline] [linux-jdk7] // node
[Pipeline] [linux-jdk8] // withMaven
[Pipeline] [linux-jdk9] // withMaven
[Pipeline] [linux-jdk7] }
[Pipeline] [linux-jdk8] echo
[linux-jdk8] [FAIL FAST] linux-jdk10 had first failure, ignoring script returned exit code
143
[Pipeline] [linux-jdk8] }
[Pipeline] [linux-jdk9] echo
[linux-jdk9] [FAIL FAST] linux-jdk10 had first failure, ignoring script returned exit code
143
[Pipeline] [linux-jdk9] }
[Pipeline] [linux-jdk8] // stage
[Pipeline] [linux-jdk9] // stage
[Pipeline] [linux-jdk8] }
[Pipeline] [linux-jdk9] }
[Pipeline] [linux-jdk8] // node
[Pipeline] [linux-jdk9] // node
[Pipeline] [linux-jdk8] }
[Pipeline] [linux-jdk9] }
[Pipeline] // parallel
[Pipeline] echo
***** FAST FAILURE *****

Fast failure triggered by linux-jdk10

***** FAST FAILURE *****
[Pipeline] stage
[Pipeline] { (Notifications)
[Pipeline] echo
Build result: FAILURE
[Pipeline] jiraIssueSelector
[Pipeline] jiraComment
[Pipeline] emailext
Mime
  • Unnamed multipart/mixed (inline, None, 0 bytes)
View raw message