maven-notifications mailing list archives

Site index · List index
Message view « Date » · « Thread »
Top « Date » · « Thread »
From Apache Jenkins Server <jenk...@builds.apache.org>
Subject Build failed in Jenkins: Maven TLP » maven-archetypes » master #8
Date Mon, 02 Apr 2018 21:50:27 GMT
See https://builds.apache.org/job/maven-box/job/maven-archetypes/job/master/8/

Changes:

* [maven-release-plugin] prepare for next development iteration
* [maven-release-plugin] prepare for next development iteration
* [maven-release-plugin] prepare for next development iteration

All tests passed

Build log:
[...truncated 1.26 MB...]
[linux-jdk9] [INFO] [INFO] Downloading from central: https://repo.maven.apache.org/maven2/commons-validator/commons-validator/1.4.1/commons-validator-1.4.1.jar
[linux-jdk9] [INFO] [INFO] Downloading from central: https://repo.maven.apache.org/maven2/commons-beanutils/commons-beanutils/1.8.3/commons-beanutils-1.8.3.jar
[linux-jdk9] [INFO] [INFO] Downloading from central: https://repo.maven.apache.org/maven2/commons-digester/commons-digester/1.8.1/commons-digester-1.8.1.jar
[linux-jdk9] [INFO] [INFO] Downloaded from central: https://repo.maven.apache.org/maven2/org/apache/maven/shared/maven-invoker/3.0.0/maven-invoker-3.0.0.jar
(33 kB at 1.8 MB/s)
[linux-jdk9] [INFO] [INFO] Downloading from central: https://repo.maven.apache.org/maven2/commons-logging/commons-logging/1.2/commons-logging-1.2.jar
[linux-jdk9] [INFO] [INFO] Downloaded from central: https://repo.maven.apache.org/maven2/org/apache/maven/reporting/maven-reporting-impl/2.4/maven-reporting-impl-2.4.jar
(20 kB at 996 kB/s)
[linux-jdk9] [INFO] [INFO] Downloading from central: https://repo.maven.apache.org/maven2/org/apache/maven/shared/maven-script-interpreter/1.2/maven-script-interpreter-1.2.jar
[linux-jdk9] [INFO] [INFO] Downloaded from central: https://repo.maven.apache.org/maven2/commons-digester/commons-digester/1.8.1/commons-digester-1.8.1.jar
(146 kB at 4.7 MB/s)
[linux-jdk9] [INFO] [INFO] Downloading from central: https://repo.maven.apache.org/maven2/org/apache/maven/shared/maven-artifact-transfer/0.9.1/maven-artifact-transfer-0.9.1.jar
[linux-jdk9] [INFO] [INFO] Downloaded from central: https://repo.maven.apache.org/maven2/commons-logging/commons-logging/1.2/commons-logging-1.2.jar
(62 kB at 2.0 MB/s)
[linux-jdk9] [INFO] [INFO] Downloading from central: https://repo.maven.apache.org/maven2/org/apache/maven/shared/maven-common-artifact-filters/3.0.1/maven-common-artifact-filters-3.0.1.jar
[linux-jdk9] [INFO] [INFO] Downloaded from central: https://repo.maven.apache.org/maven2/org/apache/maven/shared/maven-script-interpreter/1.2/maven-script-interpreter-1.2.jar
(22 kB at 711 kB/s)
[linux-jdk9] [INFO] [INFO] Downloading from central: https://repo.maven.apache.org/maven2/org/apache/maven/doxia/doxia-sink-api/1.7/doxia-sink-api-1.7.jar
[linux-jdk9] [INFO] [INFO] Downloaded from central: https://repo.maven.apache.org/maven2/commons-beanutils/commons-beanutils/1.8.3/commons-beanutils-1.8.3.jar
(232 kB at 6.4 MB/s)
[linux-jdk9] [INFO] [INFO] Downloading from central: https://repo.maven.apache.org/maven2/org/apache/maven/doxia/doxia-logging-api/1.7/doxia-logging-api-1.7.jar
[linux-jdk9] [INFO] [INFO] Downloaded from central: https://repo.maven.apache.org/maven2/commons-validator/commons-validator/1.4.1/commons-validator-1.4.1.jar
(190 kB at 4.0 MB/s)
[linux-jdk9] [INFO] [INFO] Downloading from central: https://repo.maven.apache.org/maven2/org/apache/maven/doxia/doxia-site-renderer/1.7.4/doxia-site-renderer-1.7.4.jar
[linux-jdk9] [INFO] [INFO] Downloaded from central: https://repo.maven.apache.org/maven2/org/apache/maven/shared/maven-common-artifact-filters/3.0.1/maven-common-artifact-filters-3.0.1.jar
(61 kB at 1.3 MB/s)
[linux-jdk9] [INFO] [INFO] Downloading from central: https://repo.maven.apache.org/maven2/org/apache/maven/doxia/doxia-decoration-model/1.7.4/doxia-decoration-model-1.7.4.jar
[linux-jdk9] [INFO] [INFO] Downloaded from central: https://repo.maven.apache.org/maven2/org/apache/maven/shared/maven-artifact-transfer/0.9.1/maven-artifact-transfer-0.9.1.jar
(123 kB at 2.4 MB/s)
[linux-jdk9] [INFO] [INFO] Downloading from central: https://repo.maven.apache.org/maven2/org/apache/maven/doxia/doxia-skin-model/1.7.4/doxia-skin-model-1.7.4.jar
[linux-jdk9] [INFO] [INFO] Downloaded from central: https://repo.maven.apache.org/maven2/org/apache/maven/doxia/doxia-sink-api/1.7/doxia-sink-api-1.7.jar
(11 kB at 228 kB/s)
[linux-jdk9] [INFO] [INFO] Downloading from central: https://repo.maven.apache.org/maven2/org/apache/maven/doxia/doxia-module-xhtml/1.7/doxia-module-xhtml-1.7.jar
[linux-jdk9] [INFO] [INFO] Downloaded from central: https://repo.maven.apache.org/maven2/org/apache/maven/doxia/doxia-logging-api/1.7/doxia-logging-api-1.7.jar
(12 kB at 203 kB/s)
[linux-jdk9] [INFO] [INFO] Downloading from central: https://repo.maven.apache.org/maven2/org/codehaus/groovy/groovy-all/2.4.8/groovy-all-2.4.8.jar
[linux-jdk9] [INFO] [INFO] Downloaded from central: https://repo.maven.apache.org/maven2/org/apache/maven/doxia/doxia-site-renderer/1.7.4/doxia-site-renderer-1.7.4.jar
(64 kB at 999 kB/s)
[linux-jdk9] [INFO] [INFO] Downloaded from central: https://repo.maven.apache.org/maven2/org/apache/maven/doxia/doxia-decoration-model/1.7.4/doxia-decoration-model-1.7.4.jar
(61 kB at 933 kB/s)
[linux-jdk9] [INFO] [INFO] Downloaded from central: https://repo.maven.apache.org/maven2/org/apache/maven/doxia/doxia-skin-model/1.7.4/doxia-skin-model-1.7.4.jar
(16 kB at 239 kB/s)
[linux-jdk9] [INFO] [INFO] Downloaded from central: https://repo.maven.apache.org/maven2/org/apache/maven/doxia/doxia-module-xhtml/1.7/doxia-module-xhtml-1.7.jar
(17 kB at 260 kB/s)
[linux-jdk9] [INFO] [INFO] Downloaded from central: https://repo.maven.apache.org/maven2/org/codehaus/groovy/groovy-all/2.4.8/groovy-all-2.4.8.jar
(7.0 MB at 28 MB/s)
[linux-jdk8] [INFO] [INFO]           simple-it/pom.xml ................................ FAILED
(4.2 s)
[linux-jdk8] [INFO] [INFO]   The build exited with code 143. See /home/jenkins/jenkins-slave/workspace/box_maven-archetypes_master-CWQIX33IMRENQAEK6YQUG4YRNL2FP25GOPO4YFHLPIHFEWUYVBDQ/m/maven-archetype-plugin/target/test-classes/projects/it-basic/project/basic-plugin/target/it/simple-it/build.log
for details.
[linux-jdk8] [INFO] [INFO] 
[linux-jdk8] [INFO] [INFO] --- maven-invoker-plugin:3.0.1:verify (integration-test) @ basic-plugin
---
[linux-jdk8] [INFO] [INFO] -------------------------------------------------
[linux-jdk8] [INFO] [INFO] Build Summary:
[linux-jdk8] [INFO] [INFO]   Passed: 0, Failed: 1, Errors: 0, Skipped: 0
[linux-jdk8] [INFO] [INFO] -------------------------------------------------
[linux-jdk8] [INFO] [ERROR] The following builds failed:
[linux-jdk8] [INFO] [ERROR] *  simple-it/pom.xml
[linux-jdk8] [INFO] [INFO] -------------------------------------------------
[linux-jdk8] [INFO] [INFO] ------------------------------------------------------------------------
[linux-jdk8] [INFO] [INFO] BUILD FAILURE
[linux-jdk8] [INFO] [INFO] ------------------------------------------------------------------------
[linux-jdk8] [INFO] [INFO] Total time: 13.447 s
[linux-jdk8] [INFO] [INFO] Finished at: 2018-04-02T21:49:29Z
[linux-jdk8] Terminated
[linux-jdk9] [INFO] [INFO] Installing /home/jenkins/jenkins-slave/workspace/box_maven-archetypes_master-CWQIX33IMRENQAEK6YQUG4YRNL2FP25GOPO4YFHLPIHFEWUYVBDQ/m/maven-archetype-plugin/target/test-classes/projects/it-basic/project/basic-plugin/pom.xml
to /home/jenkins/jenkins-slave/workspace/box_maven-archetypes_master-CWQIX33IMRENQAEK6YQUG4YRNL2FP25GOPO4YFHLPIHFEWUYVBDQ/m/maven-archetype-plugin/target/test-classes/projects/it-basic/project/basic-plugin/target/local-repo/archetype/it/basic-plugin/0.1-SNAPSHOT/basic-plugin-0.1-SNAPSHOT.pom
[linux-jdk9] [INFO] [INFO] Installing /home/jenkins/jenkins-slave/workspace/box_maven-archetypes_master-CWQIX33IMRENQAEK6YQUG4YRNL2FP25GOPO4YFHLPIHFEWUYVBDQ/m/maven-archetype-plugin/target/test-classes/projects/it-basic/project/basic-plugin/target/basic-plugin-0.1-SNAPSHOT.jar
to /home/jenkins/jenkins-slave/workspace/box_maven-archetypes_master-CWQIX33IMRENQAEK6YQUG4YRNL2FP25GOPO4YFHLPIHFEWUYVBDQ/m/maven-archetype-plugin/target/test-classes/projects/it-basic/project/basic-plugin/target/local-repo/archetype/it/basic-plugin/0.1-SNAPSHOT/basic-plugin-0.1-SNAPSHOT.jar
[linux-jdk9] [INFO] [INFO] 
[linux-jdk9] [INFO] [INFO] --- maven-invoker-plugin:3.0.1:integration-test (integration-test)
@ basic-plugin ---
[linux-jdk9] [INFO] [INFO] Running Setup Jobs
[linux-jdk9] [INFO] [INFO] Building: simple-it/pom.xml
[linux-jdk9] Sending interrupt signal to process
[linux-jdk10] Sending interrupt signal to process
[linux-jdk9] [INFO] [INFO] run post-build script verify.groovy
[linux-jdk9] [INFO] WARNING: An illegal reflective access operation has occurred
[linux-jdk9] [INFO] WARNING: Illegal reflective access by org.codehaus.groovy.reflection.CachedClass
(file:/home/jenkins/jenkins-slave/workspace/box_maven-archetypes_master-CWQIX33IMRENQAEK6YQUG4YRNL2FP25GOPO4YFHLPIHFEWUYVBDQ/.repository/org/codehaus/groovy/groovy-all/2.4.8/groovy-all-2.4.8.jar)
to method java.lang.Object.finalize()
[linux-jdk9] [INFO] WARNING: Please consider reporting this to the maintainers of org.codehaus.groovy.reflection.CachedClass
[linux-jdk9] [INFO] WARNING: Use --illegal-access=warn to enable warnings of further illegal
reflective access operations
[linux-jdk9] [INFO] WARNING: All illegal access operations will be denied in a future release
[linux-jdk9] [INFO] [INFO]           simple-it/pom.xml ................................ FAILED
(1.7 s)
[linux-jdk9] [INFO] [INFO]   The post-build script did not succeed. assert touchFile.isFile()
[linux-jdk9] [INFO]        |         |
[linux-jdk9] [INFO]        |         false
[linux-jdk9] [INFO]        /home/jenkins/jenkins-slave/workspace/box_maven-archetypes_master-CWQIX33IMRENQAEK6YQUG4YRNL2FP25GOPO4YFHLPIHFEWUYVBDQ/m/maven-archetype-plugin/target/test-classes/projects/it-basic/project/basic-plugin/target/it/simple-it/target/touch.txt
[linux-jdk9] [INFO] [INFO] 
[linux-jdk9] [INFO] [INFO] --- maven-invoker-plugin:3.0.1:verify (integration-test) @ basic-plugin
---
[linux-jdk9] [INFO] [INFO] -------------------------------------------------
[linux-jdk9] [INFO] [INFO] Build Summary:
[linux-jdk9] [INFO] [INFO]   Passed: 0, Failed: 1, Errors: 0, Skipped: 0
[linux-jdk9] [INFO] [INFO] -------------------------------------------------
[linux-jdk9] [INFO] [ERROR] The following builds failed:
[linux-jdk9] [INFO] [ERROR] *  simple-it/pom.xml
[linux-jdk9] [INFO] [INFO] -------------------------------------------------
[linux-jdk9] [INFO] [INFO] ------------------------------------------------------------------------
[linux-jdk9] [INFO] [INFO] BUILD FAILURE
[linux-jdk9] [INFO] [INFO] ------------------------------------------------------------------------
[linux-jdk9] [INFO] [INFO] Total time: 11.601 s
[linux-jdk9] [INFO] [INFO] Finished at: 2018-04-02T21:49:30Z
[Pipeline] [windows-jdk8] // stage
[Pipeline] [windows-jdk9] // stage
[Pipeline] [windows-jdk8] }
[Pipeline] [windows-jdk9] }
[Pipeline] [windows-jdk10] }
[linux-jdk9] Terminated
[Pipeline] [linux-jdk7] }
[Pipeline] [linux-jdk8] }
[Pipeline] [linux-jdk10] }
[Pipeline] [windows-jdk8] // node
[Pipeline] [windows-jdk9] // node
[Pipeline] [windows-jdk10] // dir
[Pipeline] [windows-jdk8] }
[Pipeline] [windows-jdk9] }
[Pipeline] [linux-jdk9] }
[Pipeline] [windows-jdk10] echo
[windows-jdk10] [FAIL FAST] windows-jdk7 had first failure, ignoring null
[Pipeline] [windows-jdk10] }
[Pipeline] [linux-jdk7] // dir
[Pipeline] [linux-jdk8] // dir
[Pipeline] [linux-jdk10] // dir
[Pipeline] [linux-jdk7] }
[linux-jdk7] [withMaven] artifactsPublisher - Archive artifact m/pom.xml under org/apache/maven/archetypes/maven-archetype-bundles/1.4-SNAPSHOT/maven-archetype-bundles-1.4-SNAPSHOT.pom
[linux-jdk7] [withMaven] artifactsPublisher - Archive artifact m/maven-archetype-archetype/pom.xml
under org/apache/maven/archetypes/maven-archetype-archetype/1.4-SNAPSHOT/maven-archetype-archetype-1.4-SNAPSHOT.pom
[linux-jdk7] [withMaven] artifactsPublisher - Archive artifact m/maven-archetype-archetype/target/maven-archetype-archetype-1.4-SNAPSHOT.jar
under org/apache/maven/archetypes/maven-archetype-archetype/1.4-SNAPSHOT/maven-archetype-archetype-1.4-SNAPSHOT.jar
[linux-jdk7] [withMaven] artifactsPublisher - Archive artifact m/maven-archetype-j2ee-simple/pom.xml
under org/apache/maven/archetypes/maven-archetype-j2ee-simple/1.4-SNAPSHOT/maven-archetype-j2ee-simple-1.4-SNAPSHOT.pom
[linux-jdk7] [withMaven] artifactsPublisher - Archive artifact m/maven-archetype-j2ee-simple/target/maven-archetype-j2ee-simple-1.4-SNAPSHOT.jar
under org/apache/maven/archetypes/maven-archetype-j2ee-simple/1.4-SNAPSHOT/maven-archetype-j2ee-simple-1.4-SNAPSHOT.jar
[linux-jdk7] [withMaven] artifactsPublisher - Archive artifact m/target/maven-archetype-bundles-1.4-SNAPSHOT-site.xml
under org/apache/maven/archetypes/maven-archetype-bundles/1.4-SNAPSHOT/maven-archetype-bundles-1.4-SNAPSHOT-site.xml
[linux-jdk7] [Fast Archiver] No prior successful build to compare, so performing full copy
of artifacts
[linux-jdk7] [withMaven] artifactsPublisher - Archive artifact m/maven-archetype-archetype/target/test-classes/projects/it-basic/project/basic-archetype/pom.xml
under archetype/it/basic-archetype/0.1-SNAPSHOT/basic-archetype-0.1-SNAPSHOT.pom
[linux-jdk7] [withMaven] artifactsPublisher - Archive artifact m/maven-archetype-archetype/target/test-classes/projects/it-basic/project/basic-archetype/target/basic-archetype-0.1-SNAPSHOT.jar
under archetype/it/basic-archetype/0.1-SNAPSHOT/basic-archetype-0.1-SNAPSHOT.jar
[linux-jdk7] [Fast Archiver] No prior successful build to compare, so performing full copy
of artifacts
[linux-jdk7] [withMaven] artifactsPublisher - Archive artifact m/maven-archetype-archetype/target/test-classes/projects/it-basic/project/basic-archetype/target/test-classes/projects/it-basic/project/basic-project/pom.xml
under archetype/it/basic-project/0.1-SNAPSHOT/basic-project-0.1-SNAPSHOT.pom
[linux-jdk7] [withMaven] artifactsPublisher - Archive artifact m/maven-archetype-archetype/target/test-classes/projects/it-basic/project/basic-archetype/target/test-classes/projects/it-basic/project/basic-project/target/basic-project-0.1-SNAPSHOT.jar
under archetype/it/basic-project/0.1-SNAPSHOT/basic-project-0.1-SNAPSHOT.jar
[linux-jdk7] [Fast Archiver] No prior successful build to compare, so performing full copy
of artifacts
[linux-jdk7] [withMaven] junitPublisher - Archive test results for Maven artifact archetype.it:basic-project:0.1-SNAPSHOT
generated by maven-surefire-plugin:test (default-test): m/maven-archetype-archetype/target/test-classes/projects/it-basic/project/basic-archetype/target/test-classes/projects/it-basic/project/basic-project/target/surefire-reports/*.xml
[linux-jdk7] [withMaven] junitPublisher - Jenkins JUnit Attachments Plugin not found, can't
publish test attachments.Recording test results
[linux-jdk7] [withMaven] openTasksPublisher - Scan Tasks for Maven artifact archetype.it:basic-project:0.1-SNAPSHOT
in source directory m/maven-archetype-archetype/target/test-classes/projects/it-basic/project/basic-archetype/target/test-classes/projects/it-basic/project/basic-project/src/main/java
[linux-jdk7] [TASKS] Scanning folder '/home/jenkins/jenkins-slave/workspace/box_maven-archetypes_master-CWQIX33IMRENQAEK6YQUG4YRNL2FP25GOPO4YFHLPIHFEWUYVBDQ'
for files matching the pattern 'm/maven-archetype-archetype/target/test-classes/projects/it-basic/project/basic-archetype/target/test-classes/projects/it-basic/project/basic-project/src/main/java/**/*'
- excludes: null
[linux-jdk7] [TASKS] Found 1 files to scan for tasks
[linux-jdk7] [TASKS] Found 0 open tasks.
[linux-jdk7] Skipping warnings blame since pipelines do not have an SCM link.%n
[linux-jdk7] [withMaven] artifactsPublisher - Archive artifact m/maven-archetype-j2ee-simple/target/test-classes/projects/it-basic/project/basic-j2ee-simple/pom.xml
under archetype/it/basic-j2ee-simple/0.1-SNAPSHOT/basic-j2ee-simple-0.1-SNAPSHOT.pom
[linux-jdk7] [withMaven] artifactsPublisher - Archive artifact m/maven-archetype-j2ee-simple/target/test-classes/projects/it-basic/project/basic-j2ee-simple/projects/pom.xml
under archetype/it/projects/0.1-SNAPSHOT/projects-0.1-SNAPSHOT.pom
[linux-jdk7] [withMaven] artifactsPublisher - Archive artifact m/maven-archetype-j2ee-simple/target/test-classes/projects/it-basic/project/basic-j2ee-simple/projects/logging/pom.xml
under archetype/it/logging/0.1-SNAPSHOT/logging-0.1-SNAPSHOT.pom
[linux-jdk7] [withMaven] artifactsPublisher - Archive artifact m/maven-archetype-j2ee-simple/target/test-classes/projects/it-basic/project/basic-j2ee-simple/projects/logging/target/logging-0.1-SNAPSHOT.jar
under archetype/it/logging/0.1-SNAPSHOT/logging-0.1-SNAPSHOT.jar
[linux-jdk7] [withMaven] artifactsPublisher - Archive artifact m/maven-archetype-j2ee-simple/target/test-classes/projects/it-basic/project/basic-j2ee-simple/primary-source/pom.xml
under archetype/it/primary-source/0.1-SNAPSHOT/primary-source-0.1-SNAPSHOT.pom
[linux-jdk7] [withMaven] artifactsPublisher - Archive artifact m/maven-archetype-j2ee-simple/target/test-classes/projects/it-basic/project/basic-j2ee-simple/primary-source/target/primary-source-0.1-SNAPSHOT.jar
under archetype/it/primary-source/0.1-SNAPSHOT/primary-source-0.1-SNAPSHOT.jar
[linux-jdk7] [withMaven] artifactsPublisher - Archive artifact m/maven-archetype-j2ee-simple/target/test-classes/projects/it-basic/project/basic-j2ee-simple/servlets/pom.xml
under archetype/it/servlets/0.1-SNAPSHOT/servlets-0.1-SNAPSHOT.pom
[linux-jdk7] [withMaven] artifactsPublisher - Archive artifact m/maven-archetype-j2ee-simple/target/test-classes/projects/it-basic/project/basic-j2ee-simple/servlets/servlet/pom.xml
under archetype/it/servlet/0.1-SNAPSHOT/servlet-0.1-SNAPSHOT.pom
[linux-jdk7] [withMaven] artifactsPublisher - Archive artifact m/maven-archetype-j2ee-simple/target/test-classes/projects/it-basic/project/basic-j2ee-simple/servlets/servlet/target/servlet-0.1-SNAPSHOT.war
under archetype/it/servlet/0.1-SNAPSHOT/servlet-0.1-SNAPSHOT.war
[linux-jdk7] [withMaven] artifactsPublisher - Archive artifact m/maven-archetype-j2ee-simple/target/test-classes/projects/it-basic/project/basic-j2ee-simple/ejbs/pom.xml
under archetype/it/ejbs/0.1-SNAPSHOT/ejbs-0.1-SNAPSHOT.pom
[linux-jdk7] [withMaven] artifactsPublisher - Archive artifact m/maven-archetype-j2ee-simple/target/test-classes/projects/it-basic/project/basic-j2ee-simple/ejbs/target/ejbs-0.1-SNAPSHOT.jar
under archetype/it/ejbs/0.1-SNAPSHOT/ejbs-0.1-SNAPSHOT.jar
[linux-jdk7] [withMaven] artifactsPublisher - Archive artifact m/maven-archetype-j2ee-simple/target/test-classes/projects/it-basic/project/basic-j2ee-simple/ear/pom.xml
under archetype/it/ear/0.1-SNAPSHOT/ear-0.1-SNAPSHOT.pom
[linux-jdk7] [withMaven] artifactsPublisher - Archive artifact m/maven-archetype-j2ee-simple/target/test-classes/projects/it-basic/project/basic-j2ee-simple/ear/target/ear-0.1-SNAPSHOT.ear
under archetype/it/ear/0.1-SNAPSHOT/ear-0.1-SNAPSHOT.ear
[linux-jdk7] [Fast Archiver] No prior successful build to compare, so performing full copy
of artifacts
[linux-jdk7] [withMaven] junitPublisher - Archive test results for Maven artifact archetype.it:logging:0.1-SNAPSHOT
generated by maven-surefire-plugin:test (default-test): m/maven-archetype-j2ee-simple/target/test-classes/projects/it-basic/project/basic-j2ee-simple/projects/logging/target/surefire-reports/*.xml
[linux-jdk7] [withMaven] junitPublisher - Jenkins JUnit Attachments Plugin not found, can't
publish test attachments.Recording test results
[linux-jdk7] None of the test reports contained any result
[linux-jdk7] [withMaven] junitPublisher - Archive test results for Maven artifact archetype.it:primary-source:0.1-SNAPSHOT
generated by maven-surefire-plugin:test (default-test): m/maven-archetype-j2ee-simple/target/test-classes/projects/it-basic/project/basic-j2ee-simple/primary-source/target/surefire-reports/*.xml
[linux-jdk7] [withMaven] junitPublisher - Jenkins JUnit Attachments Plugin not found, can't
publish test attachments.Recording test results
[linux-jdk7] None of the test reports contained any result
[linux-jdk7] [withMaven] junitPublisher - Archive test results for Maven artifact archetype.it:servlet:0.1-SNAPSHOT
generated by maven-surefire-plugin:test (default-test): m/maven-archetype-j2ee-simple/target/test-classes/projects/it-basic/project/basic-j2ee-simple/servlets/servlet/target/surefire-reports/*.xml
[linux-jdk7] [withMaven] junitPublisher - Jenkins JUnit Attachments Plugin not found, can't
publish test attachments.Recording test results
[linux-jdk7] None of the test reports contained any result
[linux-jdk7] [withMaven] junitPublisher - Archive test results for Maven artifact archetype.it:ejbs:0.1-SNAPSHOT
generated by maven-surefire-plugin:test (default-test): m/maven-archetype-j2ee-simple/target/test-classes/projects/it-basic/project/basic-j2ee-simple/ejbs/target/surefire-reports/*.xml
[linux-jdk7] [withMaven] junitPublisher - Jenkins JUnit Attachments Plugin not found, can't
publish test attachments.Recording test results
[linux-jdk7] None of the test reports contained any result
[linux-jdk7] [withMaven] openTasksPublisher - Scan Tasks for Maven artifact archetype.it:logging:0.1-SNAPSHOT
in source directory m/maven-archetype-j2ee-simple/target/test-classes/projects/it-basic/project/basic-j2ee-simple/projects/logging/src/main/java
[linux-jdk7] [withMaven] openTasksPublisher - Scan Tasks for Maven artifact archetype.it:primary-source:0.1-SNAPSHOT
in source directory m/maven-archetype-j2ee-simple/target/test-classes/projects/it-basic/project/basic-j2ee-simple/primary-source/src/main/java
[linux-jdk7] [withMaven] openTasksPublisher - Scan Tasks for Maven artifact archetype.it:servlet:0.1-SNAPSHOT
in source directory m/maven-archetype-j2ee-simple/target/test-classes/projects/it-basic/project/basic-j2ee-simple/servlets/servlet/src/main/java
[linux-jdk7] [withMaven] openTasksPublisher - Scan Tasks for Maven artifact archetype.it:ejbs:0.1-SNAPSHOT
in source directory m/maven-archetype-j2ee-simple/target/test-classes/projects/it-basic/project/basic-j2ee-simple/ejbs/src/main/java
[linux-jdk7] [withMaven] openTasksPublisher - Scan Tasks for Maven artifact archetype.it:ear:0.1-SNAPSHOT
in source directory m/maven-archetype-j2ee-simple/target/test-classes/projects/it-basic/project/basic-j2ee-simple/ear/src/main/java
[linux-jdk7] [TASKS] Scanning folder '/home/jenkins/jenkins-slave/workspace/box_maven-archetypes_master-CWQIX33IMRENQAEK6YQUG4YRNL2FP25GOPO4YFHLPIHFEWUYVBDQ'
for files matching the pattern 'm/maven-archetype-j2ee-simple/target/test-classes/projects/it-basic/project/basic-j2ee-simple/projects/logging/src/main/java/**/*,m/maven-archetype-j2ee-simple/target/test-classes/projects/it-basic/project/basic-j2ee-simple/primary-source/src/main/java/**/*,m/maven-archetype-j2ee-simple/target/test-classes/projects/it-basic/project/basic-j2ee-simple/servlets/servlet/src/main/java/**/*,m/maven-archetype-j2ee-simple/target/test-classes/projects/it-basic/project/basic-j2ee-simple/ejbs/src/main/java/**/*,m/maven-archetype-j2ee-simple/target/test-classes/projects/it-basic/project/basic-j2ee-simple/ear/src/main/java/**/*'
- excludes: null
[linux-jdk7] [TASKS] Found 0 files to scan for tasks
[linux-jdk7] [TASKS] Found 0 open tasks.
[linux-jdk7] Skipping warnings blame since pipelines do not have an SCM link.%n
[Pipeline] [linux-jdk8] }
[linux-jdk8] [withMaven] junitPublisher - Archive test results for Maven artifact archetype.it:basic-project:0.1-SNAPSHOT
generated by maven-surefire-plugin:test (default-test): m/maven-archetype-archetype/target/test-classes/projects/it-basic/project/basic-archetype/target/test-classes/projects/it-basic/project/basic-project/target/surefire-reports/*.xml
[linux-jdk8] [withMaven] junitPublisher - Jenkins JUnit Attachments Plugin not found, can't
publish test attachments.Recording test results
[linux-jdk8] [withMaven] junitPublisher - Archive test results for Maven artifact archetype.it:logging:0.1-SNAPSHOT
generated by maven-surefire-plugin:test (default-test): m/maven-archetype-j2ee-simple/target/test-classes/projects/it-basic/project/basic-j2ee-simple/projects/logging/target/surefire-reports/*.xml
[linux-jdk8] [withMaven] junitPublisher - Jenkins JUnit Attachments Plugin not found, can't
publish test attachments.Recording test results
[linux-jdk8] None of the test reports contained any result
[linux-jdk8] [withMaven] junitPublisher - Archive test results for Maven artifact archetype.it:primary-source:0.1-SNAPSHOT
generated by maven-surefire-plugin:test (default-test): m/maven-archetype-j2ee-simple/target/test-classes/projects/it-basic/project/basic-j2ee-simple/primary-source/target/surefire-reports/*.xml
[linux-jdk8] [withMaven] junitPublisher - Jenkins JUnit Attachments Plugin not found, can't
publish test attachments.Recording test results
[linux-jdk8] None of the test reports contained any result
[linux-jdk8] [withMaven] junitPublisher - Archive test results for Maven artifact archetype.it:servlet:0.1-SNAPSHOT
generated by maven-surefire-plugin:test (default-test): m/maven-archetype-j2ee-simple/target/test-classes/projects/it-basic/project/basic-j2ee-simple/servlets/servlet/target/surefire-reports/*.xml
[linux-jdk8] [withMaven] junitPublisher - Jenkins JUnit Attachments Plugin not found, can't
publish test attachments.Recording test results
[linux-jdk8] None of the test reports contained any result
[linux-jdk8] [withMaven] junitPublisher - Archive test results for Maven artifact archetype.it:ejbs:0.1-SNAPSHOT
generated by maven-surefire-plugin:test (default-test): m/maven-archetype-j2ee-simple/target/test-classes/projects/it-basic/project/basic-j2ee-simple/ejbs/target/surefire-reports/*.xml
[linux-jdk8] [withMaven] junitPublisher - Jenkins JUnit Attachments Plugin not found, can't
publish test attachments.Recording test results
[linux-jdk8] None of the test reports contained any result
[linux-jdk8] [withMaven] One or multiple Maven executions have been ignored by the Jenkins
Pipeline Maven Plugin because they have been interrupted before completion (3). See Pipeline
Maven Plugin FAQ for more details.
[Pipeline] [linux-jdk10] }
[linux-jdk10] [withMaven] junitPublisher - Archive test results for Maven artifact archetype.it:basic-project:0.1-SNAPSHOT
generated by maven-surefire-plugin:test (default-test): m/maven-archetype-archetype/target/test-classes/projects/it-basic/project/basic-archetype/target/test-classes/projects/it-basic/project/basic-project/target/surefire-reports/*.xml
[linux-jdk10] [withMaven] junitPublisher - Jenkins JUnit Attachments Plugin not found, can't
publish test attachments.Recording test results
[linux-jdk10] None of the test reports contained any result
[Pipeline] [linux-jdk9] // dir
[Pipeline] [windows-jdk10] // stage
[Pipeline] [linux-jdk9] }
[linux-jdk9] [withMaven] junitPublisher - Archive test results for Maven artifact archetype.it:basic-project:0.1-SNAPSHOT
generated by maven-surefire-plugin:test (default-test): m/maven-archetype-archetype/target/test-classes/projects/it-basic/project/basic-archetype/target/test-classes/projects/it-basic/project/basic-project/target/surefire-reports/*.xml
[linux-jdk9] [withMaven] junitPublisher - Jenkins JUnit Attachments Plugin not found, can't
publish test attachments.Recording test results
[linux-jdk9] [withMaven] junitPublisher - Archive test results for Maven artifact archetype.it:logging:0.1-SNAPSHOT
generated by maven-surefire-plugin:test (default-test): m/maven-archetype-j2ee-simple/target/test-classes/projects/it-basic/project/basic-j2ee-simple/projects/logging/target/surefire-reports/*.xml
[linux-jdk9] [withMaven] junitPublisher - Jenkins JUnit Attachments Plugin not found, can't
publish test attachments.Recording test results
[linux-jdk9] None of the test reports contained any result
[linux-jdk9] [withMaven] junitPublisher - Archive test results for Maven artifact archetype.it:primary-source:0.1-SNAPSHOT
generated by maven-surefire-plugin:test (default-test): m/maven-archetype-j2ee-simple/target/test-classes/projects/it-basic/project/basic-j2ee-simple/primary-source/target/surefire-reports/*.xml
[linux-jdk9] [withMaven] junitPublisher - Jenkins JUnit Attachments Plugin not found, can't
publish test attachments.Recording test results
[linux-jdk9] None of the test reports contained any result
[linux-jdk9] [withMaven] junitPublisher - Archive test results for Maven artifact archetype.it:servlet:0.1-SNAPSHOT
generated by maven-surefire-plugin:test (default-test): m/maven-archetype-j2ee-simple/target/test-classes/projects/it-basic/project/basic-j2ee-simple/servlets/servlet/target/surefire-reports/*.xml
[linux-jdk9] [withMaven] junitPublisher - Jenkins JUnit Attachments Plugin not found, can't
publish test attachments.Recording test results
[linux-jdk9] None of the test reports contained any result
[linux-jdk9] [withMaven] junitPublisher - Archive test results for Maven artifact archetype.it:ejbs:0.1-SNAPSHOT
generated by maven-surefire-plugin:test (default-test): m/maven-archetype-j2ee-simple/target/test-classes/projects/it-basic/project/basic-j2ee-simple/ejbs/target/surefire-reports/*.xml
[linux-jdk9] [withMaven] junitPublisher - Jenkins JUnit Attachments Plugin not found, can't
publish test attachments.Recording test results
[linux-jdk9] None of the test reports contained any result
[linux-jdk9] [withMaven] One or multiple Maven executions have been ignored by the Jenkins
Pipeline Maven Plugin because they have been interrupted before completion (2). See Pipeline
Maven Plugin FAQ for more details.
[Pipeline] [windows-jdk10] stage
[Pipeline] [windows-jdk10] { (Build windows-jdk10)
[Pipeline] [windows-jdk10] echo
[windows-jdk10] [FAIL FAST] windows-jdk7 has failed. Skipping windows-jdk10.
[Pipeline] [windows-jdk10] }
[Pipeline] [linux-jdk7] // withMaven
[Pipeline] [linux-jdk8] // withMaven
[Pipeline] [linux-jdk10] // withMaven
[Pipeline] [linux-jdk7] echo
[linux-jdk7] [FAIL FAST] windows-jdk7 had first failure, ignoring script returned exit code
1
[Pipeline] [linux-jdk7] }
[Pipeline] [linux-jdk8] echo
[linux-jdk8] [FAIL FAST] windows-jdk7 had first failure, ignoring script returned exit code
143
[Pipeline] [linux-jdk8] }
[Pipeline] [linux-jdk10] echo
[linux-jdk10] [FAIL FAST] windows-jdk7 had first failure, ignoring script returned exit code
1
[Pipeline] [linux-jdk10] }
[Pipeline] [linux-jdk9] // withMaven
[Pipeline] [linux-jdk9] echo
[linux-jdk9] [FAIL FAST] windows-jdk7 had first failure, ignoring script returned exit code
143
[Pipeline] [linux-jdk9] }
[Pipeline] [windows-jdk10] // stage
[Pipeline] [windows-jdk10] }
[Pipeline] [linux-jdk7] // stage
[Pipeline] [linux-jdk8] // stage
[Pipeline] [linux-jdk10] // stage
[Pipeline] [linux-jdk8] }
[Pipeline] [linux-jdk7] }
[Pipeline] [linux-jdk10] }
[Pipeline] [linux-jdk9] // stage
[Pipeline] [linux-jdk9] }
[Pipeline] [windows-jdk10] // node
[Pipeline] [windows-jdk10] }
[Pipeline] [linux-jdk8] // node
[Pipeline] [linux-jdk7] // node
[Pipeline] [linux-jdk10] // node
[Pipeline] [linux-jdk7] }
[Pipeline] [linux-jdk8] }
[Pipeline] [linux-jdk10] }
[Pipeline] [linux-jdk9] // node
[Pipeline] [linux-jdk9] }
[Pipeline] // parallel
[Pipeline] echo
***** FAST FAILURE *****

Fast failure triggered by windows-jdk7

***** FAST FAILURE *****
[Pipeline] stage
[Pipeline] { (Notifications)
[Pipeline] echo
Build result: FAILURE
[Pipeline] jiraIssueSelector
[Pipeline] emailext
Mime
  • Unnamed multipart/mixed (inline, None, 0 bytes)
View raw message