maven-notifications mailing list archives

Site index · List index
Message view « Date » · « Thread »
Top « Date » · « Thread »
From Apache Jenkins Server <jenk...@builds.apache.org>
Subject Build failed in Jenkins: Maven TLP » maven-doxia » DOXIA-572 #2
Date Sat, 07 Apr 2018 17:26:35 GMT
See https://builds.apache.org/job/maven-box/job/maven-doxia/job/DOXIA-572/2/

Changes:

* [DOXIA-573]- Upgrade mave-surefire/failsafe-plugin 2.21.0
* [DOXIA-572] - Upgrade parent to 31
* [DOXIA-573]- Upgrade mave-surefire/failsafe-plugin 2.21.0
* [DOXIA-572] - Upgrade parent to 31
* [DOXIA-573]- Upgrade mave-surefire/failsafe-plugin 2.21.0
* [DOXIA-572] - Upgrade parent to 31
* [DOXIA-573]- Upgrade mave-surefire/failsafe-plugin 2.21.0
* [DOXIA-572] - Upgrade parent to 31
* [DOXIA-573]- Upgrade mave-surefire/failsafe-plugin 2.21.0
* [DOXIA-572] - Upgrade parent to 31
* [DOXIA-573]- Upgrade mave-surefire/failsafe-plugin 2.21.0
* [DOXIA-572] - Upgrade parent to 31
* [DOXIA-573]- Upgrade mave-surefire/failsafe-plugin 2.21.0
* [DOXIA-572] - Upgrade parent to 31
* [DOXIA-573]- Upgrade mave-surefire/failsafe-plugin 2.21.0
* [DOXIA-572] - Upgrade parent to 31

All tests passed

Build log:
[...truncated 1.25 MB...]
[linux-jdk9] [INFO] --- maven-remote-resources-plugin:1.5:process (process-resource-bundles)
@ doxia-modules ---
[linux-jdk9] [INFO] 
[linux-jdk9] [INFO] <<< clirr-maven-plugin:2.8:check (default) < compile @ doxia-modules
<<<
[linux-jdk9] [INFO] 
[linux-jdk9] [INFO] 
[linux-jdk9] [INFO] --- clirr-maven-plugin:2.8:check (default) @ doxia-modules ---
[linux-jdk9] [INFO] Not generating Clirr report as there are no classes generated by the project
[linux-jdk9] [INFO] 
[linux-jdk9] [INFO] ------------------------------------------------------------------------
[linux-jdk9] [INFO] Building Doxia :: APT Module 1.9-SNAPSHOT
[linux-jdk9] [INFO] ------------------------------------------------------------------------
[linux-jdk9] [INFO] 
[linux-jdk9] [INFO] --- maven-clean-plugin:3.0.0:clean (default-clean) @ doxia-module-apt
---
[linux-jdk9] [INFO] 
[linux-jdk9] [INFO] --- maven-enforcer-plugin:1.4.1:enforce (enforce-maven-version) @ doxia-module-apt
---
[linux-jdk9] [INFO] 
[linux-jdk9] [INFO] --- maven-enforcer-plugin:1.4.1:enforce (enforce-bytecode-version) @ doxia-module-apt
---
[linux-jdk9] [INFO] 
[linux-jdk9] [INFO] --- maven-enforcer-plugin:1.4.1:enforce (ban-known-bad-maven-versions)
@ doxia-module-apt ---
[linux-jdk9] [INFO] 
[linux-jdk9] [INFO] --- apache-rat-plugin:0.12:check (rat-check) @ doxia-module-apt ---
[linux-jdk9] [INFO] Enabled default license matchers.
[linux-jdk9] [INFO] Will parse SCM ignores for exclusions...
[linux-jdk9] [INFO] Finished adding exclusions from SCM ignore files.
[linux-jdk9] [INFO] 61 implicit excludes (use -debug for more details).
[linux-jdk9] [INFO] Exclude: src/test/resources/**/*.apt
[linux-jdk9] [INFO] Exclude: src/test/resources/**/*.apt.vm
[linux-jdk9] [INFO] Exclude: src/test/resources/**/*.confluence
[linux-jdk9] [INFO] Exclude: src/test/site/**/*.confluence
[linux-jdk9] [INFO] Exclude: src/test/resources/**/*.twiki
[linux-jdk9] [INFO] Exclude: src/test/resources/**/*.md
[linux-jdk9] [INFO] Exclude: .repository/**
[linux-jdk9] [INFO] Exclude: .maven/spy.log
[linux-jdk9] [INFO] Exclude: dependency-reduced-pom.xml
[linux-jdk9] [INFO] Exclude: .java-version
[linux-jdk9] [INFO] 16 resources included (use -debug for more details)
[linux-jdk9] [INFO] Rat check: Summary over all files. Unapproved: 0, unknown: 0, generated:
0, approved: 16 licenses.
[linux-jdk9] [INFO] 
[linux-jdk9] [INFO] --- maven-remote-resources-plugin:1.5:process (process-resource-bundles)
@ doxia-module-apt ---
[linux-jdk9] [INFO] 
[linux-jdk9] [INFO] --- maven-resources-plugin:3.0.2:resources (default-resources) @ doxia-module-apt
---
[linux-jdk9] [INFO] Using 'UTF-8' encoding to copy filtered resources.
[linux-jdk9] [INFO] skip non existing resourceDirectory /home/jenkins/jenkins-slave/workspace/n-box_maven-doxia_DOXIA-572-5R4NBZTF6OOVPHGZS5FHJPBGRCYJ7S7J6B5UOTIUNEFPJ4N4ZRYQ/m/doxia-modules/doxia-module-apt/src/main/resources
[linux-jdk9] [INFO] skip non existing resourceDirectory /home/jenkins/jenkins-slave/workspace/n-box_maven-doxia_DOXIA-572-5R4NBZTF6OOVPHGZS5FHJPBGRCYJ7S7J6B5UOTIUNEFPJ4N4ZRYQ/m/doxia-modules/doxia-module-apt/target/generated-site/xsd
[linux-jdk9] [INFO] Copying 3 resources
[linux-jdk9] [INFO] 
[linux-jdk9] [INFO] --- maven-compiler-plugin:3.7.0:compile (default-compile) @ doxia-module-apt
---
[linux-jdk9] [INFO] Changes detected - recompiling the module!
[linux-jdk9] [INFO] Compiling 9 source files to /home/jenkins/jenkins-slave/workspace/n-box_maven-doxia_DOXIA-572-5R4NBZTF6OOVPHGZS5FHJPBGRCYJ7S7J6B5UOTIUNEFPJ4N4ZRYQ/m/doxia-modules/doxia-module-apt/target/classes
[linux-jdk9] [INFO] /home/jenkins/jenkins-slave/workspace/n-box_maven-doxia_DOXIA-572-5R4NBZTF6OOVPHGZS5FHJPBGRCYJ7S7J6B5UOTIUNEFPJ4N4ZRYQ/m/doxia-modules/doxia-module-apt/src/main/java/org/apache/maven/doxia/module/apt/AptParser.java:
/home/jenkins/jenkins-slave/workspace/n-box_maven-doxia_DOXIA-572-5R4NBZTF6OOVPHGZS5FHJPBGRCYJ7S7J6B5UOTIUNEFPJ4N4ZRYQ/m/doxia-modules/doxia-module-apt/src/main/java/org/apache/maven/doxia/module/apt/AptParser.java
uses or overrides a deprecated API.
[linux-jdk9] [INFO] /home/jenkins/jenkins-slave/workspace/n-box_maven-doxia_DOXIA-572-5R4NBZTF6OOVPHGZS5FHJPBGRCYJ7S7J6B5UOTIUNEFPJ4N4ZRYQ/m/doxia-modules/doxia-module-apt/src/main/java/org/apache/maven/doxia/module/apt/AptParser.java:
Recompile with -Xlint:deprecation for details.
[linux-jdk9] [INFO] 
[linux-jdk9] [INFO] --- plexus-component-metadata:1.7.1:generate-metadata (default) @ doxia-module-apt
---
[linux-jdk9] [INFO] Discovered 3 component descriptors(s)
[linux-jdk9] [INFO] 
[linux-jdk9] [INFO] --- maven-resources-plugin:3.0.2:testResources (default-testResources)
@ doxia-module-apt ---
[linux-jdk9] [INFO] Using 'UTF-8' encoding to copy filtered resources.
[linux-jdk9] [INFO] Copying 7 resources
[linux-jdk9] [INFO] Copying 3 resources
[linux-jdk9] [INFO] 
[linux-jdk9] [INFO] --- maven-compiler-plugin:3.7.0:testCompile (default-testCompile) @ doxia-module-apt
---
[linux-jdk9] [INFO] Changes detected - recompiling the module!
[linux-jdk9] [INFO] Compiling 4 source files to /home/jenkins/jenkins-slave/workspace/n-box_maven-doxia_DOXIA-572-5R4NBZTF6OOVPHGZS5FHJPBGRCYJ7S7J6B5UOTIUNEFPJ4N4ZRYQ/m/doxia-modules/doxia-module-apt/target/test-classes
[linux-jdk9] [INFO] /home/jenkins/jenkins-slave/workspace/n-box_maven-doxia_DOXIA-572-5R4NBZTF6OOVPHGZS5FHJPBGRCYJ7S7J6B5UOTIUNEFPJ4N4ZRYQ/m/doxia-modules/doxia-module-apt/src/test/java/org/apache/maven/doxia/module/apt/AptUtilsTest.java:
/home/jenkins/jenkins-slave/workspace/n-box_maven-doxia_DOXIA-572-5R4NBZTF6OOVPHGZS5FHJPBGRCYJ7S7J6B5UOTIUNEFPJ4N4ZRYQ/m/doxia-modules/doxia-module-apt/src/test/java/org/apache/maven/doxia/module/apt/AptUtilsTest.java
uses or overrides a deprecated API.
[linux-jdk9] [INFO] /home/jenkins/jenkins-slave/workspace/n-box_maven-doxia_DOXIA-572-5R4NBZTF6OOVPHGZS5FHJPBGRCYJ7S7J6B5UOTIUNEFPJ4N4ZRYQ/m/doxia-modules/doxia-module-apt/src/test/java/org/apache/maven/doxia/module/apt/AptUtilsTest.java:
Recompile with -Xlint:deprecation for details.
[linux-jdk9] [INFO] 
[linux-jdk9] [INFO] --- maven-surefire-plugin:2.21.0:test (default-test) @ doxia-module-apt
---
[linux-jdk9] [INFO] 
[linux-jdk9] [INFO] -------------------------------------------------------
[linux-jdk9] [INFO]  T E S T S
[linux-jdk9] [INFO] -------------------------------------------------------
[linux-jdk9] [INFO] Running org.apache.maven.doxia.module.apt.AptParserTest
[linux-jdk9] [warn] [APT Parser] Modified invalid link: 'Anchor with spaces (and brackets)'
to '#Anchor_with_spaces_and_brackets'
[linux-jdk9] [INFO] Tests run: 19, Failures: 0, Errors: 0, Skipped: 0, Time elapsed: 0.466
s - in org.apache.maven.doxia.module.apt.AptParserTest
[linux-jdk9] [INFO] Running org.apache.maven.doxia.module.apt.AptIdentityTest
[linux-jdk9] [INFO] Tests run: 1, Failures: 0, Errors: 0, Skipped: 0, Time elapsed: 0.008
s - in org.apache.maven.doxia.module.apt.AptIdentityTest
[linux-jdk9] [INFO] Running org.apache.maven.doxia.module.apt.AptSinkTest
[linux-jdk9] [INFO] Tests run: 32, Failures: 0, Errors: 0, Skipped: 0, Time elapsed: 0.104
s - in org.apache.maven.doxia.module.apt.AptSinkTest
[linux-jdk9] [INFO] Running org.apache.maven.doxia.module.apt.AptUtilsTest
[linux-jdk9] [INFO] Tests run: 6, Failures: 0, Errors: 0, Skipped: 0, Time elapsed: 0.001
s - in org.apache.maven.doxia.module.apt.AptUtilsTest
[linux-jdk9] [INFO] 
[linux-jdk9] [INFO] Results:
[linux-jdk9] [INFO] 
[linux-jdk9] [INFO] Tests run: 58, Failures: 0, Errors: 0, Skipped: 0
[linux-jdk9] [INFO] 
[linux-jdk9] [INFO] 
[linux-jdk9] [INFO] --- maven-jar-plugin:3.0.2:jar (default-jar) @ doxia-module-apt ---
[linux-jdk9] [INFO] Building jar: /home/jenkins/jenkins-slave/workspace/n-box_maven-doxia_DOXIA-572-5R4NBZTF6OOVPHGZS5FHJPBGRCYJ7S7J6B5UOTIUNEFPJ4N4ZRYQ/m/doxia-modules/doxia-module-apt/target/doxia-module-apt-1.9-SNAPSHOT.jar
[linux-jdk9] [INFO] 
[linux-jdk9] [INFO] --- maven-site-plugin:3.7:attach-descriptor (attach-descriptor) @ doxia-module-apt
---
[linux-jdk9] [INFO] Skipping because packaging 'jar' is not pom.
[linux-jdk9] [INFO] 
[linux-jdk9] [INFO] --- maven-checkstyle-plugin:3.0.0:check (checkstyle-check) @ doxia-module-apt
---
[windows-jdk8] Sending interrupt signal to process
[windows-jdk10] Sending interrupt signal to process
[windows-jdk9] Sending interrupt signal to process
[Pipeline] [linux-jdk7] // stage
[Pipeline] [linux-jdk7] }
[Pipeline] [windows-jdk7] }
[Pipeline] [linux-jdk9] }
[Pipeline] [linux-jdk7] // node
[Pipeline] [windows-jdk7] // dir
[Pipeline] [linux-jdk9] // dir
[Pipeline] [linux-jdk7] }
[Pipeline] [windows-jdk7] }
[windows-jdk7] [withMaven] One or multiple Maven executions have been ignored by the Jenkins
Pipeline Maven Plugin because they have been interrupted before completion (1). See Pipeline
Maven Plugin FAQ for more details.
[Pipeline] [linux-jdk9] }
[linux-jdk9] [withMaven] One or multiple Maven executions have been ignored by the Jenkins
Pipeline Maven Plugin because they have been interrupted before completion (1). See Pipeline
Maven Plugin FAQ for more details.
[Pipeline] [windows-jdk7] // withMaven
[Pipeline] [linux-jdk9] // withMaven
[Pipeline] [windows-jdk7] echo
[windows-jdk7] [FAIL FAST] linux-jdk8 had first failure, ignoring script returned exit code
-1
[Pipeline] [windows-jdk7] }
[Pipeline] [linux-jdk9] echo
[linux-jdk9] [FAIL FAST] linux-jdk8 had first failure, ignoring script returned exit code
143
[Pipeline] [linux-jdk9] }
[Pipeline] [windows-jdk7] // stage
[linux-jdk10] Terminated
[Pipeline] [linux-jdk9] // stage
[Pipeline] [linux-jdk9] }
[Pipeline] [windows-jdk7] }
[Pipeline] [linux-jdk9] // node
[Pipeline] [windows-jdk7] // node
[Pipeline] [linux-jdk9] }
[Pipeline] [windows-jdk7] }
[Pipeline] [linux-jdk10] }
[Pipeline] [linux-jdk10] // dir
[Pipeline] [linux-jdk10] }
[linux-jdk10] [withMaven] One or multiple Maven executions have been ignored by the Jenkins
Pipeline Maven Plugin because they have been interrupted before completion (1). See Pipeline
Maven Plugin FAQ for more details.
[Pipeline] [linux-jdk10] // withMaven
[Pipeline] [linux-jdk10] echo
[linux-jdk10] [FAIL FAST] linux-jdk8 had first failure, ignoring script returned exit code
143
[Pipeline] [linux-jdk10] }
[Pipeline] [linux-jdk10] // stage
[Pipeline] [linux-jdk10] }
[Pipeline] [linux-jdk10] // node
[Pipeline] [linux-jdk10] }
[windows-jdk8] [INFO] 
[windows-jdk8] [INFO] Results:
[windows-jdk8] [INFO] 
[windows-jdk8] [INFO] Tests run: 160, Failures: 0, Errors: 0, Skipped: 0
[windows-jdk8] [INFO] 
[windows-jdk8] [ERROR] There are test failures.
[windows-jdk8] 
[windows-jdk8] Please refer to F:\jenkins\jenkins-slave\workspace\n-box_maven-doxia_DOXIA-572-5R4NBZTF6OOVPHGZS5FHJPBGRCYJ7S7J6B5UOTIUNEFPJ4N4ZRYQ\m\doxia-core\target\surefire-reports
for the individual test results.
[windows-jdk8] Please refer to dump files (if any exist) [date]-jvmRun[N].dump, [date].dumpstream
and [date]-jvmRun[N].dumpstream.
[windows-jdk8] The forked VM terminated without properly saying goodbye. VM crash or System.exit
called?
[windows-jdk8] Command was cmd.exe /X /C "f:\jenkins\tools\java\latest1.8\jre\bin\java -jar
C:\Users\jenkins\AppData\Local\Temp\1\surefire1159416320753427412\surefirebooter1255803753948404101.jar
C:\Users\jenkins\AppData\Local\Temp\1\surefire1159416320753427412 2018-04-07T17-25-32_243-jvmRun1
surefire8983029077587325154tmp surefire_09113839238333231459tmp"
[windows-jdk8] Error occurred in starting fork, check output in log
[windows-jdk8] Process Exit Code: -1
[windows-jdk8] Crashed tests:
[windows-jdk8] org.apache.maven.doxia.util.XmlValidatorTest
[windows-jdk8] org.apache.maven.surefire.booter.SurefireBooterForkException: The forked VM
terminated without properly saying goodbye. VM crash or System.exit called?
[windows-jdk8] Command was cmd.exe /X /C "f:\jenkins\tools\java\latest1.8\jre\bin\java -jar
C:\Users\jenkins\AppData\Local\Temp\1\surefire1159416320753427412\surefirebooter1255803753948404101.jar
C:\Users\jenkins\AppData\Local\Temp\1\surefire1159416320753427412 2018-04-07T17-25-32_243-jvmRun1
surefire8983029077587325154tmp surefire_09113839238333231459tmp"
[windows-jdk8] Error occurred in starting fork, check output in log
[windows-jdk8] Process Exit Code: -1
[windows-jdk8] Crashed tests:
[windows-jdk8] org.apache.maven.doxia.util.XmlValidatorTest
[windows-jdk8] 	at org.apache.maven.plugin.surefire.booterclient.ForkStarter.fork(ForkStarter.java:671)
[windows-jdk8] 	at org.apache.maven.plugin.surefire.booterclient.ForkStarter.fork(ForkStarter.java:533)
[windows-jdk8] 	at org.apache.maven.plugin.surefire.booterclient.ForkStarter.run(ForkStarter.java:278)
[windows-jdk8] 	at org.apache.maven.plugin.surefire.booterclient.ForkStarter.run(ForkStarter.java:244)
[windows-jdk8] 	at org.apache.maven.plugin.surefire.AbstractSurefireMojo.executeProvider(AbstractSurefireMojo.java:1149)
[windows-jdk8] 	at org.apache.maven.plugin.surefire.AbstractSurefireMojo.executeAfterPreconditionsChecked(AbstractSurefireMojo.java:978)
[windows-jdk8] 	at org.apache.maven.plugin.surefire.AbstractSurefireMojo.execute(AbstractSurefireMojo.java:854)
[windows-jdk8] 	at org.apache.maven.plugin.DefaultBuildPluginManager.executeMojo(DefaultBuildPluginManager.java:134)
[windows-jdk8] 	at org.apache.maven.lifecycle.internal.MojoExecutor.execute(MojoExecutor.java:208)
[windows-jdk8] 	at org.apache.maven.lifecycle.internal.MojoExecutor.execute(MojoExecutor.java:154)
[windows-jdk8] 	at org.apache.maven.lifecycle.internal.MojoExecutor.execute(MojoExecutor.java:146)
[windows-jdk8] 	at org.apache.maven.lifecycle.internal.LifecycleModuleBuilder.buildProject(LifecycleModuleBuilder.java:117)
[windows-jdk8] 	at org.apache.maven.lifecycle.internal.LifecycleModuleBuilder.buildProject(LifecycleModuleBuilder.java:81)
[windows-jdk8] 	at org.apache.maven.lifecycle.internal.builder.singlethreaded.SingleThreadedBuilder.build(SingleThreadedBuilder.java:51)
[windows-jdk8] 	at org.apache.maven.lifecycle.internal.LifecycleStarter.execute(LifecycleStarter.java:128)
[windows-jdk8] 	at org.apache.maven.DefaultMaven.doExecute(DefaultMaven.java:309)
[windows-jdk8] 	at org.apache.maven.DefaultMaven.doExecute(DefaultMaven.java:194)
[windows-jdk8] 	at org.apache.maven.DefaultMaven.execute(DefaultMaven.java:107)
[windows-jdk8] 	at org.apache.maven.cli.MavenCli.execute(MavenCli.java:993)
[windows-jdk8] 	at org.apache.maven.cli.MavenCli.doMain(MavenCli.java:345)
[windows-jdk8] 	at org.apache.maven.cli.MavenCli.main(MavenCli.java:191)
[windows-jdk8] 	at sun.reflect.NativeMethodAccessorImpl.invoke0(Native Method)
[windows-jdk8] 	at sun.reflect.NativeMethodAccessorImpl.invoke(NativeMethodAccessorImpl.java:62)
[windows-jdk8] 	at sun.reflect.DelegatingMethodAccessorImpl.invoke(DelegatingMethodAccessorImpl.java:43)
[windows-jdk8] 	at java.lang.reflect.Method.invoke(Method.java:498)
[windows-jdk8] 	at org.codehaus.plexus.classworlds.launcher.Launcher.launchEnhanced(Launcher.java:289)
[windows-jdk8] 	at org.codehaus.plexus.classworlds.launcher.Launcher.launch(Launcher.java:229)
[windows-jdk8] 	at org.codehaus.plexus.classworlds.launcher.Launcher.mainWithExitCode(Launcher.java:415)
[windows-jdk8] 	at org.codehaus.plexus.classworlds.launcher.Launcher.main(Launcher.java:356)
[windows-jdk8] 
[windows-jdk8] [INFO] 
[windows-jdk8] [INFO] --- maven-jar-plugin:3.0.2:jar (default-jar) @ doxia-core ---
[windows-jdk8] [INFO] Building jar: F:\jenkins\jenkins-slave\workspace\n-box_maven-doxia_DOXIA-572-5R4NBZTF6OOVPHGZS5FHJPBGRCYJ7S7J6B5UOTIUNEFPJ4N4ZRYQ\m\doxia-core\target\doxia-core-1.9-SNAPSHOT.jar
[windows-jdk8] [INFO] 
[windows-jdk8] [INFO] --- maven-site-plugin:3.7:attach-descriptor (attach-descriptor) @ doxia-core
---
[windows-jdk8] [INFO] Skipping because packaging 'jar' is not pom.
[windows-jdk8] [INFO] 
[windows-jdk8] [INFO] --- maven-jar-plugin:3.0.2:test-jar (default) @ doxia-core ---
[windows-jdk8] [INFO] Building jar: F:\jenkins\jenkins-slave\workspace\n-box_maven-doxia_DOXIA-572-5R4NBZTF6OOVPHGZS5FHJPBGRCYJ7S7J6B5UOTIUNEFPJ4N4ZRYQ\m\doxia-core\target\doxia-core-1.9-SNAPSHOT-tests.jar
[windows-jdk8] [INFO] 
[windows-jdk8] [INFO] --- maven-checkstyle-plugin:3.0.0:check (checkstyle-check) @ doxia-core
---
[Pipeline] [windows-jdk10] }
[Pipeline] [windows-jdk10] // dir
[Pipeline] [windows-jdk10] }
[windows-jdk10] [withMaven] One or multiple Maven executions have been ignored by the Jenkins
Pipeline Maven Plugin because they have been interrupted before completion (1). See Pipeline
Maven Plugin FAQ for more details.
[Pipeline] [windows-jdk10] // withMaven
[Pipeline] [windows-jdk8] }
[Pipeline] [windows-jdk10] echo
[windows-jdk10] [FAIL FAST] linux-jdk8 had first failure, ignoring script returned exit code
-1
[Pipeline] [windows-jdk10] }
[Pipeline] [windows-jdk8] // dir
[Pipeline] [windows-jdk10] // stage
[Pipeline] [windows-jdk10] }
[Pipeline] [windows-jdk8] }
[windows-jdk8] [withMaven] One or multiple Maven executions have been ignored by the Jenkins
Pipeline Maven Plugin because they have been interrupted before completion (1). See Pipeline
Maven Plugin FAQ for more details.
[Pipeline] [windows-jdk10] // node
[Pipeline] [windows-jdk8] // withMaven
[Pipeline] [windows-jdk10] }
[Pipeline] [windows-jdk8] echo
[windows-jdk8] [FAIL FAST] linux-jdk8 had first failure, ignoring script returned exit code
-1
[Pipeline] [windows-jdk8] }
[Pipeline] [windows-jdk8] // stage
[Pipeline] [windows-jdk8] }
[Pipeline] [windows-jdk8] // node
[Pipeline] [windows-jdk8] }
[windows-jdk9] After 10s process did not stop
[Pipeline] [windows-jdk9] }
[Pipeline] [windows-jdk9] // dir
[Pipeline] [windows-jdk9] }
[windows-jdk9] [withMaven] One or multiple Maven executions have been ignored by the Jenkins
Pipeline Maven Plugin because they have been interrupted before completion (1). See Pipeline
Maven Plugin FAQ for more details.
[Pipeline] [windows-jdk9] // withMaven
[Pipeline] [windows-jdk9] echo
[windows-jdk9] [FAIL FAST] linux-jdk8 had first failure, ignoring null
[Pipeline] [windows-jdk9] }
[Pipeline] [windows-jdk9] // stage
[Pipeline] [windows-jdk9] }
[Pipeline] [windows-jdk9] // node
[Pipeline] [windows-jdk9] }
[Pipeline] // parallel
[Pipeline] echo
***** FAST FAILURE *****

Fast failure triggered by linux-jdk8

***** FAST FAILURE *****
[Pipeline] stage
[Pipeline] { (Notifications)
[Pipeline] echo
Build result: FAILURE
[Pipeline] jiraIssueSelector
[Pipeline] emailext
Mime
  • Unnamed multipart/mixed (inline, None, 0 bytes)
View raw message